{
  "status": "success",
  "data": {
    "resultType": "vector",
    "result": [
      {
        "metric": {
          "__name__": "delivery_release_patch_status",
          "release_date": "2024-05-16",
          "version": "17.0 16.11 16.10"
        },
        "value": [
          1598279560.706,
          "1"
        ]
      }
    ]
  }
}
