module gitlab.com/gitlab-org/gitaly/tools/vulncheck

go 1.21

require golang.org/x/vuln v1.1.1

require (
	golang.org/x/mod v0.17.0 // indirect
	golang.org/x/sync v0.7.0 // indirect
	golang.org/x/tools v0.21.1-0.20240514024235-59d9797072e7 // indirect
)
