<svg width="13" height="23" viewBox="0 0 13 23" fill="none" xmlns="http://www.w3.org/2000/svg">
<path d="M12.677 22.6811C13.0685 22.2946 13.1041 21.6898 12.7837 21.2636L12.677 21.1415L3.16324 11.75L12.677 2.35854C13.0685 1.97203 13.1041 1.36719 12.7837 0.940983L12.677 0.818876C12.2854 0.43236 11.6726 0.397221 11.2409 0.713461L11.1172 0.818876L0.823045 10.9802C0.431477 11.3667 0.395879 11.9715 0.716253 12.3977L0.823045 12.5198L11.1172 22.6811C11.5479 23.1063 12.2462 23.1063 12.677 22.6811Z" fill="#BFBFBF"/>
</svg>
