<svg width="47" height="47" viewBox="0 0 47 47" fill="none" xmlns="http://www.w3.org/2000/svg">
<mask id="path-1-outside-1_877_1661" maskUnits="userSpaceOnUse" x="0" y="0" width="47" height="47" fill="black">
<rect fill="white" width="47" height="47"/>
<path d="M23.5 1C11.0843 1 1 11.0843 1 23.5C1 35.9157 11.0843 46 23.5 46C35.9157 46 46 35.9157 46 23.5C46 11.0843 35.9157 1 23.5 1ZM23.5 44.0482C12.1687 44.0482 2.95181 34.8313 2.95181 23.5C2.95181 12.1687 12.1687 2.95181 23.5 2.95181C34.8313 2.95181 44.0482 12.1687 44.0482 23.5C44.0482 34.8313 34.8313 44.0482 23.5 44.0482Z"/>
<path d="M35.2108 18.6204H28.3794V11.7891C28.3794 11.2469 27.9457 10.8132 27.4035 10.8132H19.5963C19.0541 10.8132 18.6204 11.2469 18.6204 11.7891V18.6204H11.7891C11.2469 18.6204 10.8132 19.0541 10.8132 19.5963V27.4035C10.8132 27.9457 11.2469 28.3794 11.7891 28.3794H18.6204V35.2108C18.6204 35.7529 19.0541 36.1867 19.5963 36.1867H27.4035C27.9457 36.1867 28.3794 35.7529 28.3794 35.2108V28.3794H35.2108C35.7529 28.3794 36.1867 27.9457 36.1867 27.4035V19.5963C36.1325 19.0541 35.6987 18.6204 35.2108 18.6204ZM34.2891 26.4276H27.4035C26.8614 26.4276 26.4276 26.8614 26.4276 27.4035V34.2349H20.5722V27.4035C20.5722 26.8614 20.1385 26.4276 19.5963 26.4276H12.765V20.5722H19.5963C20.1385 20.5722 20.5722 20.1385 20.5722 19.5963V12.765H26.4819V19.5963C26.4819 20.1385 26.9156 20.5722 27.4578 20.5722H34.2891V26.4276Z"/>
</mask>
<path d="M28.3794 18.6204H27.3794V19.6204H28.3794V18.6204ZM18.6204 18.6204V19.6204H19.6204V18.6204H18.6204ZM18.6204 28.3794H19.6204V27.3794H18.6204V28.3794ZM28.3794 28.3794V27.3794H27.3794V28.3794H28.3794ZM36.1867 19.5963H37.1867V19.5464L37.1817 19.4968L36.1867 19.5963ZM34.2891 26.4276V27.4276H35.2891V26.4276H34.2891ZM26.4276 34.2349V35.2349H27.4276V34.2349H26.4276ZM20.5722 34.2349H19.5722V35.2349H20.5722V34.2349ZM12.765 26.4276H11.765V27.4276H12.765V26.4276ZM12.765 20.5722V19.5722H11.765V20.5722H12.765ZM20.5722 12.765V11.765H19.5722V12.765H20.5722ZM26.4819 12.765H27.4819V11.765H26.4819V12.765ZM34.2891 20.5722H35.2891V19.5722H34.2891V20.5722ZM23.5 0C10.5321 0 0 10.5321 0 23.5H2C2 11.6366 11.6366 2 23.5 2V0ZM0 23.5C0 36.4679 10.5321 47 23.5 47V45C11.6366 45 2 35.3634 2 23.5H0ZM23.5 47C36.4679 47 47 36.4679 47 23.5H45C45 35.3634 35.3634 45 23.5 45V47ZM47 23.5C47 10.5321 36.4679 0 23.5 0V2C35.3634 2 45 11.6366 45 23.5H47ZM23.5 43.0482C12.721 43.0482 3.95181 34.279 3.95181 23.5H1.95181C1.95181 35.3836 11.6164 45.0482 23.5 45.0482V43.0482ZM3.95181 23.5C3.95181 12.721 12.721 3.95181 23.5 3.95181V1.95181C11.6164 1.95181 1.95181 11.6164 1.95181 23.5H3.95181ZM23.5 3.95181C34.279 3.95181 43.0482 12.721 43.0482 23.5H45.0482C45.0482 11.6164 35.3836 1.95181 23.5 1.95181V3.95181ZM43.0482 23.5C43.0482 34.279 34.279 43.0482 23.5 43.0482V45.0482C35.3836 45.0482 45.0482 35.3836 45.0482 23.5H43.0482ZM35.2108 17.6204H28.3794V19.6204H35.2108V17.6204ZM29.3794 18.6204V11.7891H27.3794V18.6204H29.3794ZM29.3794 11.7891C29.3794 10.6946 28.498 9.81318 27.4035 9.81318V11.8132C27.4046 11.8132 27.4018 11.8132 27.3973 11.8113C27.3934 11.8097 27.3902 11.8074 27.3877 11.8049C27.3852 11.8024 27.3829 11.7992 27.3813 11.7953C27.3794 11.7908 27.3794 11.788 27.3794 11.7891H29.3794ZM27.4035 9.81318H19.5963V11.8132H27.4035V9.81318ZM19.5963 9.81318C18.5019 9.81318 17.6204 10.6946 17.6204 11.7891H19.6204C19.6204 11.788 19.6204 11.7908 19.6185 11.7953C19.6169 11.7992 19.6147 11.8024 19.6122 11.8049C19.6097 11.8074 19.6064 11.8097 19.6026 11.8113C19.5981 11.8132 19.5952 11.8132 19.5963 11.8132V9.81318ZM17.6204 11.7891V18.6204H19.6204V11.7891H17.6204ZM18.6204 17.6204H11.7891V19.6204H18.6204V17.6204ZM11.7891 17.6204C10.6946 17.6204 9.81318 18.5019 9.81318 19.5963H11.8132C11.8132 19.5952 11.8132 19.5981 11.8113 19.6026C11.8097 19.6064 11.8074 19.6097 11.8049 19.6122C11.8024 19.6147 11.7992 19.6169 11.7953 19.6185C11.7908 19.6204 11.788 19.6204 11.7891 19.6204V17.6204ZM9.81318 19.5963V27.4035H11.8132V19.5963H9.81318ZM9.81318 27.4035C9.81318 28.498 10.6946 29.3794 11.7891 29.3794V27.3794C11.788 27.3794 11.7908 27.3794 11.7953 27.3813C11.7992 27.3829 11.8024 27.3852 11.8049 27.3877C11.8074 27.3902 11.8097 27.3934 11.8113 27.3973C11.8132 27.4018 11.8132 27.4046 11.8132 27.4035H9.81318ZM11.7891 29.3794H18.6204V27.3794H11.7891V29.3794ZM17.6204 28.3794V35.2108H19.6204V28.3794H17.6204ZM17.6204 35.2108C17.6204 36.3052 18.5019 37.1867 19.5963 37.1867V35.1867C19.5952 35.1867 19.5981 35.1867 19.6026 35.1885C19.6064 35.1902 19.6097 35.1924 19.6122 35.1949C19.6147 35.1974 19.6169 35.2006 19.6185 35.2045C19.6204 35.209 19.6204 35.2119 19.6204 35.2108H17.6204ZM19.5963 37.1867H27.4035V35.1867H19.5963V37.1867ZM27.4035 37.1867C28.498 37.1867 29.3794 36.3052 29.3794 35.2108H27.3794C27.3794 35.2119 27.3794 35.209 27.3813 35.2045C27.3829 35.2006 27.3852 35.1974 27.3877 35.1949C27.3902 35.1924 27.3934 35.1902 27.3973 35.1885C27.4018 35.1867 27.4046 35.1867 27.4035 35.1867V37.1867ZM29.3794 35.2108V28.3794H27.3794V35.2108H29.3794ZM28.3794 29.3794H35.2108V27.3794H28.3794V29.3794ZM35.2108 29.3794C36.3052 29.3794 37.1867 28.498 37.1867 27.4035H35.1867C35.1867 27.4046 35.1867 27.4018 35.1885 27.3973C35.1902 27.3934 35.1924 27.3902 35.1949 27.3877C35.1974 27.3852 35.2006 27.3829 35.2045 27.3813C35.209 27.3794 35.2119 27.3794 35.2108 27.3794V29.3794ZM37.1867 27.4035V19.5963H35.1867V27.4035H37.1867ZM37.1817 19.4968C37.0855 18.535 36.2996 17.6204 35.2108 17.6204V19.6204C35.1831 19.6204 35.1634 19.614 35.154 19.6099C35.1456 19.6061 35.1471 19.605 35.1543 19.6122C35.1613 19.6192 35.1703 19.6308 35.1778 19.6466C35.1851 19.6619 35.1899 19.6786 35.1916 19.6958L37.1817 19.4968ZM27.4035 25.4276C26.3091 25.4276 25.4276 26.3091 25.4276 27.4035H27.4276C27.4276 27.4024 27.4277 27.4053 27.4258 27.4098C27.4241 27.4137 27.4219 27.4169 27.4194 27.4194C27.4169 27.4219 27.4137 27.4241 27.4098 27.4258C27.4053 27.4277 27.4024 27.4276 27.4035 27.4276V25.4276ZM25.4276 27.4035V34.2349H27.4276V27.4035H25.4276ZM26.4276 33.2349H20.5722V35.2349H26.4276V33.2349ZM21.5722 34.2349V27.4035H19.5722V34.2349H21.5722ZM21.5722 27.4035C21.5722 26.3091 20.6908 25.4276 19.5963 25.4276V27.4276C19.5974 27.4276 19.5946 27.4277 19.5901 27.4258C19.5862 27.4241 19.583 27.4219 19.5805 27.4194C19.578 27.4169 19.5757 27.4137 19.5741 27.4098C19.5722 27.4053 19.5722 27.4024 19.5722 27.4035H21.5722ZM19.5963 25.4276H12.765V27.4276H19.5963V25.4276ZM13.765 26.4276V20.5722H11.765V26.4276H13.765ZM12.765 21.5722H19.5963V19.5722H12.765V21.5722ZM19.5963 21.5722C20.6908 21.5722 21.5722 20.6908 21.5722 19.5963H19.5722C19.5722 19.5974 19.5722 19.5946 19.5741 19.5901C19.5757 19.5862 19.578 19.583 19.5805 19.5805C19.583 19.578 19.5862 19.5757 19.5901 19.5741C19.5946 19.5722 19.5974 19.5722 19.5963 19.5722V21.5722ZM21.5722 19.5963V12.765H19.5722V19.5963H21.5722ZM20.5722 13.765H26.4819V11.765H20.5722V13.765ZM25.4819 12.765V19.5963H27.4819V12.765H25.4819ZM25.4819 19.5963C25.4819 20.6908 26.3633 21.5722 27.4578 21.5722V19.5722C27.4567 19.5722 27.4595 19.5722 27.464 19.5741C27.4679 19.5757 27.4711 19.578 27.4736 19.5805C27.4761 19.583 27.4784 19.5862 27.48 19.5901C27.4819 19.5946 27.4819 19.5974 27.4819 19.5963H25.4819ZM27.4578 21.5722H34.2891V19.5722H27.4578V21.5722ZM33.2891 20.5722V26.4276H35.2891V20.5722H33.2891ZM34.2891 25.4276H27.4035V27.4276H34.2891V25.4276Z" fill="#EA5252" mask="url(#path-1-outside-1_877_1661)"/>
</svg>
