<svg width="221" height="264" viewBox="0 0 221 264" fill="none" xmlns="http://www.w3.org/2000/svg">
<g filter="url(#filter0_d_479_881)">
<rect x="15" y="16" width="191" height="234" rx="15" fill="white"/>
<rect x="95" y="29" width="31" height="5" rx="2.5" fill="#EDEDED"/>
<rect x="28" y="83" width="165" height="1" fill="#EEEEEE"/>
<rect x="28" y="116" width="165" height="1" fill="#EEEEEE"/>
<rect x="28" y="149" width="165" height="1" fill="#EEEEEE"/>
<rect x="28" y="182" width="165" height="1" fill="#EEEEEE"/>
<rect x="47" y="84" width="3" height="99" fill="#7575CA"/>
<rect x="47" y="84" width="3" height="59" fill="#F16393"/>
<rect x="47" y="66" width="3" height="18" fill="#FCC02A"/>
<rect x="109" y="84" width="3" height="99" fill="#7575CA"/>
<rect x="109" y="84" width="3" height="38" fill="#F16393"/>
<rect x="109" y="56" width="3" height="28" fill="#FCC02A"/>
<rect x="171" y="104" width="3" height="79" fill="#7575CA"/>
<rect x="171" y="104" width="3" height="24" fill="#FCC02A"/>
<rect x="78" y="107" width="3" height="76" fill="#7575CA"/>
<rect x="78" y="107" width="3" height="48" fill="#F16393"/>
<rect x="78" y="98" width="3" height="9" fill="#FCC02A"/>
<rect x="140" y="131.035" width="3" height="50.9647" fill="#7575CA"/>
<rect x="140" y="131.035" width="3" height="32.1882" fill="#F16393"/>
<rect x="140" y="125" width="3" height="6.03529" fill="#FCC02A"/>
<path d="M56.3882 208.266H55.1758V206H48.5425V208.272H47.3237L47.3174 205.003H48.0728C48.4705 204.555 48.7858 203.954 49.0186 203.201C49.2555 202.443 49.4036 201.614 49.4629 200.712L49.666 196.758H55.1948V205.003H56.4009L56.3882 208.266ZM49.4629 205.003H53.9697V197.761H50.8403L50.707 200.478C50.652 201.54 50.5103 202.445 50.2817 203.194C50.0575 203.943 49.7845 204.546 49.4629 205.003ZM60.5142 206.127C59.5832 206.127 58.8257 205.822 58.2417 205.213C57.6577 204.599 57.3657 203.78 57.3657 202.756V202.541C57.3657 201.859 57.4948 201.252 57.7529 200.719C58.0153 200.181 58.3792 199.762 58.8447 199.462C59.3145 199.157 59.8223 199.005 60.3682 199.005C61.2611 199.005 61.9551 199.299 62.4502 199.887C62.9453 200.475 63.1929 201.318 63.1929 202.414V202.902H58.54C58.557 203.579 58.7537 204.127 59.1304 204.546C59.5112 204.961 59.9937 205.168 60.5776 205.168C60.9924 205.168 61.3436 205.084 61.6313 204.915C61.9191 204.745 62.1709 204.521 62.3867 204.242L63.104 204.8C62.5285 205.685 61.6652 206.127 60.5142 206.127ZM60.3682 199.97C59.8942 199.97 59.4964 200.143 59.1748 200.49C58.8532 200.833 58.6543 201.315 58.5781 201.938H62.0186V201.849C61.9847 201.252 61.8239 200.791 61.5361 200.465C61.2484 200.135 60.859 199.97 60.3682 199.97ZM66.6968 203.074H65.8398V206H64.6592V199.132H65.8398V202.039H66.6079L68.9185 199.132H70.3403L67.6235 202.433L70.5688 206H69.0771L66.6968 203.074ZM75.8184 206C75.7507 205.865 75.6956 205.623 75.6533 205.276C75.1074 205.843 74.4557 206.127 73.6982 206.127C73.0212 206.127 72.4647 205.937 72.0288 205.556C71.5972 205.171 71.3813 204.684 71.3813 204.096C71.3813 203.381 71.6522 202.826 72.1938 202.433C72.7397 202.035 73.5057 201.836 74.4917 201.836H75.6343V201.296C75.6343 200.886 75.5116 200.56 75.2661 200.319C75.0207 200.073 74.6589 199.951 74.1807 199.951C73.7617 199.951 73.4105 200.056 73.127 200.268C72.8434 200.48 72.7017 200.736 72.7017 201.036H71.521C71.521 200.693 71.6416 200.363 71.8828 200.046C72.1283 199.724 72.4583 199.47 72.873 199.284C73.292 199.098 73.7511 199.005 74.2505 199.005C75.0418 199.005 75.6618 199.204 76.1104 199.602C76.5589 199.995 76.7917 200.539 76.8086 201.233V204.394C76.8086 205.025 76.889 205.526 77.0498 205.898V206H75.8184ZM73.8696 205.105C74.2378 205.105 74.5869 205.01 74.917 204.819C75.2471 204.629 75.4862 204.381 75.6343 204.077V202.667H74.7139C73.2751 202.667 72.5557 203.089 72.5557 203.931C72.5557 204.299 72.6784 204.587 72.9238 204.794C73.1693 205.001 73.4845 205.105 73.8696 205.105ZM81.6646 199.525C82.5278 199.525 83.2176 199.815 83.7339 200.395C84.2544 200.971 84.5146 201.73 84.5146 202.674V202.782C84.5146 203.429 84.3898 204.009 84.1401 204.521C83.8905 205.029 83.5308 205.424 83.061 205.708C82.5955 205.987 82.0581 206.127 81.4487 206.127C80.5262 206.127 79.7835 205.82 79.2207 205.207C78.6579 204.589 78.3765 203.761 78.3765 202.725V202.153C78.3765 200.71 78.6431 199.563 79.1763 198.713C79.7137 197.862 80.505 197.344 81.5503 197.158C82.1427 197.052 82.5426 196.923 82.75 196.771C82.9574 196.618 83.061 196.409 83.061 196.142H84.0259C84.0259 196.671 83.9053 197.084 83.6641 197.38C83.4271 197.676 83.0462 197.886 82.5215 198.008L81.6455 198.205C80.9473 198.37 80.4225 198.649 80.0713 199.043C79.7243 199.432 79.4979 199.953 79.3921 200.604C80.0142 199.885 80.7716 199.525 81.6646 199.525ZM81.436 200.49C80.8605 200.49 80.4035 200.685 80.0649 201.074C79.7264 201.459 79.5571 201.995 79.5571 202.68V202.782C79.5571 203.518 79.7264 204.102 80.0649 204.534C80.4077 204.961 80.869 205.175 81.4487 205.175C82.0327 205.175 82.494 204.959 82.8325 204.527C83.1711 204.096 83.3403 203.465 83.3403 202.636C83.3403 201.988 83.1689 201.47 82.8262 201.081C82.4876 200.687 82.0243 200.49 81.436 200.49ZM91.5225 202.642C91.5225 203.687 91.2834 204.529 90.8052 205.168C90.327 205.807 89.6795 206.127 88.8628 206.127C88.0291 206.127 87.3732 205.862 86.895 205.333V208.641H85.7207V199.132H86.7935L86.8506 199.894C87.3288 199.301 87.9932 199.005 88.8438 199.005C89.6689 199.005 90.3206 199.316 90.7988 199.938C91.2812 200.56 91.5225 201.425 91.5225 202.534V202.642ZM90.3481 202.509C90.3481 201.734 90.1831 201.123 89.853 200.674C89.5229 200.226 89.0701 200.001 88.4946 200.001C87.7837 200.001 87.2505 200.317 86.895 200.947V204.229C87.2463 204.855 87.7837 205.168 88.5073 205.168C89.0701 205.168 89.5166 204.946 89.8467 204.502C90.181 204.053 90.3481 203.389 90.3481 202.509ZM94.3027 201.5H96.0864C96.8651 201.508 97.4808 201.711 97.9336 202.109C98.3864 202.507 98.6128 203.046 98.6128 203.728C98.6128 204.413 98.38 204.963 97.9146 205.378C97.4491 205.793 96.8228 206 96.0356 206H93.1284V199.132H94.3027V201.5ZM94.3027 202.458V205.042H96.0483C96.4884 205.042 96.8291 204.929 97.0703 204.705C97.3115 204.477 97.4321 204.166 97.4321 203.772C97.4321 203.391 97.3136 203.08 97.0767 202.839C96.8439 202.593 96.516 202.466 96.0928 202.458H94.3027Z" fill="black"/>
<path d="M52.249 221H47.5908V220.351L50.0518 217.616C50.4163 217.203 50.667 216.868 50.8037 216.61C50.9437 216.35 51.0137 216.081 51.0137 215.805C51.0137 215.434 50.9014 215.129 50.6768 214.892C50.4521 214.654 50.1527 214.535 49.7783 214.535C49.3291 214.535 48.9792 214.664 48.7285 214.921C48.4811 215.175 48.3574 215.53 48.3574 215.985H47.4541C47.4541 215.331 47.6641 214.802 48.084 214.398C48.5072 213.995 49.0719 213.793 49.7783 213.793C50.4391 213.793 50.9616 213.967 51.3457 214.315C51.7298 214.66 51.9219 215.121 51.9219 215.697C51.9219 216.397 51.4759 217.23 50.584 218.197L48.6797 220.263H52.249V221ZM53.6211 217.436L53.9824 213.891H57.625V214.726H54.749L54.5342 216.664C54.8825 216.459 55.278 216.356 55.7207 216.356C56.3685 216.356 56.8828 216.571 57.2637 217.001C57.6445 217.427 57.835 218.005 57.835 218.734C57.835 219.467 57.6364 220.045 57.2393 220.468C56.8454 220.888 56.2936 221.098 55.584 221.098C54.9557 221.098 54.443 220.924 54.0459 220.575C53.6488 220.227 53.4225 219.745 53.3672 219.13H54.2217C54.277 219.537 54.4219 219.844 54.6562 220.053C54.8906 220.258 55.1999 220.36 55.584 220.36C56.0039 220.36 56.3327 220.217 56.5703 219.931C56.8112 219.644 56.9316 219.249 56.9316 218.744C56.9316 218.269 56.8014 217.888 56.541 217.602C56.2839 217.312 55.9404 217.167 55.5107 217.167C55.1169 217.167 54.8076 217.253 54.583 217.426L54.3438 217.621L53.6211 217.436ZM63.1328 215.746C63.1328 216.101 63.0384 216.417 62.8496 216.693C62.6641 216.97 62.4118 217.187 62.0928 217.343C62.4639 217.502 62.7568 217.735 62.9717 218.041C63.1898 218.347 63.2988 218.694 63.2988 219.081C63.2988 219.696 63.0905 220.186 62.6738 220.551C62.2604 220.915 61.7152 221.098 61.0381 221.098C60.3545 221.098 59.806 220.915 59.3926 220.551C58.9824 220.183 58.7773 219.693 58.7773 219.081C58.7773 218.697 58.8815 218.35 59.0898 218.041C59.3014 217.732 59.5928 217.497 59.9639 217.338C59.6481 217.182 59.3991 216.965 59.2168 216.688C59.0345 216.412 58.9434 216.098 58.9434 215.746C58.9434 215.147 59.1354 214.672 59.5195 214.32C59.9036 213.969 60.4098 213.793 61.0381 213.793C61.6631 213.793 62.1676 213.969 62.5518 214.32C62.9391 214.672 63.1328 215.147 63.1328 215.746ZM62.3955 219.062C62.3955 218.664 62.2686 218.34 62.0146 218.09C61.764 217.839 61.4352 217.714 61.0283 217.714C60.6214 217.714 60.2943 217.838 60.0469 218.085C59.8027 218.332 59.6807 218.658 59.6807 219.062C59.6807 219.465 59.7995 219.783 60.0371 220.014C60.278 220.245 60.6117 220.36 61.0381 220.36C61.4613 220.36 61.7933 220.245 62.0342 220.014C62.2751 219.779 62.3955 219.462 62.3955 219.062ZM61.0381 214.535C60.6833 214.535 60.3952 214.646 60.1738 214.867C59.9557 215.085 59.8467 215.383 59.8467 215.761C59.8467 216.122 59.9541 216.415 60.1689 216.64C60.387 216.861 60.6768 216.972 61.0381 216.972C61.3994 216.972 61.6875 216.861 61.9023 216.64C62.1204 216.415 62.2295 216.122 62.2295 215.761C62.2295 215.399 62.1172 215.105 61.8926 214.877C61.668 214.649 61.3831 214.535 61.0381 214.535ZM66.7705 218.31C66.7705 217.792 66.8714 217.326 67.0732 216.913C67.2783 216.5 67.5615 216.181 67.9229 215.956C68.2874 215.731 68.7025 215.619 69.168 215.619C69.8874 215.619 70.4684 215.868 70.9111 216.366C71.3571 216.864 71.5801 217.527 71.5801 218.354V218.417C71.5801 218.931 71.4808 219.394 71.2822 219.804C71.0869 220.211 70.8053 220.528 70.4375 220.756C70.0729 220.984 69.653 221.098 69.1777 221.098C68.4616 221.098 67.8805 220.849 67.4346 220.351C66.9919 219.853 66.7705 219.193 66.7705 218.373V218.31ZM67.6787 218.417C67.6787 219.003 67.8138 219.473 68.084 219.828C68.3574 220.183 68.722 220.36 69.1777 220.36C69.6367 220.36 70.0013 220.181 70.2715 219.823C70.5417 219.462 70.6768 218.957 70.6768 218.31C70.6768 217.73 70.5384 217.261 70.2617 216.903C69.9883 216.542 69.6237 216.361 69.168 216.361C68.722 216.361 68.3623 216.539 68.0889 216.894C67.8154 217.248 67.6787 217.756 67.6787 218.417ZM76.5312 216.449H74.7588V221H73.8555V216.449H72.1172V215.717H76.5312V216.449ZM79.0557 218.749H78.3965V221H77.4883V215.717H78.3965V217.953H78.9873L80.7646 215.717H81.8584L79.7686 218.256L82.0342 221H80.8867L79.0557 218.749ZM87.1416 215.717V221H86.2334V216.464H84.4365L84.3291 218.441C84.2705 219.35 84.1175 219.999 83.8701 220.39C83.626 220.78 83.237 220.984 82.7031 221H82.3418V220.204L82.6006 220.185C82.8936 220.152 83.1035 219.983 83.2305 219.677C83.3574 219.371 83.4388 218.804 83.4746 217.978L83.5723 215.717H87.1416ZM92.0098 215.717H92.9131V221H92.0098V217.147L89.5732 221H88.6699V215.717H89.5732V219.574L92.0098 215.717ZM96.0088 218.749H95.3496V221H94.4414V215.717H95.3496V217.953H95.9404L97.7178 215.717H98.8115L96.7217 218.256L98.9873 221H97.8398L96.0088 218.749ZM99.417 218.31C99.417 217.792 99.5179 217.326 99.7197 216.913C99.9248 216.5 100.208 216.181 100.569 215.956C100.934 215.731 101.349 215.619 101.814 215.619C102.534 215.619 103.115 215.868 103.558 216.366C104.004 216.864 104.227 217.527 104.227 218.354V218.417C104.227 218.931 104.127 219.394 103.929 219.804C103.733 220.211 103.452 220.528 103.084 220.756C102.719 220.984 102.299 221.098 101.824 221.098C101.108 221.098 100.527 220.849 100.081 220.351C99.6383 219.853 99.417 219.193 99.417 218.373V218.31ZM100.325 218.417C100.325 219.003 100.46 219.473 100.73 219.828C101.004 220.183 101.368 220.36 101.824 220.36C102.283 220.36 102.648 220.181 102.918 219.823C103.188 219.462 103.323 218.957 103.323 218.31C103.323 217.73 103.185 217.261 102.908 216.903C102.635 216.542 102.27 216.361 101.814 216.361C101.368 216.361 101.009 216.539 100.735 216.894C100.462 217.248 100.325 217.756 100.325 218.417ZM105.442 221V215.717H107.503C108.206 215.717 108.745 215.84 109.119 216.088C109.497 216.332 109.686 216.692 109.686 217.167C109.686 217.411 109.612 217.632 109.466 217.831C109.319 218.026 109.103 218.176 108.816 218.28C109.135 218.355 109.391 218.502 109.583 218.72C109.778 218.938 109.876 219.198 109.876 219.501C109.876 219.986 109.697 220.357 109.339 220.614C108.984 220.871 108.481 221 107.83 221H105.442ZM106.346 218.681V220.272H107.84C108.217 220.272 108.499 220.202 108.685 220.062C108.873 219.923 108.968 219.726 108.968 219.472C108.968 218.944 108.58 218.681 107.806 218.681H106.346ZM106.346 217.958H107.513C108.359 217.958 108.782 217.711 108.782 217.216C108.782 216.721 108.382 216.465 107.581 216.449H106.346V217.958Z" fill="#BCBCBC"/>
</g>
<defs>
<filter id="filter0_d_479_881" x="0" y="0" width="221" height="264" filterUnits="userSpaceOnUse" color-interpolation-filters="sRGB">
<feFlood flood-opacity="0" result="BackgroundImageFix"/>
<feColorMatrix in="SourceAlpha" type="matrix" values="0 0 0 0 0 0 0 0 0 0 0 0 0 0 0 0 0 0 127 0" result="hardAlpha"/>
<feOffset dy="-1"/>
<feGaussianBlur stdDeviation="7.5"/>
<feComposite in2="hardAlpha" operator="out"/>
<feColorMatrix type="matrix" values="0 0 0 0 0 0 0 0 0 0 0 0 0 0 0 0 0 0 0.1 0"/>
<feBlend mode="normal" in2="BackgroundImageFix" result="effect1_dropShadow_479_881"/>
<feBlend mode="normal" in="SourceGraphic" in2="effect1_dropShadow_479_881" result="shape"/>
</filter>
</defs>
</svg>
