<svg width="51" height="47" viewBox="0 0 51 47" fill="none" xmlns="http://www.w3.org/2000/svg">
<mask id="path-1-outside-1_878_1687" maskUnits="userSpaceOnUse" x="0" y="-1" width="51" height="48" fill="black">
<rect fill="white" y="-1" width="51" height="48"/>
<path d="M49.7356 13.0479C49.7243 13.0358 49.7126 13.024 49.7007 13.0126L39.5859 3.90351C39.4936 3.81826 39.3859 3.75214 39.2686 3.70866L31.9516 1.05875C31.4525 0.875112 30.9009 1.13633 30.7197 1.64207C30.687 1.73329 30.668 1.82888 30.6632 1.92582C30.6632 2.14015 30.3459 7.0795 25.4712 7.15744C20.5675 7.0795 20.2599 2.14015 20.2503 1.92582C20.2219 1.38853 19.769 0.97631 19.2388 1.00505C19.1477 1.01004 19.0576 1.02807 18.9715 1.05875L11.6641 3.73789C11.5468 3.78136 11.4391 3.84749 11.3468 3.93273L1.29925 13.0126C0.914295 13.3831 0.89867 13.9998 1.2644 14.3899C1.2757 14.4019 1.28735 14.4137 1.29925 14.4252L9.29886 22.6185V45.0258C9.29886 45.5638 9.72937 46 10.2604 46H40.7396C41.2706 46 41.7011 45.5638 41.7011 45.0258V22.6185L49.7007 14.4252C50.0857 14.0546 50.1013 13.4381 49.7356 13.0479ZM41.6723 19.8419V15.3215C41.6723 14.7835 41.2418 14.3473 40.7108 14.3473C40.1798 14.3473 39.7493 14.7835 39.7493 15.3215V44.0028H11.1834V15.3215C11.1834 14.7835 10.7529 14.3473 10.2219 14.3473C9.69091 14.3473 9.2604 14.7835 9.2604 15.3215V19.8517L3.34723 13.7822L12.5006 5.48176L18.5196 3.28C19.2652 7.17278 22.9841 9.71613 26.826 8.96061C29.6633 8.40262 31.8817 6.15483 32.4324 3.28L38.4513 5.48176L47.5759 13.7822L41.6723 19.8419Z"/>
</mask>
<path d="M49.7356 13.0479L49.0059 13.7317L49.006 13.7318L49.7356 13.0479ZM49.7007 13.0126L50.3941 12.2919L50.3822 12.2805L50.3699 12.2695L49.7007 13.0126ZM39.5859 3.90351L38.9073 4.6382L38.9167 4.6466L39.5859 3.90351ZM39.2686 3.70866L39.6161 2.77096L39.6091 2.76842L39.2686 3.70866ZM31.9516 1.05875L31.6063 1.99726L31.6111 1.99899L31.9516 1.05875ZM30.7197 1.64207L31.6611 1.97946L31.6611 1.97943L30.7197 1.64207ZM30.6632 1.92582L29.6644 1.87629L29.6632 1.90104V1.92582H30.6632ZM25.4712 7.15744L25.4553 8.15731L25.4712 8.15756L25.4871 8.15731L25.4712 7.15744ZM20.2503 1.92582L21.2493 1.881L21.2489 1.8731L20.2503 1.92582ZM19.2388 1.00505L19.1846 0.00651537L19.184 0.00654849L19.2388 1.00505ZM18.9715 1.05875L18.636 0.116667L18.6272 0.119869L18.9715 1.05875ZM11.6641 3.73789L11.3199 2.799L11.3166 2.80022L11.6641 3.73789ZM11.3468 3.93273L12.0174 4.67471L12.0253 4.66737L11.3468 3.93273ZM1.29925 13.0126L0.628779 12.2706L0.617087 12.2812L0.605733 12.2921L1.29925 13.0126ZM1.2644 14.3899L1.99409 13.7061L1.99389 13.7059L1.2644 14.3899ZM1.29925 14.4252L2.01476 13.7266L2.00384 13.7154L1.99256 13.7046L1.29925 14.4252ZM9.29886 22.6185H10.2989V22.2112L10.0144 21.9199L9.29886 22.6185ZM41.7011 22.6185L40.9856 21.9199L40.7011 22.2112V22.6185H41.7011ZM49.7007 14.4252L49.0072 13.7048L48.9961 13.7155L48.9852 13.7266L49.7007 14.4252ZM41.6723 19.8419H40.6723V22.3014L42.3886 20.5397L41.6723 19.8419ZM39.7493 44.0028V45.0028H40.7493V44.0028H39.7493ZM11.1834 44.0028H10.1834V45.0028H11.1834V44.0028ZM9.2604 19.8517L8.54414 20.5495L10.2604 22.3111V19.8517H9.2604ZM3.34723 13.7822L2.67548 13.0414L1.9077 13.7377L2.63096 14.48L3.34723 13.7822ZM12.5006 5.48176L12.1571 4.54262L11.9736 4.60974L11.8289 4.74098L12.5006 5.48176ZM18.5196 3.28L19.5017 3.09188L19.2805 1.93685L18.176 2.34086L18.5196 3.28ZM26.826 8.96061L27.019 9.94182L27.019 9.94182L26.826 8.96061ZM32.4324 3.28L32.7759 2.34086L31.6715 1.93685L31.4502 3.09186L32.4324 3.28ZM38.4513 5.48176L39.1242 4.74204L38.9791 4.61002L38.7948 4.54262L38.4513 5.48176ZM47.5759 13.7822L48.2921 14.48L49.0142 13.7388L48.2488 13.0425L47.5759 13.7822ZM50.4653 12.3641C50.4423 12.3395 50.4185 12.3154 50.3941 12.2919L49.0074 13.7332C49.0068 13.7326 49.0063 13.7321 49.0059 13.7317L50.4653 12.3641ZM50.3699 12.2695L40.255 3.16042L38.9167 4.6466L49.0316 13.7556L50.3699 12.2695ZM40.2643 3.16887C40.0764 2.99536 39.8564 2.86007 39.6161 2.77099L38.921 4.64633C38.9153 4.6442 38.9107 4.64116 38.9074 4.63814L40.2643 3.16887ZM39.6091 2.76842L32.2921 0.118516L31.6111 1.99899L38.928 4.6489L39.6091 2.76842ZM32.2969 0.120259C31.2672 -0.258605 30.1437 0.285226 29.7783 1.30472L31.6611 1.97943C31.6611 1.97931 31.6607 1.98034 31.6597 1.98207C31.6587 1.98376 31.6573 1.98559 31.6557 1.98739C31.6525 1.99089 31.6487 1.99366 31.6444 1.99568C31.6401 1.99771 31.6342 1.99952 31.6266 1.99992C31.6183 2.00036 31.6108 1.9989 31.6063 1.99725L32.2969 0.120259ZM29.7783 1.30469C29.7122 1.48906 29.6741 1.68169 29.6644 1.87629L31.662 1.97535C31.6619 1.97608 31.6618 1.97751 31.6611 1.97946L29.7783 1.30469ZM29.6632 1.92582C29.6632 1.92154 29.6028 3.03303 29.0159 4.11649C28.4663 5.13123 27.4669 6.1254 25.4552 6.15756L25.4871 8.15731C28.3502 8.11153 29.9468 6.59706 30.7745 5.06906C31.565 3.60977 31.6632 2.14443 31.6632 1.92582H29.6632ZM25.487 6.15756C23.4584 6.12532 22.4549 5.12859 21.904 4.1152C21.6164 3.58605 21.451 3.04237 21.358 2.61155C21.3119 2.39816 21.2847 2.2179 21.2689 2.0884C21.2611 2.0238 21.2562 1.97237 21.2532 1.93638C21.2501 1.89969 21.2492 1.88052 21.2492 1.881L19.2513 1.97063C19.2588 2.1391 19.35 3.60428 20.1469 5.07035C20.9782 6.5997 22.5803 8.11161 25.4553 8.15731L25.487 6.15756ZM21.2489 1.8731C21.192 0.796073 20.2792 -0.052807 19.1846 0.00651555L19.2929 2.00358C19.2875 2.00387 19.28 2.00296 19.2728 2.0003C19.2662 1.99791 19.262 1.99493 19.2596 1.99267C19.2571 1.99042 19.2551 1.98783 19.2537 1.9848C19.2519 1.98115 19.2516 1.97839 19.2516 1.97854L21.2489 1.8731ZM19.184 0.00654849C18.9976 0.0167684 18.813 0.053682 18.636 0.116708L19.307 2.0008C19.3023 2.00245 19.2978 2.00332 19.2935 2.00355L19.184 0.00654849ZM18.6272 0.119869L11.3199 2.799L12.0084 4.67677L19.3157 1.99764L18.6272 0.119869ZM11.3166 2.80022C11.0763 2.88929 10.8563 3.02458 10.6684 3.1981L12.0253 4.66737C12.022 4.67039 12.0174 4.67343 12.0117 4.67556L11.3166 2.80022ZM10.6764 3.1908L0.628779 12.2706L1.96972 13.7545L12.0173 4.67467L10.6764 3.1908ZM0.605733 12.2921C-0.173822 13.0425 -0.204689 14.2851 0.534906 15.0739L1.99389 13.7059C1.99555 13.7077 1.99768 13.7109 1.99897 13.7144C2 13.7171 2.00001 13.7187 2 13.7192C1.99999 13.7197 1.99989 13.7214 1.99865 13.7242C1.99713 13.7278 1.99471 13.7311 1.99277 13.733L0.605733 12.2921ZM0.534708 15.0737C0.557791 15.0983 0.581579 15.1224 0.605942 15.1458L1.99256 13.7046C1.99313 13.7051 1.9936 13.7056 1.99409 13.7061L0.534708 15.0737ZM0.58374 15.1238L8.58335 23.3171L10.0144 21.9199L2.01476 13.7266L0.58374 15.1238ZM8.29886 22.6185V45.0258H10.2989V22.6185H8.29886ZM8.29886 45.0258C8.29886 46.1036 9.16472 47 10.2604 47V45C10.2658 45 10.2731 45.0013 10.2801 45.0043C10.2863 45.007 10.2901 45.01 10.2922 45.0122C10.2944 45.0144 10.296 45.0168 10.2972 45.0197C10.2987 45.0233 10.2989 45.0259 10.2989 45.0258H8.29886ZM10.2604 47H40.7396V45H10.2604V47ZM40.7396 47C41.8353 47 42.7011 46.1036 42.7011 45.0258H40.7011C40.7011 45.0259 40.7013 45.0233 40.7028 45.0197C40.704 45.0168 40.7056 45.0144 40.7078 45.0122C40.7099 45.01 40.7137 45.007 40.7199 45.0043C40.7269 45.0013 40.7342 45 40.7396 45V47ZM42.7011 45.0258V22.6185H40.7011V45.0258H42.7011ZM42.4167 23.3171L50.4163 15.1238L48.9852 13.7266L40.9856 21.9199L42.4167 23.3171ZM50.3943 15.1456C51.1739 14.3951 51.2046 13.1528 50.4652 12.364L49.006 13.7318C49.0044 13.7301 49.0023 13.7269 49.001 13.7234C49 13.7207 49 13.7191 49 13.7186C49 13.7181 49.0001 13.7164 49.0014 13.7135C49.0029 13.7099 49.0053 13.7066 49.0072 13.7048L50.3943 15.1456ZM42.6723 19.8419V15.3215H40.6723V19.8419H42.6723ZM42.6723 15.3215C42.6723 14.2436 41.8064 13.3473 40.7108 13.3473V15.3473C40.7054 15.3473 40.698 15.3459 40.6911 15.343C40.6849 15.3403 40.6811 15.3372 40.6789 15.335C40.6768 15.3329 40.6751 15.3304 40.6739 15.3275C40.6724 15.324 40.6723 15.3213 40.6723 15.3215H42.6723ZM40.7108 13.3473C39.6152 13.3473 38.7493 14.2436 38.7493 15.3215H40.7493C40.7493 15.3213 40.7492 15.324 40.7477 15.3275C40.7465 15.3304 40.7448 15.3329 40.7427 15.3351C40.7405 15.3372 40.7367 15.3403 40.7305 15.343C40.7236 15.3459 40.7162 15.3473 40.7108 15.3473V13.3473ZM38.7493 15.3215V44.0028H40.7493V15.3215H38.7493ZM39.7493 43.0028H11.1834V45.0028H39.7493V43.0028ZM12.1834 44.0028V15.3215H10.1834V44.0028H12.1834ZM12.1834 15.3215C12.1834 14.2436 11.3175 13.3473 10.2219 13.3473V15.3473C10.2165 15.3473 10.2091 15.3459 10.2022 15.343C10.196 15.3403 10.1922 15.3372 10.19 15.3351C10.1879 15.3329 10.1862 15.3304 10.185 15.3275C10.1835 15.324 10.1834 15.3213 10.1834 15.3215H12.1834ZM10.2219 13.3473C9.12626 13.3473 8.2604 14.2436 8.2604 15.3215H10.2604C10.2604 15.3213 10.2603 15.324 10.2588 15.3275C10.2576 15.3304 10.2559 15.3329 10.2538 15.3351C10.2516 15.3372 10.2478 15.3403 10.2416 15.343C10.2347 15.3459 10.2273 15.3473 10.2219 15.3473V13.3473ZM8.2604 15.3215V19.8517H10.2604V15.3215H8.2604ZM9.97667 19.1538L4.0635 13.0844L2.63096 14.48L8.54414 20.5495L9.97667 19.1538ZM4.01898 14.523L13.1724 6.22254L11.8289 4.74098L2.67548 13.0414L4.01898 14.523ZM12.8442 6.4209L18.8631 4.21914L18.176 2.34086L12.1571 4.54262L12.8442 6.4209ZM17.5374 3.46812C18.3851 7.89378 22.6219 10.8065 27.019 9.94182L26.6331 7.97941C23.3463 8.62575 20.1453 6.45178 19.5017 3.09188L17.5374 3.46812ZM27.019 9.94182C30.2629 9.30386 32.7883 6.73699 33.4145 3.46814L31.4502 3.09186C30.975 5.57267 29.0636 7.50139 26.633 7.97941L27.019 9.94182ZM32.0888 4.21914L38.1077 6.4209L38.7948 4.54262L32.7759 2.34086L32.0888 4.21914ZM37.7784 6.22148L46.9029 14.5219L48.2488 13.0425L39.1242 4.74204L37.7784 6.22148ZM46.8596 13.0844L40.956 19.1441L42.3886 20.5397L48.2921 14.48L46.8596 13.0844Z" fill="#2E2E2E" mask="url(#path-1-outside-1_878_1687)"/>
</svg>
