<svg width="49" height="49" viewBox="0 0 49 49" fill="none" xmlns="http://www.w3.org/2000/svg">
<path d="M24.5234 0.962891C11.5557 0.962891 1.02344 11.4952 1.02344 24.4629C1.02344 37.4306 11.5557 47.9629 24.5234 47.9629C37.4911 47.9629 48.0234 37.4306 48.0234 24.4629C48.0234 11.4952 37.4911 0.962891 24.5234 0.962891ZM24.5234 44.9677C13.2164 44.9677 4.01862 35.7699 4.01862 24.4629C4.01862 13.1559 13.2164 3.95807 24.5234 3.95807C35.8304 3.95807 45.0283 13.1559 45.0283 24.4629C45.0283 35.7699 35.8304 44.9677 24.5234 44.9677Z" stroke="#2E2E2E"/>
<path d="M36.4944 18.9749H30.0113V12.4917C30.0113 11.6614 29.3441 10.9941 28.5137 10.9941H20.533C19.7026 10.9941 19.0354 11.6614 19.0354 12.4917V18.9749H12.5523C11.7219 18.9749 11.0547 19.6421 11.0547 20.4725V28.4532C11.0547 29.2835 11.7219 29.9508 12.5523 29.9508H19.0354V36.4339C19.0354 37.2643 19.7026 37.9315 20.533 37.9315H28.5137C29.3441 37.9315 30.0113 37.2643 30.0113 36.4339V29.9508H36.4944C37.3248 29.9508 37.992 29.2835 37.992 28.4532V20.4725V20.4475L37.9896 20.4227C37.9132 19.6587 37.2937 18.9749 36.4944 18.9749ZM35.0523 26.9556H28.5137C27.6834 26.9556 27.0161 27.6228 27.0161 28.4532V34.9363H22.0306V28.4532C22.0306 27.6228 21.3634 26.9556 20.533 26.9556H14.0499V21.97H20.533C21.3634 21.97 22.0306 21.3028 22.0306 20.4725V13.9893H27.0716V20.4725C27.0716 21.3028 27.7388 21.97 28.5691 21.97H35.0523V26.9556Z" stroke="#2E2E2E"/>
</svg>
