<svg width="70" height="70" viewBox="0 0 70 70" fill="none" xmlns="http://www.w3.org/2000/svg">
<path d="M21.0033 23.0759C22.84 21.2388 25.3036 20.1643 27.8996 20.068C30.4957 19.9717 33.0321 20.8607 34.9999 22.5566C36.9661 20.8635 39.4991 19.9755 42.092 20.0704C44.6849 20.1653 47.1463 21.2361 48.9834 23.0683C50.8205 24.9006 51.8977 27.3592 51.9994 29.9519C52.1011 32.5445 51.2197 35.0799 49.5318 37.0504L37.2372 49.3846C36.6723 49.9496 35.9148 50.2803 35.1163 50.3103C34.3179 50.3402 33.5377 50.0672 32.9321 49.5461L32.7579 49.3862L20.4649 37.0504C18.7779 35.0816 17.8961 32.5485 17.9959 29.9577C18.0957 27.3669 19.1698 24.9091 21.0033 23.0759ZM23.2421 25.3148C21.9473 26.6099 21.201 28.3539 21.1579 30.1847C21.1149 32.0156 21.7785 33.7927 23.0109 35.1473L23.2421 35.3911L34.9984 47.1473L43.3948 38.7493L37.7977 33.1523L36.1194 34.8306C35.6783 35.2718 35.1547 35.6219 34.5785 35.8607C34.0022 36.0996 33.3845 36.2226 32.7606 36.2227C31.5008 36.223 30.2924 35.7228 29.4013 34.8322C28.5102 33.9415 28.0094 32.7334 28.0091 31.4735C28.0088 30.2136 28.509 29.0052 29.3997 28.1141L32.7279 24.7843C31.4034 23.7273 29.7455 23.1768 28.0518 23.2316C26.358 23.2865 24.7393 23.9431 23.4859 25.0836L23.2421 25.3148ZM36.6783 29.7924C36.9752 29.4956 37.3778 29.3289 37.7977 29.3289C38.2175 29.3289 38.6202 29.4956 38.9171 29.7924L45.6336 36.5089L46.7546 35.3911C48.0711 34.0756 48.8206 32.2971 48.8428 30.4362C48.865 28.5752 48.1581 26.7794 46.8734 25.4328C45.5887 24.0862 43.8281 23.2958 41.9681 23.2306C40.1081 23.1653 38.2965 23.8304 36.9205 25.0836L36.6783 25.3148L31.6401 30.3529C31.3657 30.6272 31.2015 30.9927 31.1787 31.38C31.156 31.7673 31.2762 32.1495 31.5166 32.454L31.6401 32.5918C31.9144 32.8662 32.2798 33.0304 32.6672 33.0532C33.0545 33.0759 33.4367 32.9557 33.7412 32.7153L33.8789 32.5918L36.6783 29.7924Z" fill="#EA5252"/>
<rect x="1" y="1" width="68" height="68" rx="34" stroke="#EA5252" stroke-opacity="0.18" stroke-width="2"/>
</svg>
