<svg width="70" height="70" viewBox="0 0 70 70" fill="none" xmlns="http://www.w3.org/2000/svg">
<path d="M37.7967 48.9998H22.361C20.5076 48.9998 19 47.4922 19 45.6388V21.361C19 19.5076 20.5076 18 22.361 18H46.6388C48.4924 18 50 19.5076 50 21.361V37.4908C50 38.0615 49.5375 38.5242 48.9666 38.5242C48.3959 38.5242 47.9332 38.0617 47.9332 37.4908L47.9334 21.361C47.9334 20.6474 47.3526 20.0666 46.639 20.0666H22.3612C21.6476 20.0666 21.0668 20.6474 21.0668 21.361V45.6388C21.0668 46.3526 21.6476 46.9334 22.3612 46.9334H37.7969C38.3675 46.9334 38.8303 47.396 38.8303 47.9668C38.8303 48.5375 38.3677 49 37.7969 49L37.7967 48.9998Z" fill="#06CE0B"/>
<path d="M43.6123 26.6422H25.385C24.8143 26.6422 24.3516 26.1797 24.3516 25.6088C24.3516 25.0382 24.8141 24.5754 25.385 24.5754H43.6123C44.1829 24.5754 44.6457 25.038 44.6457 25.6088C44.6457 26.1797 44.1831 26.6422 43.6123 26.6422Z" fill="#06CE0B"/>
<path d="M43.6123 31.9029H25.385C24.8143 31.9029 24.3516 31.4403 24.3516 30.8695C24.3516 30.2988 24.8141 29.8361 25.385 29.8361H43.6123C44.1829 29.8361 44.6457 30.2986 44.6457 30.8695C44.6457 31.4403 44.1831 31.9029 43.6123 31.9029Z" fill="#06CE0B"/>
<path d="M30.4607 37.164H25.385C24.8143 37.164 24.3516 36.7014 24.3516 36.1306C24.3516 35.5599 24.8141 35.0972 25.385 35.0972H30.4607C31.0314 35.0972 31.4941 35.5597 31.4941 36.1306C31.4939 36.7012 31.0313 37.164 30.4607 37.164Z" fill="#06CE0B"/>
<path d="M33.7488 42.424H25.385C24.8143 42.424 24.3516 41.9614 24.3516 41.3906C24.3516 40.8199 24.8141 40.3572 25.385 40.3572H33.7488C34.3195 40.3572 34.7822 40.8197 34.7822 41.3906C34.782 41.9614 34.319 42.424 33.7486 42.424H33.7488Z" fill="#06CE0B"/>
<path d="M49.2249 43.1192L42.6524 36.5467C42.1674 36.0617 41.5648 35.6992 40.9084 35.4988L37.462 34.4459C36.8897 34.2693 36.2712 34.4245 35.8483 34.8479C35.4249 35.2713 35.2709 35.8891 35.4461 36.4613L36.4994 39.9081C36.6998 40.564 37.0622 41.1666 37.5473 41.6521L44.1198 48.2246C44.6366 48.7414 45.3162 48.9998 45.9954 48.9998C46.675 48.9998 47.3543 48.7414 47.8713 48.2241L49.2249 46.8705C50.2592 45.836 50.2592 44.1535 49.2249 43.1192L49.2249 43.1192Z" fill="#06CE0B"/>
<rect x="1" y="1" width="68" height="68" rx="34" stroke="#117D0C" stroke-opacity="0.18" stroke-width="2"/>
</svg>
