<svg width="70" height="70" viewBox="0 0 70 70" fill="none" xmlns="http://www.w3.org/2000/svg">
<path d="M44.2854 25.7926C44.2838 24.2566 43.6724 22.7836 42.5858 21.6974C41.4993 20.6114 40.026 20.001 38.4897 20C36.9533 19.9994 35.4793 20.6082 34.3915 21.6931L23.6342 32.4505C22.5858 33.4919 21.9974 34.9098 22 36.3876V42.2795H27.8919C29.3707 42.2847 30.7902 41.6979 31.8336 40.6499L42.5868 29.8876C43.6772 28.804 44.289 27.3297 44.2861 25.7924L44.2854 25.7926ZM39.9628 27.2646L29.2055 38.0219C28.8567 38.3703 28.3842 38.5656 27.8916 38.5653H25.714V36.3876C25.7136 35.8951 25.9089 35.4222 26.2571 35.0737L37.0144 24.3164C37.5487 23.8381 38.2917 23.6684 38.9809 23.8669C39.67 24.0651 40.2089 24.604 40.4075 25.2932C40.606 25.9823 40.436 26.7252 39.9579 27.26L39.9628 27.2646Z" fill="#06CE0B"/>
<path d="M22 45.994H47.9999V49.7084H22V45.994Z" fill="#06CE0B"/>
<path d="M40.5697 40.4224C40.5697 41.4481 39.7384 42.2797 38.7128 42.2797C37.6871 42.2797 36.8555 41.4481 36.8555 40.4224C36.8555 39.3967 37.6871 38.5654 38.7128 38.5654C39.7384 38.5654 40.5697 39.3967 40.5697 40.4224Z" fill="#06CE0B"/>
<path d="M47.9994 40.4224C47.9994 41.4481 47.1678 42.2797 46.1421 42.2797C45.1165 42.2797 44.2852 41.4481 44.2852 40.4224C44.2852 39.3967 45.1165 38.5654 46.1421 38.5654C47.1678 38.5654 47.9994 39.3967 47.9994 40.4224Z" fill="#06CE0B"/>
<rect x="1" y="1" width="68" height="68" rx="34" stroke="#117D0C" stroke-opacity="0.18" stroke-width="2"/>
</svg>
