<svg width="55" height="47" viewBox="0 0 55 47" fill="none" xmlns="http://www.w3.org/2000/svg">
<path d="M10.9 6.01986V5.10005L10.1281 5.60026L8.32809 6.76668L8.1 6.91449V7.18628V13.2499C8.1 13.9272 7.5319 14.5 6.8 14.5C6.0681 14.5 5.5 13.9272 5.5 13.2499V6.24964C5.5 5.83775 5.71134 5.44786 6.07346 5.21318L6.0735 5.21316L11.4733 1.71314C11.8729 1.45439 12.3945 1.42883 12.8179 1.64962L12.818 1.6497C13.243 1.87119 13.5 2.29615 13.5 2.7495V13.2499C13.5 13.9272 12.9319 14.5 12.2 14.5C11.4681 14.5 10.9 13.9272 10.9 13.2499V6.01986Z" stroke="#EA5252"/>
<path d="M6.03125 19.6875V20.1875H6.53125H12.25H12.75V19.6875V17.7812V17.2812H12.25H6.53125H6.03125V17.7812V19.6875ZM14.1562 23H4.625C3.84772 23 3.21875 22.3704 3.21875 21.5938V15.875C3.21875 15.0983 3.84772 14.4688 4.625 14.4688H14.1562C14.9335 14.4688 15.5625 15.0983 15.5625 15.875V21.5938C15.5625 22.3704 14.9335 23 14.1562 23Z" stroke="#EA5252"/>
<path d="M44.6562 45.875C42.0081 45.875 39.7192 45.275 38.1101 44.3095C36.4991 43.3429 35.625 42.0523 35.625 40.6562C35.625 39.2602 36.4991 37.9696 38.1101 37.003C39.7192 36.0375 42.0081 35.4375 44.6562 35.4375C47.3044 35.4375 49.5933 36.0375 51.2024 37.003C52.8134 37.9696 53.6875 39.2602 53.6875 40.6562C53.6875 42.0523 52.8134 43.3429 51.2024 44.3095C49.5933 45.275 47.3044 45.875 44.6562 45.875ZM44.6562 38.25C42.7478 38.25 41.2503 38.6201 40.2155 39.0659C39.6999 39.288 39.2889 39.5334 38.9973 39.7698C38.8524 39.8872 38.7255 40.0118 38.6302 40.1403C38.5454 40.2547 38.4375 40.4361 38.4375 40.6562C38.4375 40.8764 38.5454 41.0578 38.6302 41.1722C38.7255 41.3007 38.8524 41.4253 38.9973 41.5427C39.2889 41.7791 39.6999 42.0245 40.2155 42.2466C41.2503 42.6924 42.7478 43.0625 44.6562 43.0625C46.5647 43.0625 48.0622 42.6924 49.097 42.2466C49.6126 42.0245 50.0236 41.7791 50.3152 41.5427C50.4601 41.4253 50.587 41.3007 50.6823 41.1722C50.7671 41.0578 50.875 40.8764 50.875 40.6562C50.875 40.4361 50.7671 40.2547 50.6823 40.1403C50.587 40.0118 50.4601 39.8872 50.3152 39.7698C50.0236 39.5334 49.6126 39.288 49.097 39.0659C48.0622 38.6201 46.5647 38.25 44.6562 38.25Z" stroke="#EA5252"/>
<path d="M44.6562 38.25C43.879 38.25 43.25 37.6204 43.25 36.8438V34.9375C43.25 34.1608 43.879 33.5312 44.6562 33.5312C45.4335 33.5312 46.0625 34.1608 46.0625 34.9375V36.8438C46.0625 37.6204 45.4335 38.25 44.6562 38.25Z" stroke="#EA5252"/>
<path d="M44.6562 34.4375C39.6264 34.4375 35.625 30.7651 35.625 26.3594C35.625 21.9536 39.6264 18.2812 44.6562 18.2812C49.6861 18.2812 53.6875 21.9536 53.6875 26.3594C53.6875 30.7651 49.6861 34.4375 44.6562 34.4375ZM44.6562 21.0938C41.3158 21.0938 38.4375 23.3742 38.4375 26.3594C38.4375 29.3446 41.3158 31.625 44.6562 31.625C47.9967 31.625 50.875 29.3446 50.875 26.3594C50.875 23.3742 47.9967 21.0938 44.6562 21.0938Z" stroke="#EA5252"/>
<path d="M26.5469 21.0938H26.0469V21.5938V41.6094C26.0469 42.4118 26.6992 43.0625 27.5 43.0625C28.3008 43.0625 28.9531 42.4118 28.9531 41.6094V21.5938V21.0938H28.4531H26.5469ZM27.5 45.875C25.1477 45.875 23.2344 43.9609 23.2344 41.6094V19.6875C23.2344 18.9108 23.8633 18.2812 24.6406 18.2812H30.3594C31.1367 18.2812 31.7656 18.9108 31.7656 19.6875V41.6094C31.7656 43.9609 29.8523 45.875 27.5 45.875Z" stroke="#EA5252"/>
<path d="M30.3594 17.2812H24.6406C23.8633 17.2812 23.2344 16.6517 23.2344 15.875C23.2344 15.0983 23.8633 14.4688 24.6406 14.4688H30.3594C31.1367 14.4688 31.7656 15.0983 31.7656 15.875C31.7656 16.6517 31.1367 17.2812 30.3594 17.2812Z" stroke="#EA5252"/>
<path d="M23.4706 12.8426L23.4706 12.8425L19.6581 7.1238L19.658 7.1236C19.2862 6.56644 19.36 5.8235 19.8339 5.34959L21.6248 3.55866L21.625 3.55846C23.1691 2.01258 25.3129 1.125 27.4999 1.125C29.687 1.125 31.8308 2.01257 33.3751 3.55848L33.3752 3.55864L35.166 5.34957L35.166 5.34959C35.6399 5.8235 35.7137 6.56644 35.3419 7.1236L35.3418 7.1238L31.5293 12.8425L31.5293 12.8426C31.2685 13.2339 30.829 13.4688 30.3593 13.4688H24.6406C24.1709 13.4688 23.7314 13.2339 23.4706 12.8426ZM25.2447 10.4336L25.3932 10.6562H25.6608H29.3393H29.6069L29.7553 10.4335L32.1344 6.86389L32.3615 6.5231L32.0721 6.2333L31.387 5.54724L31.3869 5.54717C29.3338 3.49193 25.6661 3.49193 23.613 5.54717L23.6129 5.54724L22.9278 6.2333L22.6384 6.52311L22.8655 6.86391L25.2447 10.4336Z" stroke="#EA5252"/>
<path d="M4.125 42.5625V43.0625H4.625H14.1562H14.6562V42.5625V23.5V23H14.1562H4.625H4.125V23.5V42.5625ZM16.0625 45.875H2.71875C1.94147 45.875 1.3125 45.2454 1.3125 44.4688V21.5938C1.3125 20.8171 1.94147 20.1875 2.71875 20.1875H16.0625C16.8398 20.1875 17.4688 20.8171 17.4688 21.5938V44.4688C17.4688 45.2454 16.8398 45.875 16.0625 45.875Z" stroke="#EA5252"/>
</svg>
