<svg width="70" height="70" viewBox="0 0 70 70" fill="none" xmlns="http://www.w3.org/2000/svg">
<path d="M47.6667 50.8333H22.3333C21.9134 50.8333 21.5107 50.6665 21.2137 50.3695C20.9168 50.0726 20.75 49.6699 20.75 49.25V20.75C20.75 20.33 20.9168 19.9273 21.2137 19.6304C21.5107 19.3334 21.9134 19.1666 22.3333 19.1666H47.6667C48.0866 19.1666 48.4893 19.3334 48.7863 19.6304C49.0832 19.9273 49.25 20.33 49.25 20.75V49.25C49.25 49.6699 49.0832 50.0726 48.7863 50.3695C48.4893 50.6665 48.0866 50.8333 47.6667 50.8333ZM27.0833 22.3333H23.9167V47.6666H46.0833V22.3333H38.1667V36.5833L32.625 33.4166L27.0833 36.5833V22.3333Z" fill="#EA5252"/>
<rect x="1" y="1" width="68" height="68" rx="34" stroke="#EA5252" stroke-opacity="0.18" stroke-width="2"/>
</svg>
