<svg width="60" height="47" viewBox="0 0 60 47" fill="none" xmlns="http://www.w3.org/2000/svg">
<mask id="path-1-outside-1_877_1538" maskUnits="userSpaceOnUse" x="0" y="0" width="60" height="47" fill="black">
<rect fill="white" width="60" height="47"/>
<path d="M59 19.5518C59 17.3578 57.2037 15.5752 54.9929 15.5752H51.5212C51.4348 15.3866 51.3484 15.1981 51.2275 15.0267L43.3169 2.80529C42.7469 1.93111 41.866 1.31405 40.8469 1.09122C39.8106 0.868387 38.7743 1.05694 37.8761 1.62258C36.0453 2.78815 35.5271 5.205 36.7016 7.02192L42.2287 15.558H17.7886L23.3157 7.02192C23.7302 6.38771 23.9375 5.6678 23.9375 4.91361C23.9375 3.57663 23.2638 2.34249 22.1239 1.62258C21.243 1.05694 20.1894 0.868387 19.1531 1.09122C18.134 1.31405 17.2531 1.91397 16.6831 2.80529L8.77249 15.0267C8.65158 15.1981 8.56522 15.3866 8.47886 15.5752H5.00715C2.79631 15.5752 1 17.3578 1 19.5518V19.8089C1 22.0029 2.79631 23.7856 5.00715 23.7856H5.38714L11.9678 45.0915C12.1406 45.64 12.6415 46 13.2114 46H46.754C47.324 46 47.8249 45.6229 47.9976 45.0915L54.5783 23.7856H54.9583C57.1692 23.7856 58.9655 22.0029 58.9655 19.8089V19.5518H59ZM38.8606 5.65066C38.4634 5.03359 38.6361 4.21084 39.2579 3.79946C39.5688 3.61091 39.9142 3.54234 40.277 3.61091C40.6224 3.67947 40.9333 3.88516 41.1233 4.1937L48.4812 15.558H45.2859L38.8606 5.65066ZM18.8767 4.1937C19.0667 3.88516 19.3776 3.67947 19.7231 3.61091C20.0685 3.54234 20.4312 3.59377 20.7421 3.79946C21.1221 4.03943 21.3639 4.46795 21.3639 4.93075C21.3639 5.18786 21.2948 5.42783 21.1566 5.65066L14.7314 15.5752H11.536L18.8767 4.1937ZM45.8213 43.4289H14.1787L8.09887 23.7856H51.8839L45.8213 43.4289ZM56.4092 19.8089C56.4092 20.5803 55.7701 21.2145 54.9929 21.2145H5.02442C4.24717 21.2145 3.6081 20.5803 3.6081 19.8089V19.5518C3.6081 18.7805 4.24717 18.1463 5.02442 18.1463H50.5021C50.5021 18.1463 50.5021 18.1463 50.5194 18.1463H54.9583C55.7356 18.1463 56.3746 18.7805 56.3746 19.5518V19.8089H56.4092Z"/>
<path d="M21.865 38.3875C22.5732 38.3875 23.1604 37.8048 23.1604 37.102V30.1086C23.1604 29.4058 22.5732 28.823 21.865 28.823C21.1569 28.823 20.5696 29.4058 20.5696 30.1086V37.102C20.5696 37.8219 21.1569 38.3875 21.865 38.3875Z"/>
<path d="M29.998 38.3875C30.7062 38.3875 31.2934 37.8048 31.2934 37.102V30.1086C31.2934 29.4058 30.7062 28.823 29.998 28.823C29.2898 28.823 28.7026 29.4058 28.7026 30.1086V37.102C28.7026 37.8219 29.2898 38.3875 29.998 38.3875Z"/>
<path d="M38.1352 38.3875C38.8434 38.3875 39.4307 37.8048 39.4307 37.102V30.1086C39.4307 29.4058 38.8434 28.823 38.1352 28.823C37.4271 28.823 36.8398 29.4058 36.8398 30.1086V37.102C36.8398 37.8219 37.4098 38.3875 38.1352 38.3875Z"/>
</mask>
<path d="M59 19.5518V20.5518H60V19.5518H59ZM51.5212 15.5752L50.612 15.9916L50.8793 16.5752H51.5212V15.5752ZM51.2275 15.0267L50.388 15.57L50.3989 15.5868L50.4104 15.6031L51.2275 15.0267ZM43.3169 2.80529L44.1563 2.26191L44.1545 2.25912L43.3169 2.80529ZM40.8469 1.09122L41.0605 0.114293L41.0571 0.113562L40.8469 1.09122ZM37.8761 1.62258L37.3432 0.776399L37.3391 0.779021L37.8761 1.62258ZM36.7016 7.02192L35.8618 7.5648L35.8622 7.56543L36.7016 7.02192ZM42.2287 15.558V16.558H44.0675L43.0681 15.0145L42.2287 15.558ZM17.7886 15.558L16.9492 15.0145L15.9497 16.558H17.7886V15.558ZM23.3157 7.02192L22.4786 6.4748L22.4763 6.47841L23.3157 7.02192ZM22.1239 1.62258L21.5835 2.46406L21.5899 2.46809L22.1239 1.62258ZM19.1531 1.09122L18.9429 0.113556L18.9395 0.114299L19.1531 1.09122ZM16.6831 2.80529L17.5226 3.34868L17.5256 3.34404L16.6831 2.80529ZM8.77249 15.0267L9.58965 15.6031L9.60114 15.5868L9.61197 15.57L8.77249 15.0267ZM8.47886 15.5752V16.5752H9.12073L9.38803 15.9916L8.47886 15.5752ZM5.38714 23.7856L6.3426 23.4905L6.12488 22.7856H5.38714V23.7856ZM11.9678 45.0915L11.0124 45.3867L11.014 45.3919L11.9678 45.0915ZM47.9976 45.0915L48.9486 45.4007L48.9509 45.3937L48.9531 45.3867L47.9976 45.0915ZM54.5783 23.7856V22.7856H53.8406L53.6229 23.4905L54.5783 23.7856ZM58.9655 19.5518V18.5518H57.9655V19.5518H58.9655ZM38.8606 5.65066L38.0198 6.19197L38.0216 6.19478L38.8606 5.65066ZM39.2579 3.79946L38.7393 2.94441L38.7225 2.95461L38.7061 2.96546L39.2579 3.79946ZM40.277 3.61091L40.4716 2.63L40.4627 2.62831L40.277 3.61091ZM41.1233 4.1937L40.2718 4.71805L40.2777 4.72768L40.2839 4.73718L41.1233 4.1937ZM48.4812 15.558V16.558H50.32L49.3207 15.0145L48.4812 15.558ZM45.2859 15.558L44.4469 16.1021L44.7425 16.558H45.2859V15.558ZM18.8767 4.1937L19.7171 4.73571L19.7227 4.72694L19.7282 4.71805L18.8767 4.1937ZM20.7421 3.79946L20.1903 4.63345L20.1992 4.63931L20.2082 4.64497L20.7421 3.79946ZM21.1566 5.65066L21.9961 6.19412L22.0014 6.18594L22.0065 6.17766L21.1566 5.65066ZM14.7314 15.5752V16.5752H15.2753L15.5708 16.1186L14.7314 15.5752ZM11.536 15.5752L10.6957 15.0331L9.70112 16.5752H11.536V15.5752ZM45.8213 43.4289V44.4289H46.5592L46.7769 43.7238L45.8213 43.4289ZM14.1787 43.4289L13.2234 43.7246L13.4414 44.4289H14.1787V43.4289ZM8.09887 23.7856V22.7856H6.74256L7.14358 24.0813L8.09887 23.7856ZM51.8839 23.7856L52.8394 24.0805L53.239 22.7856H51.8839V23.7856ZM56.4092 19.8089H57.4092V18.8089H56.4092V19.8089ZM56.3746 19.8089H55.3746V20.8089H56.3746V19.8089ZM60 19.5518C60 16.7983 57.7488 14.5752 54.9929 14.5752V16.5752C56.6586 16.5752 58 17.9173 58 19.5518H60ZM54.9929 14.5752H51.5212V16.5752H54.9929V14.5752ZM52.4303 15.1587C52.3502 14.9838 52.2278 14.7098 52.0447 14.4502L50.4104 15.6031C50.4691 15.6863 50.5194 15.7894 50.612 15.9916L52.4303 15.1587ZM52.067 14.4833L44.1563 2.26191L42.4774 3.34868L50.388 15.57L52.067 14.4833ZM44.1545 2.25912C43.4441 1.16948 42.3413 0.394347 41.0605 0.114299L40.6333 2.06814C41.3907 2.23375 42.0497 2.69275 42.4792 3.35147L44.1545 2.25912ZM41.0571 0.113562C39.7617 -0.164975 38.4592 0.0735964 37.3432 0.776409L38.409 2.46875C39.0894 2.04028 39.8595 1.90175 40.6367 2.06887L41.0571 0.113562ZM37.3391 0.779021C35.0373 2.24441 34.3878 5.28455 35.8618 7.5648L37.5414 6.47904C36.6664 5.12545 37.0533 3.33189 38.4132 2.46614L37.3391 0.779021ZM35.8622 7.56543L41.3893 16.1015L43.0681 15.0145L37.541 6.47841L35.8622 7.56543ZM42.2287 14.558H17.7886V16.558H42.2287V14.558ZM18.628 16.1015L24.1551 7.56543L22.4763 6.47841L16.9492 15.0145L18.628 16.1015ZM24.1527 7.56904C24.6768 6.76718 24.9375 5.85609 24.9375 4.91361H22.9375C22.9375 5.47951 22.7836 6.00824 22.4786 6.4748L24.1527 7.56904ZM24.9375 4.91361C24.9375 3.23532 24.0895 1.68117 22.6578 0.777071L21.5899 2.46809C22.4382 3.00382 22.9375 3.91793 22.9375 4.91361H24.9375ZM22.6642 0.781127C21.5579 0.0707541 20.234 -0.164057 18.9429 0.113562L19.3633 2.06887C20.1448 1.90083 20.9281 2.04312 21.5836 2.46404L22.6642 0.781127ZM18.9395 0.114299C17.6668 0.392573 16.557 1.14638 15.8407 2.26655L17.5256 3.34404C17.9493 2.68156 18.6012 2.23552 19.3667 2.06814L18.9395 0.114299ZM15.8437 2.26191L7.933 14.4833L9.61197 15.57L17.5226 3.34868L15.8437 2.26191ZM7.95532 14.4502C7.77224 14.7098 7.6498 14.9838 7.56969 15.1587L9.38803 15.9916C9.48064 15.7894 9.53092 15.6863 9.58965 15.6031L7.95532 14.4502ZM8.47886 14.5752H5.00715V16.5752H8.47886V14.5752ZM5.00715 14.5752C2.25124 14.5752 0 16.7983 0 19.5518H2C2 17.9173 3.34138 16.5752 5.00715 16.5752V14.5752ZM0 19.5518V19.8089H2V19.5518H0ZM0 19.8089C0 22.5624 2.25124 24.7856 5.00715 24.7856V22.7856C3.34138 22.7856 2 21.4435 2 19.8089H0ZM5.00715 24.7856H5.38714V22.7856H5.00715V24.7856ZM4.43167 24.0807L11.0124 45.3867L12.9233 44.7964L6.3426 23.4905L4.43167 24.0807ZM11.014 45.3919C11.3199 46.3634 12.2118 47 13.2114 47V45C13.0711 45 12.9612 44.9167 12.9217 44.7912L11.014 45.3919ZM13.2114 47H46.754V45H13.2114V47ZM46.754 47C47.7684 47 48.6455 46.3333 48.9486 45.4007L47.0466 44.7824C47.0043 44.9125 46.8796 45 46.754 45V47ZM48.9531 45.3867L55.5338 24.0807L53.6229 23.4905L47.0422 44.7964L48.9531 45.3867ZM54.5783 24.7856H54.9583V22.7856H54.5783V24.7856ZM54.9583 24.7856C57.7142 24.7856 59.9655 22.5624 59.9655 19.8089H57.9655C57.9655 21.4435 56.6241 22.7856 54.9583 22.7856V24.7856ZM59.9655 19.8089V19.5518H57.9655V19.8089H59.9655ZM58.9655 20.5518H59V18.5518H58.9655V20.5518ZM39.7015 5.10935C39.6034 4.95706 39.6399 4.74575 39.8097 4.63345L38.7061 2.96546C37.6323 3.67592 37.3233 5.11012 38.0198 6.19197L39.7015 5.10935ZM39.7764 4.6545C39.8851 4.58862 39.9808 4.57264 40.0912 4.59351L40.4627 2.62831C39.8477 2.51205 39.2525 2.6332 38.7393 2.94441L39.7764 4.6545ZM40.0823 4.59177C40.1682 4.60883 40.2347 4.65782 40.2718 4.71805L41.9748 3.66934C41.6319 3.1125 41.0766 2.75011 40.4716 2.63004L40.0823 4.59177ZM40.2839 4.73718L47.6418 16.1015L49.3207 15.0145L41.9627 3.65021L40.2839 4.73718ZM48.4812 14.558H45.2859V16.558H48.4812V14.558ZM46.1249 15.0139L39.6996 5.10654L38.0216 6.19478L44.4469 16.1021L46.1249 15.0139ZM19.7282 4.71805C19.7653 4.65782 19.8318 4.60883 19.9177 4.59177L19.5284 2.63004C18.9234 2.75011 18.3681 3.1125 18.0252 3.66934L19.7282 4.71805ZM19.9177 4.59177C20.0371 4.56807 20.1253 4.59042 20.1903 4.63345L21.2939 2.96546C20.7371 2.59711 20.0998 2.51662 19.5284 2.63004L19.9177 4.59177ZM20.2082 4.64497C20.3005 4.70326 20.3639 4.81395 20.3639 4.93075H22.3639C22.3639 4.12195 21.9437 3.37559 21.2761 2.95395L20.2082 4.64497ZM20.3639 4.93075C20.3639 4.99779 20.3489 5.05579 20.3068 5.12366L22.0065 6.17766C22.2408 5.79987 22.3639 5.37793 22.3639 4.93075H20.3639ZM20.3172 5.1072L13.892 15.0317L15.5708 16.1186L21.9961 6.19412L20.3172 5.1072ZM14.7314 14.5752H11.536V16.5752H14.7314V14.5752ZM12.3764 16.1172L19.7171 4.73571L18.0363 3.65168L10.6957 15.0331L12.3764 16.1172ZM45.8213 42.4289H14.1787V44.4289H45.8213V42.4289ZM15.134 43.1332L9.05416 23.4899L7.14358 24.0813L13.2234 43.7246L15.134 43.1332ZM8.09887 24.7856H51.8839V22.7856H8.09887V24.7856ZM50.9283 23.4907L44.8658 43.134L46.7769 43.7238L52.8394 24.0805L50.9283 23.4907ZM55.4092 19.8089C55.4092 20.0208 55.225 20.2145 54.9929 20.2145V22.2145C56.3152 22.2145 57.4092 21.1397 57.4092 19.8089H55.4092ZM5.02442 20.2145C4.79224 20.2145 4.6081 20.0208 4.6081 19.8089H2.6081C2.6081 21.1397 3.7021 22.2145 5.02442 22.2145V20.2145ZM4.6081 19.8089V19.5518H2.6081V19.8089H4.6081ZM4.6081 19.5518C4.6081 19.34 4.79224 19.1463 5.02442 19.1463V17.1463C3.7021 17.1463 2.6081 18.221 2.6081 19.5518H4.6081ZM50.5021 18.1463C50.5021 17.1463 50.5021 18.1463 50.5021 19.1463C50.5021 19.1463 50.5021 19.1463 50.5021 19.1463C50.5021 19.1463 50.5021 19.1463 50.5021 19.1463C50.5021 19.1463 50.5021 19.1463 50.5021 19.1463C50.5021 19.1463 50.5021 19.1463 50.5021 19.1463C50.5021 19.1463 50.5021 19.1463 50.5021 19.1463C50.5021 19.1463 50.5021 19.1463 50.5021 19.1463C50.5021 19.1463 50.5021 19.1463 50.5021 19.1463C50.5021 19.1463 50.5021 19.1463 50.5021 19.1463C50.5021 19.1463 50.5021 19.1463 50.5021 19.1463C50.5021 19.1463 50.5021 19.1463 50.5021 19.1463C50.5021 19.1463 50.5021 19.1463 50.5021 19.1463C50.5021 19.1463 50.5021 19.1463 50.5021 19.1463C50.5021 19.1463 50.5021 19.1463 50.5021 19.1463C50.5021 19.1463 50.5021 19.1463 50.5021 19.1463C50.5021 19.1463 50.5021 19.1463 50.5021 19.1463C50.5021 19.1463 50.5021 19.1463 50.5021 19.1463C50.5021 19.1463 50.5021 19.1463 50.5021 19.1463C50.5021 19.1463 50.5021 19.1463 50.5021 19.1463C50.5021 19.1463 50.5021 19.1463 50.5021 19.1463C50.5021 19.1463 50.5021 19.1463 50.5021 19.1463C50.5021 19.1463 50.5021 19.1463 50.5021 19.1463C50.5021 19.1463 50.5021 19.1463 50.5021 19.1463C50.5021 19.1463 50.5021 19.1463 50.5021 19.1463C50.5021 19.1463 50.5021 19.1463 50.5021 19.1463C50.5021 19.1463 50.5021 19.1463 50.5021 19.1463C50.5021 19.1463 50.5021 19.1463 50.5021 19.1463C50.5021 19.1463 50.5021 19.1463 50.5021 19.1463C50.5021 19.1463 50.5021 19.1463 50.5021 19.1463C50.5021 19.1463 50.5021 19.1463 50.5021 19.1463C50.5021 19.1463 50.5021 19.1463 50.5021 19.1463C50.5021 19.1463 50.5021 19.1463 50.5021 19.1463C50.5021 19.1463 50.5021 19.1463 50.5021 19.1463C50.5021 19.1463 50.5021 19.1463 50.5021 19.1463C50.5021 19.1463 50.5021 19.1463 50.5021 19.1463C50.5021 19.1463 50.5021 19.1463 50.5021 19.1463C50.5021 19.1463 50.5021 19.1463 50.5021 19.1463C50.5021 19.1463 50.5021 19.1463 50.5021 19.1463C50.5021 19.1463 50.5021 19.1463 50.5021 19.1463C50.5021 19.1463 50.5021 19.1463 50.5021 19.1463C50.5021 19.1463 50.5021 19.1463 50.5021 19.1463C50.5021 19.1463 50.5021 19.1463 50.5021 19.1463C50.5021 19.1463 50.5021 19.1463 50.5021 19.1463C50.5021 19.1463 50.5021 19.1463 50.5021 19.1463C50.5021 19.1463 50.5021 19.1463 50.5021 19.1463C50.5021 19.1463 50.5021 19.1463 50.5021 19.1463C50.5021 19.1463 50.5021 19.1463 50.5021 19.1463C50.5021 19.1463 50.5021 19.1463 50.5021 19.1463C50.5021 19.1463 50.5021 19.1463 50.5021 19.1463C50.5021 19.1463 50.5021 19.1463 50.5021 19.1463C50.5021 19.1463 50.5021 19.1463 50.5021 19.1463C50.5021 19.1463 50.5021 19.1463 50.5021 19.1463C50.5021 19.1463 50.5021 19.1463 50.5021 19.1463C50.5021 19.1463 50.5021 19.1463 50.5021 19.1463C50.5021 19.1463 50.5021 19.1463 50.5021 19.1463C50.5021 19.1463 50.5021 19.1463 50.5021 19.1463C50.5021 19.1463 50.5021 19.1463 50.5021 19.1463C50.5021 19.1463 50.5021 19.1463 50.5021 19.1463C50.5021 19.1463 50.5021 19.1463 50.5021 19.1463C50.5021 19.1463 50.5021 19.1463 50.5021 19.1463C50.5021 19.1463 50.5021 19.1463 50.5021 19.1463C50.5021 19.1463 50.5021 19.1463 50.5021 19.1463C50.5021 19.1463 50.5021 19.1463 50.5021 19.1463C50.5021 19.1463 50.5021 19.1463 50.5021 19.1463C50.5021 19.1463 50.5021 19.1463 50.5021 19.1463C50.5021 19.1463 50.5021 19.1463 50.5021 19.1463C50.5021 19.1463 50.5021 19.1463 50.5021 19.1463C50.5021 19.1463 50.5021 19.1463 50.5021 19.1463C50.5021 19.1463 50.5021 19.1463 50.5021 19.1463C50.5021 19.1463 50.5021 19.1463 50.5021 19.1463C50.5021 19.1463 50.5021 19.1463 50.5021 19.1463C50.5021 19.1463 50.5021 19.1463 50.5021 19.1463C50.5021 19.1463 50.5021 19.1463 50.5021 19.1463C50.5021 19.1463 50.5021 19.1463 50.5021 19.1463C50.5021 19.1463 50.5021 19.1463 50.5021 19.1463C50.5021 19.1463 50.5021 19.1463 50.5021 19.1463C50.5021 19.1463 50.5021 19.1463 50.5021 19.1463C50.5021 19.1463 50.5021 19.1463 50.5021 19.1463C50.5022 19.1463 50.5022 19.1463 50.5022 19.1463C50.5022 19.1463 50.5022 19.1463 50.5022 19.1463C50.5022 19.1463 50.5022 19.1463 50.5022 19.1463C50.5022 19.1463 50.5022 19.1463 50.5022 19.1463C50.5022 19.1463 50.5022 19.1463 50.5022 19.1463C50.5022 19.1463 50.5022 19.1463 50.5022 19.1463C50.5022 19.1463 50.5022 19.1463 50.5022 19.1463C50.5022 19.1463 50.5022 19.1463 50.5022 19.1463C50.5022 19.1463 50.5022 19.1463 50.5022 19.1463C50.5022 19.1463 50.5022 19.1463 50.5022 19.1463C50.5022 19.1463 50.5022 19.1463 50.5022 19.1463C50.5022 19.1463 50.5022 19.1463 50.5022 19.1463C50.5022 19.1463 50.5022 19.1463 50.5022 19.1463C50.5022 19.1463 50.5022 19.1463 50.5022 19.1463C50.5022 19.1463 50.5022 19.1463 50.5022 19.1463C50.5022 19.1463 50.5022 19.1463 50.5022 19.1463C50.5022 19.1463 50.5022 19.1463 50.5022 19.1463C50.5022 19.1463 50.5022 19.1463 50.5022 19.1463C50.5022 19.1463 50.5022 19.1463 50.5022 19.1463C50.5022 19.1463 50.5022 19.1463 50.5022 19.1463C50.5022 19.1463 50.5022 19.1463 50.5022 19.1463C50.5022 19.1463 50.5022 19.1463 50.5022 19.1463C50.5022 19.1463 50.5022 19.1463 50.5022 19.1463C50.5022 19.1463 50.5022 19.1463 50.5022 19.1463C50.5022 19.1463 50.5022 19.1463 50.5022 19.1463C50.5022 19.1463 50.5022 19.1463 50.5022 19.1463C50.5022 19.1463 50.5022 19.1463 50.5022 19.1463C50.5022 19.1463 50.5022 19.1463 50.5022 19.1463C50.5022 19.1463 50.5022 19.1463 50.5022 19.1463C50.5022 19.1463 50.5022 19.1463 50.5023 19.1463C50.5023 19.1463 50.5023 19.1463 50.5023 19.1463C50.5023 19.1463 50.5023 19.1463 50.5023 19.1463C50.5023 19.1463 50.5023 19.1463 50.5023 19.1463C50.5023 19.1463 50.5023 19.1463 50.5023 19.1463C50.5023 19.1463 50.5023 19.1463 50.5023 19.1463C50.5023 19.1463 50.5023 19.1463 50.5023 19.1463C50.5023 19.1463 50.5023 19.1463 50.5023 19.1463C50.5023 19.1463 50.5023 19.1463 50.5023 19.1463C50.5023 19.1463 50.5023 19.1463 50.5023 19.1463C50.5023 19.1463 50.5023 19.1463 50.5023 19.1463C50.5023 19.1463 50.5023 19.1463 50.5023 19.1463C50.5023 19.1463 50.5023 19.1463 50.5023 19.1463C50.5023 19.1463 50.5023 19.1463 50.5023 19.1463C50.5023 19.1463 50.5023 19.1463 50.5023 19.1463C50.5023 19.1463 50.5023 19.1463 50.5023 19.1463C50.5023 19.1463 50.5023 19.1463 50.5023 19.1463C50.5023 19.1463 50.5023 19.1463 50.5023 19.1463C50.5023 19.1463 50.5023 19.1463 50.5023 19.1463C50.5023 19.1463 50.5023 19.1463 50.5024 19.1463C50.5024 19.1463 50.5024 19.1463 50.5024 19.1463C50.5024 19.1463 50.5024 19.1463 50.5024 19.1463C50.5024 19.1463 50.5024 19.1463 50.5024 19.1463C50.5024 19.1463 50.5024 19.1463 50.5024 19.1463C50.5024 19.1463 50.5024 19.1463 50.5024 19.1463C50.5024 19.1463 50.5024 19.1463 50.5024 19.1463C50.5024 19.1463 50.5024 19.1463 50.5024 19.1463C50.5024 19.1463 50.5024 19.1463 50.5024 19.1463C50.5024 19.1463 50.5024 19.1463 50.5024 19.1463C50.5024 19.1463 50.5024 19.1463 50.5024 19.1463C50.5024 19.1463 50.5024 19.1463 50.5024 19.1463C50.5024 19.1463 50.5024 19.1463 50.5024 19.1463C50.5024 19.1463 50.5024 19.1463 50.5024 19.1463C50.5024 19.1463 50.5024 19.1463 50.5024 19.1463C50.5025 19.1463 50.5025 19.1463 50.5025 19.1463C50.5025 19.1463 50.5025 19.1463 50.5025 19.1463C50.5025 19.1463 50.5025 19.1463 50.5025 19.1463C50.5025 19.1463 50.5025 19.1463 50.5025 19.1463C50.5025 19.1463 50.5025 19.1463 50.5025 19.1463C50.5025 19.1463 50.5025 19.1463 50.5025 19.1463C50.5025 19.1463 50.5025 19.1463 50.5025 19.1463C50.5025 19.1463 50.5025 19.1463 50.5025 19.1463C50.5025 19.1463 50.5025 19.1463 50.5025 19.1463C50.5025 19.1463 50.5025 19.1463 50.5025 19.1463C50.5025 19.1463 50.5025 19.1463 50.5025 19.1463C50.5025 19.1463 50.5025 19.1463 50.5025 19.1463C50.5026 19.1463 50.5026 19.1463 50.5026 19.1463C50.5026 19.1463 50.5026 19.1463 50.5026 19.1463C50.5026 19.1463 50.5026 19.1463 50.5026 19.1463C50.5026 19.1463 50.5026 19.1463 50.5026 19.1463C50.5026 19.1463 50.5026 19.1463 50.5026 19.1463C50.5026 19.1463 50.5026 19.1463 50.5026 19.1463C50.5026 19.1463 50.5026 19.1463 50.5026 19.1463C50.5026 19.1463 50.5026 19.1463 50.5026 19.1463C50.5026 19.1463 50.5026 19.1463 50.5026 19.1463C50.5026 19.1463 50.5026 19.1463 50.5026 19.1463C50.5026 19.1463 50.5027 19.1463 50.5027 19.1463C50.5027 19.1463 50.5027 19.1463 50.5027 19.1463C50.5027 19.1463 50.5027 19.1463 50.5027 19.1463C50.5027 19.1463 50.5027 19.1463 50.5027 19.1463C50.5027 19.1463 50.5027 19.1463 50.5027 19.1463C50.5027 19.1463 50.5027 19.1463 50.5027 19.1463C50.5027 19.1463 50.5027 19.1463 50.5027 19.1463C50.5027 19.1463 50.5027 19.1463 50.5027 19.1463C50.5027 19.1463 50.5027 19.1463 50.5027 19.1463C50.5027 19.1463 50.5028 19.1463 50.5028 19.1463C50.5028 19.1463 50.5028 19.1463 50.5028 19.1463C50.5028 19.1463 50.5028 19.1463 50.5028 19.1463C50.5028 19.1463 50.5028 19.1463 50.5028 19.1463C50.5028 19.1463 50.5028 19.1463 50.5028 19.1463C50.5028 19.1463 50.5028 19.1463 50.5028 19.1463C50.5028 19.1463 50.5028 19.1463 50.5028 19.1463C50.5028 19.1463 50.5028 19.1463 50.5028 19.1463C50.5028 19.1463 50.5028 19.1463 50.5029 19.1463C50.5029 19.1463 50.5029 19.1463 50.5029 19.1463C50.5029 19.1463 50.5029 19.1463 50.5029 19.1463C50.5029 19.1463 50.5029 19.1463 50.5029 19.1463C50.5029 19.1463 50.5029 19.1463 50.5029 19.1463C50.5029 19.1463 50.5029 19.1463 50.5029 19.1463C50.5029 19.1463 50.5029 19.1463 50.5029 19.1463C50.5029 19.1463 50.5029 19.1463 50.5029 19.1463C50.5029 19.1463 50.503 19.1463 50.503 19.1463C50.503 19.1463 50.503 19.1463 50.503 19.1463C50.503 19.1463 50.503 19.1463 50.503 19.1463C50.503 19.1463 50.503 19.1463 50.503 19.1463C50.503 19.1463 50.503 19.1463 50.503 19.1463C50.503 19.1463 50.503 19.1463 50.503 19.1463C50.503 19.1463 50.503 19.1463 50.503 19.1463C50.503 19.1463 50.5031 19.1463 50.5031 19.1463C50.5031 19.1463 50.5031 19.1463 50.5031 19.1463C50.5031 19.1463 50.5031 19.1463 50.5031 19.1463C50.5031 19.1463 50.5031 19.1463 50.5031 19.1463C50.5031 19.1463 50.5031 19.1463 50.5031 19.1463C50.5031 19.1463 50.5031 19.1463 50.5031 19.1463C50.5031 19.1463 50.5031 19.1463 50.5031 19.1463C50.5032 19.1463 50.5032 19.1463 50.5032 19.1463C50.5032 19.1463 50.5032 19.1463 50.5032 19.1463C50.5032 19.1463 50.5032 19.1463 50.5032 19.1463C50.5032 19.1463 50.5032 19.1463 50.5032 19.1463C50.5032 19.1463 50.5032 19.1463 50.5032 19.1463C50.5032 19.1463 50.5032 19.1463 50.5032 19.1463C50.5033 19.1463 50.5033 19.1463 50.5033 19.1463C50.5033 19.1463 50.5033 19.1463 50.5033 19.1463C50.5033 19.1463 50.5033 19.1463 50.5033 19.1463C50.5033 19.1463 50.5033 19.1463 50.5033 19.1463C50.5033 19.1463 50.5033 19.1463 50.5033 19.1463C50.5033 19.1463 50.5033 19.1463 50.5033 19.1463C50.5034 19.1463 50.5034 19.1463 50.5034 19.1463C50.5034 19.1463 50.5034 19.1463 50.5034 19.1463C50.5034 19.1463 50.5034 19.1463 50.5034 19.1463C50.5034 19.1463 50.5034 19.1463 50.5034 19.1463C50.5034 19.1463 50.5034 19.1463 50.5034 19.1463C50.5034 19.1463 50.5035 19.1463 50.5035 19.1463C50.5035 19.1463 50.5035 19.1463 50.5035 19.1463C50.5035 19.1463 50.5035 19.1463 50.5035 19.1463C50.5035 19.1463 50.5035 19.1463 50.5035 19.1463C50.5035 19.1463 50.5035 19.1463 50.5035 19.1463C50.5035 19.1463 50.5035 19.1463 50.5036 19.1463C50.5036 19.1463 50.5036 19.1463 50.5036 19.1463C50.5036 19.1463 50.5036 19.1463 50.5036 19.1463C50.5036 19.1463 50.5036 19.1463 50.5036 19.1463C50.5036 19.1463 50.5036 19.1463 50.5036 19.1463C50.5036 19.1463 50.5036 19.1463 50.5037 19.1463C50.5037 19.1463 50.5037 19.1463 50.5037 19.1463C50.5037 19.1463 50.5037 19.1463 50.5037 19.1463C50.5037 19.1463 50.5037 19.1463 50.5037 19.1463C50.5037 19.1463 50.5037 19.1463 50.5037 19.1463C50.5037 19.1463 50.5037 19.1463 50.5038 19.1463C50.5038 19.1463 50.5038 19.1463 50.5038 19.1463C50.5038 19.1463 50.5038 19.1463 50.5038 19.1463C50.5038 19.1463 50.5038 19.1463 50.5038 19.1463C50.5038 19.1463 50.5038 19.1463 50.5038 19.1463C50.5039 19.1463 50.5039 19.1463 50.5039 19.1463C50.5039 19.1463 50.5039 19.1463 50.5039 19.1463C50.5039 19.1463 50.5039 19.1463 50.5039 19.1463C50.5039 19.1463 50.5039 19.1463 50.5039 19.1463C50.5039 19.1463 50.5039 19.1463 50.504 19.1463C50.504 19.1463 50.504 19.1463 50.504 19.1463C50.504 19.1463 50.504 19.1463 50.504 19.1463C50.504 19.1463 50.504 19.1463 50.504 19.1463C50.504 19.1463 50.504 19.1463 50.504 19.1463C50.5041 19.1463 50.5041 19.1463 50.5041 19.1463C50.5041 19.1463 50.5041 19.1463 50.5041 19.1463C50.5041 19.1463 50.5041 19.1463 50.5041 19.1463C50.5041 19.1463 50.5041 19.1463 50.5041 19.1463C50.5042 19.1463 50.5042 19.1463 50.5042 19.1463C50.5042 19.1463 50.5042 19.1463 50.5042 19.1463C50.5042 19.1463 50.5042 19.1463 50.5042 19.1463C50.5042 19.1463 50.5042 19.1463 50.5042 19.1463C50.5043 19.1463 50.5043 19.1463 50.5043 19.1463C50.5043 19.1463 50.5043 19.1463 50.5043 19.1463C50.5043 19.1463 50.5043 19.1463 50.5043 19.1463C50.5043 19.1463 50.5043 19.1463 50.5043 19.1463C50.5044 19.1463 50.5044 19.1463 50.5044 19.1463C50.5044 19.1463 50.5044 19.1463 50.5044 19.1463C50.5044 19.1463 50.5044 19.1463 50.5044 19.1463C50.5044 19.1463 50.5044 19.1463 50.5045 19.1463C50.5045 19.1463 50.5045 19.1463 50.5045 19.1463C50.5045 19.1463 50.5045 19.1463 50.5045 19.1463C50.5045 19.1463 50.5045 19.1463 50.5045 19.1463C50.5045 19.1463 50.5046 19.1463 50.5046 19.1463C50.5046 19.1463 50.5046 19.1463 50.5046 19.1463C50.5046 19.1463 50.5046 19.1463 50.5046 19.1463C50.5046 19.1463 50.5046 19.1463 50.5046 19.1463C50.5047 19.1463 50.5047 19.1463 50.5047 19.1463C50.5047 19.1463 50.5047 19.1463 50.5047 19.1463C50.5047 19.1463 50.5047 19.1463 50.5047 19.1463C50.5047 19.1463 50.5048 19.1463 50.5048 19.1463C50.5048 19.1463 50.5048 19.1463 50.5048 19.1463C50.5048 19.1463 50.5048 19.1463 50.5048 19.1463C50.5048 19.1463 50.5048 19.1463 50.5049 19.1463C50.5049 19.1463 50.5049 19.1463 50.5049 19.1463C50.5049 19.1463 50.5049 19.1463 50.5049 19.1463C50.5049 19.1463 50.5049 19.1463 50.5049 19.1463C50.505 19.1463 50.505 19.1463 50.505 19.1463C50.505 19.1463 50.505 19.1463 50.505 19.1463C50.505 19.1463 50.505 19.1463 50.505 19.1463C50.505 19.1463 50.5051 19.1463 50.5051 19.1463C50.5051 19.1463 50.5051 19.1463 50.5051 19.1463C50.5051 19.1463 50.5051 19.1463 50.5051 19.1463C50.5051 19.1463 50.5051 19.1463 50.5052 19.1463C50.5052 19.1463 50.5052 19.1463 50.5052 19.1463C50.5052 19.1463 50.5052 19.1463 50.5052 19.1463C50.5052 19.1463 50.5052 19.1463 50.5053 19.1463C50.5053 19.1463 50.5053 19.1463 50.5053 19.1463C50.5053 19.1463 50.5053 19.1463 50.5053 19.1463C50.5053 19.1463 50.5053 19.1463 50.5054 19.1463C50.5054 19.1463 50.5054 19.1463 50.5054 19.1463C50.5054 19.1463 50.5054 19.1463 50.5054 19.1463C50.5054 19.1463 50.5054 19.1463 50.5055 19.1463C50.5055 19.1463 50.5055 19.1463 50.5055 19.1463C50.5055 19.1463 50.5055 19.1463 50.5055 19.1463C50.5055 19.1463 50.5055 19.1463 50.5056 19.1463C50.5056 19.1463 50.5056 19.1463 50.5056 19.1463C50.5056 19.1463 50.5056 19.1463 50.5056 19.1463C50.5056 19.1463 50.5057 19.1463 50.5057 19.1463C50.5057 19.1463 50.5057 19.1463 50.5057 19.1463C50.5057 19.1463 50.5057 19.1463 50.5057 19.1463C50.5057 19.1463 50.5058 19.1463 50.5058 19.1463C50.5058 19.1463 50.5058 19.1463 50.5058 19.1463C50.5058 19.1463 50.5058 19.1463 50.5058 19.1463C50.5059 19.1463 50.5059 19.1463 50.5059 19.1463C50.5059 19.1463 50.5059 19.1463 50.5059 19.1463C50.5059 19.1463 50.5059 19.1463 50.506 19.1463C50.506 19.1463 50.506 19.1463 50.506 19.1463C50.506 19.1463 50.506 19.1463 50.506 19.1463C50.506 19.1463 50.5061 19.1463 50.5061 19.1463C50.5061 19.1463 50.5061 19.1463 50.5061 19.1463C50.5061 19.1463 50.5061 19.1463 50.5061 19.1463C50.5062 19.1463 50.5062 19.1463 50.5062 19.1463C50.5062 19.1463 50.5062 19.1463 50.5062 19.1463C50.5062 19.1463 50.5063 19.1463 50.5063 19.1463C50.5063 19.1463 50.5063 19.1463 50.5063 19.1463C50.5063 19.1463 50.5063 19.1463 50.5063 19.1463C50.5064 19.1463 50.5064 19.1463 50.5064 19.1463C50.5064 19.1463 50.5064 19.1463 50.5064 19.1463C50.5064 19.1463 50.5064 19.1463 50.5065 19.1463C50.5065 19.1463 50.5065 19.1463 50.5065 19.1463C50.5065 19.1463 50.5065 19.1463 50.5065 19.1463C50.5066 19.1463 50.5066 19.1463 50.5066 19.1463C50.5066 19.1463 50.5066 19.1463 50.5066 19.1463C50.5066 19.1463 50.5067 19.1463 50.5067 19.1463C50.5067 19.1463 50.5067 19.1463 50.5067 19.1463C50.5067 19.1463 50.5067 19.1463 50.5068 19.1463C50.5068 19.1463 50.5068 19.1463 50.5068 19.1463C50.5068 19.1463 50.5068 19.1463 50.5068 19.1463C50.5069 19.1463 50.5069 19.1463 50.5069 19.1463C50.5069 19.1463 50.5069 19.1463 50.5069 19.1463C50.5069 19.1463 50.507 19.1463 50.507 19.1463C50.507 19.1463 50.507 19.1463 50.507 19.1463C50.507 19.1463 50.507 19.1463 50.5071 19.1463C50.5071 19.1463 50.5071 19.1463 50.5071 19.1463C50.5071 19.1463 50.5071 19.1463 50.5071 19.1463C50.5072 19.1463 50.5072 19.1463 50.5072 19.1463C50.5072 19.1463 50.5072 19.1463 50.5072 19.1463C50.5072 19.1463 50.5073 19.1463 50.5073 19.1463C50.5073 19.1463 50.5073 19.1463 50.5073 19.1463C50.5073 19.1463 50.5074 19.1463 50.5074 19.1463C50.5074 19.1463 50.5074 19.1463 50.5074 19.1463C50.5074 19.1463 50.5074 19.1463 50.5075 19.1463C50.5075 19.1463 50.5075 19.1463 50.5075 19.1463C50.5075 19.1463 50.5075 19.1463 50.5076 19.1463C50.5076 19.1463 50.5076 19.1463 50.5076 19.1463C50.5076 19.1463 50.5076 19.1463 50.5077 19.1463C50.5077 19.1463 50.5077 19.1463 50.5077 19.1463C50.5077 19.1463 50.5077 19.1463 50.5077 19.1463C50.5078 19.1463 50.5078 19.1463 50.5078 19.1463C50.5078 19.1463 50.5078 19.1463 50.5078 19.1463C50.5079 19.1463 50.5079 19.1463 50.5079 19.1463C50.5079 19.1463 50.5079 19.1463 50.5079 19.1463C50.508 19.1463 50.508 19.1463 50.508 19.1463C50.508 19.1463 50.508 19.1463 50.508 19.1463C50.5081 19.1463 50.5081 19.1463 50.5081 19.1463C50.5081 19.1463 50.5081 19.1463 50.5081 19.1463C50.5082 19.1463 50.5082 19.1463 50.5082 19.1463C50.5082 19.1463 50.5082 19.1463 50.5082 19.1463C50.5083 19.1463 50.5083 19.1463 50.5083 19.1463C50.5083 19.1463 50.5083 19.1463 50.5083 19.1463C50.5084 19.1463 50.5084 19.1463 50.5084 19.1463C50.5084 19.1463 50.5084 19.1463 50.5084 19.1463C50.5085 19.1463 50.5085 19.1463 50.5085 19.1463C50.5085 19.1463 50.5085 19.1463 50.5086 19.1463C50.5086 19.1463 50.5086 19.1463 50.5086 19.1463C50.5086 19.1463 50.5086 19.1463 50.5087 19.1463C50.5087 19.1463 50.5087 19.1463 50.5087 19.1463C50.5087 19.1463 50.5087 19.1463 50.5088 19.1463C50.5088 19.1463 50.5088 19.1463 50.5088 19.1463C50.5088 19.1463 50.5089 19.1463 50.5089 19.1463C50.5089 19.1463 50.5089 19.1463 50.5089 19.1463C50.5089 19.1463 50.509 19.1463 50.509 19.1463C50.509 19.1463 50.509 19.1463 50.509 19.1463C50.5091 19.1463 50.5091 19.1463 50.5091 19.1463C50.5091 19.1463 50.5091 19.1463 50.5091 19.1463C50.5092 19.1463 50.5092 19.1463 50.5092 19.1463C50.5092 19.1463 50.5092 19.1463 50.5093 19.1463C50.5093 19.1463 50.5093 19.1463 50.5093 19.1463C50.5093 19.1463 50.5094 19.1463 50.5094 19.1463C50.5094 19.1463 50.5094 19.1463 50.5094 19.1463C50.5094 19.1463 50.5095 19.1463 50.5095 19.1463C50.5095 19.1463 50.5095 19.1463 50.5095 19.1463C50.5096 19.1463 50.5096 19.1463 50.5096 19.1463C50.5096 19.1463 50.5096 19.1463 50.5097 19.1463C50.5097 19.1463 50.5097 19.1463 50.5097 19.1463C50.5097 19.1463 50.5098 19.1463 50.5098 19.1463C50.5098 19.1463 50.5098 19.1463 50.5098 19.1463C50.5099 19.1463 50.5099 19.1463 50.5099 19.1463C50.5099 19.1463 50.5099 19.1463 50.51 19.1463C50.51 19.1463 50.51 19.1463 50.51 19.1463C50.51 19.1463 50.5101 19.1463 50.5101 19.1463C50.5101 19.1463 50.5101 19.1463 50.5101 19.1463C50.5102 19.1463 50.5102 19.1463 50.5102 19.1463C50.5102 19.1463 50.5102 19.1463 50.5103 19.1463C50.5103 19.1463 50.5103 19.1463 50.5103 19.1463C50.5103 19.1463 50.5104 19.1463 50.5104 19.1463C50.5104 19.1463 50.5104 19.1463 50.5104 19.1463C50.5105 19.1463 50.5105 19.1463 50.5105 19.1463C50.5105 19.1463 50.5105 19.1463 50.5106 19.1463C50.5106 19.1463 50.5106 19.1463 50.5106 19.1463C50.5107 19.1463 50.5107 19.1463 50.5107 19.1463C50.5107 19.1463 50.5107 19.1463 50.5108 19.1463C50.5108 19.1463 50.5108 19.1463 50.5108 19.1463C50.5108 19.1463 50.5109 19.1463 50.5109 19.1463C50.5109 19.1463 50.5109 19.1463 50.511 19.1463C50.511 19.1463 50.511 19.1463 50.511 19.1463C50.511 19.1463 50.5111 19.1463 50.5111 19.1463C50.5111 19.1463 50.5111 19.1463 50.5112 19.1463C50.5112 19.1463 50.5112 19.1463 50.5112 19.1463C50.5112 19.1463 50.5113 19.1463 50.5113 19.1463C50.5113 19.1463 50.5113 19.1463 50.5113 19.1463C50.5114 19.1463 50.5114 19.1463 50.5114 19.1463C50.5114 19.1463 50.5115 19.1463 50.5115 19.1463C50.5115 19.1463 50.5115 19.1463 50.5116 19.1463C50.5116 19.1463 50.5116 19.1463 50.5116 19.1463C50.5116 19.1463 50.5117 19.1463 50.5117 19.1463C50.5117 19.1463 50.5117 19.1463 50.5118 19.1463C50.5118 19.1463 50.5118 19.1463 50.5118 19.1463C50.5118 19.1463 50.5119 19.1463 50.5119 19.1463C50.5119 19.1463 50.5119 19.1463 50.512 19.1463C50.512 19.1463 50.512 19.1463 50.512 19.1463C50.5121 19.1463 50.5121 19.1463 50.5121 19.1463C50.5121 19.1463 50.5122 19.1463 50.5122 19.1463C50.5122 19.1463 50.5122 19.1463 50.5122 19.1463C50.5123 19.1463 50.5123 19.1463 50.5123 19.1463C50.5123 19.1463 50.5124 19.1463 50.5124 19.1463C50.5124 19.1463 50.5124 19.1463 50.5125 19.1463C50.5125 19.1463 50.5125 19.1463 50.5125 19.1463C50.5126 19.1463 50.5126 19.1463 50.5126 19.1463C50.5126 19.1463 50.5127 19.1463 50.5127 19.1463C50.5127 19.1463 50.5127 19.1463 50.5128 19.1463C50.5128 19.1463 50.5128 19.1463 50.5128 19.1463C50.5128 19.1463 50.5129 19.1463 50.5129 19.1463C50.5129 19.1463 50.5129 19.1463 50.513 19.1463C50.513 19.1463 50.513 19.1463 50.513 19.1463C50.5131 19.1463 50.5131 19.1463 50.5131 19.1463C50.5131 19.1463 50.5132 19.1463 50.5132 19.1463C50.5132 19.1463 50.5132 19.1463 50.5133 19.1463C50.5133 19.1463 50.5133 19.1463 50.5133 19.1463C50.5134 19.1463 50.5134 19.1463 50.5134 19.1463C50.5135 19.1463 50.5135 19.1463 50.5135 19.1463C50.5135 19.1463 50.5136 19.1463 50.5136 19.1463C50.5136 19.1463 50.5136 19.1463 50.5137 19.1463C50.5137 19.1463 50.5137 19.1463 50.5137 19.1463C50.5138 19.1463 50.5138 19.1463 50.5138 19.1463C50.5138 19.1463 50.5139 19.1463 50.5139 19.1463C50.5139 19.1463 50.5139 19.1463 50.514 19.1463C50.514 19.1463 50.514 19.1463 50.514 19.1463C50.5141 19.1463 50.5141 19.1463 50.5141 19.1463C50.5142 19.1463 50.5142 19.1463 50.5142 19.1463C50.5142 19.1463 50.5143 19.1463 50.5143 19.1463C50.5143 19.1463 50.5143 19.1463 50.5144 19.1463C50.5144 19.1463 50.5144 19.1463 50.5144 19.1463C50.5145 19.1463 50.5145 19.1463 50.5145 19.1463C50.5146 19.1463 50.5146 19.1463 50.5146 19.1463C50.5146 19.1463 50.5147 19.1463 50.5147 19.1463C50.5147 19.1463 50.5147 19.1463 50.5148 19.1463C50.5148 19.1463 50.5148 19.1463 50.5149 19.1463C50.5149 19.1463 50.5149 19.1463 50.5149 19.1463C50.515 19.1463 50.515 19.1463 50.515 19.1463C50.5151 19.1463 50.5151 19.1463 50.5151 19.1463C50.5151 19.1463 50.5152 19.1463 50.5152 19.1463C50.5152 19.1463 50.5152 19.1463 50.5153 19.1463C50.5153 19.1463 50.5153 19.1463 50.5154 19.1463C50.5154 19.1463 50.5154 19.1463 50.5154 19.1463C50.5155 19.1463 50.5155 19.1463 50.5155 19.1463C50.5156 19.1463 50.5156 19.1463 50.5156 19.1463C50.5156 19.1463 50.5157 19.1463 50.5157 19.1463C50.5157 19.1463 50.5158 19.1463 50.5158 19.1463C50.5158 19.1463 50.5158 19.1463 50.5159 19.1463C50.5159 19.1463 50.5159 19.1463 50.516 19.1463C50.516 19.1463 50.516 19.1463 50.5161 19.1463C50.5161 19.1463 50.5161 19.1463 50.5161 19.1463C50.5162 19.1463 50.5162 19.1463 50.5162 19.1463C50.5163 19.1463 50.5163 19.1463 50.5163 19.1463C50.5163 19.1463 50.5164 19.1463 50.5164 19.1463C50.5164 19.1463 50.5165 19.1463 50.5165 19.1463C50.5165 19.1463 50.5166 19.1463 50.5166 19.1463C50.5166 19.1463 50.5166 19.1463 50.5167 19.1463C50.5167 19.1463 50.5167 19.1463 50.5168 19.1463C50.5168 19.1463 50.5168 19.1463 50.5169 19.1463C50.5169 19.1463 50.5169 19.1463 50.5169 19.1463C50.517 19.1463 50.517 19.1463 50.517 19.1463C50.5171 19.1463 50.5171 19.1463 50.5171 19.1463C50.5172 19.1463 50.5172 19.1463 50.5172 19.1463C50.5173 19.1463 50.5173 19.1463 50.5173 19.1463C50.5173 19.1463 50.5174 19.1463 50.5174 19.1463C50.5174 19.1463 50.5175 19.1463 50.5175 19.1463C50.5175 19.1463 50.5176 19.1463 50.5176 19.1463C50.5176 19.1463 50.5177 19.1463 50.5177 19.1463C50.5177 19.1463 50.5178 19.1463 50.5178 19.1463C50.5178 19.1463 50.5179 19.1463 50.5179 19.1463C50.5179 19.1463 50.5179 19.1463 50.518 19.1463C50.518 19.1463 50.518 19.1463 50.5181 19.1463C50.5181 19.1463 50.5181 19.1463 50.5182 19.1463C50.5182 19.1463 50.5182 19.1463 50.5183 19.1463C50.5183 19.1463 50.5183 19.1463 50.5184 19.1463C50.5184 19.1463 50.5184 19.1463 50.5185 19.1463C50.5185 19.1463 50.5185 19.1463 50.5186 19.1463C50.5186 19.1463 50.5186 19.1463 50.5187 19.1463C50.5187 19.1463 50.5187 19.1463 50.5188 19.1463C50.5188 19.1463 50.5188 19.1463 50.5189 19.1463C50.5189 19.1463 50.5189 19.1463 50.519 19.1463C50.519 19.1463 50.519 19.1463 50.5191 19.1463C50.5191 19.1463 50.5191 19.1463 50.5192 19.1463C50.5192 19.1463 50.5192 19.1463 50.5193 19.1463C50.5193 19.1463 50.5193 19.1463 50.5194 19.1463V17.1463C50.5193 17.1463 50.5193 17.1463 50.5193 17.1463C50.5192 17.1463 50.5192 17.1463 50.5192 17.1463C50.5191 17.1463 50.5191 17.1463 50.5191 17.1463C50.519 17.1463 50.519 17.1463 50.519 17.1463C50.5189 17.1463 50.5189 17.1463 50.5189 17.1463C50.5188 17.1463 50.5188 17.1463 50.5188 17.1463C50.5187 17.1463 50.5187 17.1463 50.5187 17.1463C50.5186 17.1463 50.5186 17.1463 50.5186 17.1463C50.5185 17.1463 50.5185 17.1463 50.5185 17.1463C50.5184 17.1463 50.5184 17.1463 50.5184 17.1463C50.5183 17.1463 50.5183 17.1463 50.5183 17.1463C50.5182 17.1463 50.5182 17.1463 50.5182 17.1463C50.5181 17.1463 50.5181 17.1463 50.5181 17.1463C50.518 17.1463 50.518 17.1463 50.518 17.1463C50.5179 17.1463 50.5179 17.1463 50.5179 17.1463C50.5179 17.1463 50.5178 17.1463 50.5178 17.1463C50.5178 17.1463 50.5177 17.1463 50.5177 17.1463C50.5177 17.1463 50.5176 17.1463 50.5176 17.1463C50.5176 17.1463 50.5175 17.1463 50.5175 17.1463C50.5175 17.1463 50.5174 17.1463 50.5174 17.1463C50.5174 17.1463 50.5173 17.1463 50.5173 17.1463C50.5173 17.1463 50.5173 17.1463 50.5172 17.1463C50.5172 17.1463 50.5172 17.1463 50.5171 17.1463C50.5171 17.1463 50.5171 17.1463 50.517 17.1463C50.517 17.1463 50.517 17.1463 50.5169 17.1463C50.5169 17.1463 50.5169 17.1463 50.5169 17.1463C50.5168 17.1463 50.5168 17.1463 50.5168 17.1463C50.5167 17.1463 50.5167 17.1463 50.5167 17.1463C50.5166 17.1463 50.5166 17.1463 50.5166 17.1463C50.5166 17.1463 50.5165 17.1463 50.5165 17.1463C50.5165 17.1463 50.5164 17.1463 50.5164 17.1463C50.5164 17.1463 50.5163 17.1463 50.5163 17.1463C50.5163 17.1463 50.5163 17.1463 50.5162 17.1463C50.5162 17.1463 50.5162 17.1463 50.5161 17.1463C50.5161 17.1463 50.5161 17.1463 50.5161 17.1463C50.516 17.1463 50.516 17.1463 50.516 17.1463C50.5159 17.1463 50.5159 17.1463 50.5159 17.1463C50.5158 17.1463 50.5158 17.1463 50.5158 17.1463C50.5158 17.1463 50.5157 17.1463 50.5157 17.1463C50.5157 17.1463 50.5156 17.1463 50.5156 17.1463C50.5156 17.1463 50.5156 17.1463 50.5155 17.1463C50.5155 17.1463 50.5155 17.1463 50.5154 17.1463C50.5154 17.1463 50.5154 17.1463 50.5154 17.1463C50.5153 17.1463 50.5153 17.1463 50.5153 17.1463C50.5152 17.1463 50.5152 17.1463 50.5152 17.1463C50.5152 17.1463 50.5151 17.1463 50.5151 17.1463C50.5151 17.1463 50.5151 17.1463 50.515 17.1463C50.515 17.1463 50.515 17.1463 50.5149 17.1463C50.5149 17.1463 50.5149 17.1463 50.5149 17.1463C50.5148 17.1463 50.5148 17.1463 50.5148 17.1463C50.5147 17.1463 50.5147 17.1463 50.5147 17.1463C50.5147 17.1463 50.5146 17.1463 50.5146 17.1463C50.5146 17.1463 50.5146 17.1463 50.5145 17.1463C50.5145 17.1463 50.5145 17.1463 50.5144 17.1463C50.5144 17.1463 50.5144 17.1463 50.5144 17.1463C50.5143 17.1463 50.5143 17.1463 50.5143 17.1463C50.5143 17.1463 50.5142 17.1463 50.5142 17.1463C50.5142 17.1463 50.5142 17.1463 50.5141 17.1463C50.5141 17.1463 50.5141 17.1463 50.514 17.1463C50.514 17.1463 50.514 17.1463 50.514 17.1463C50.5139 17.1463 50.5139 17.1463 50.5139 17.1463C50.5139 17.1463 50.5138 17.1463 50.5138 17.1463C50.5138 17.1463 50.5138 17.1463 50.5137 17.1463C50.5137 17.1463 50.5137 17.1463 50.5137 17.1463C50.5136 17.1463 50.5136 17.1463 50.5136 17.1463C50.5136 17.1463 50.5135 17.1463 50.5135 17.1463C50.5135 17.1463 50.5135 17.1463 50.5134 17.1463C50.5134 17.1463 50.5134 17.1463 50.5133 17.1463C50.5133 17.1463 50.5133 17.1463 50.5133 17.1463C50.5132 17.1463 50.5132 17.1463 50.5132 17.1463C50.5132 17.1463 50.5131 17.1463 50.5131 17.1463C50.5131 17.1463 50.5131 17.1463 50.513 17.1463C50.513 17.1463 50.513 17.1463 50.513 17.1463C50.5129 17.1463 50.5129 17.1463 50.5129 17.1463C50.5129 17.1463 50.5128 17.1463 50.5128 17.1463C50.5128 17.1463 50.5128 17.1463 50.5128 17.1463C50.5127 17.1463 50.5127 17.1463 50.5127 17.1463C50.5127 17.1463 50.5126 17.1463 50.5126 17.1463C50.5126 17.1463 50.5126 17.1463 50.5125 17.1463C50.5125 17.1463 50.5125 17.1463 50.5125 17.1463C50.5124 17.1463 50.5124 17.1463 50.5124 17.1463C50.5124 17.1463 50.5123 17.1463 50.5123 17.1463C50.5123 17.1463 50.5123 17.1463 50.5122 17.1463C50.5122 17.1463 50.5122 17.1463 50.5122 17.1463C50.5122 17.1463 50.5121 17.1463 50.5121 17.1463C50.5121 17.1463 50.5121 17.1463 50.512 17.1463C50.512 17.1463 50.512 17.1463 50.512 17.1463C50.5119 17.1463 50.5119 17.1463 50.5119 17.1463C50.5119 17.1463 50.5118 17.1463 50.5118 17.1463C50.5118 17.1463 50.5118 17.1463 50.5118 17.1463C50.5117 17.1463 50.5117 17.1463 50.5117 17.1463C50.5117 17.1463 50.5116 17.1463 50.5116 17.1463C50.5116 17.1463 50.5116 17.1463 50.5116 17.1463C50.5115 17.1463 50.5115 17.1463 50.5115 17.1463C50.5115 17.1463 50.5114 17.1463 50.5114 17.1463C50.5114 17.1463 50.5114 17.1463 50.5113 17.1463C50.5113 17.1463 50.5113 17.1463 50.5113 17.1463C50.5113 17.1463 50.5112 17.1463 50.5112 17.1463C50.5112 17.1463 50.5112 17.1463 50.5112 17.1463C50.5111 17.1463 50.5111 17.1463 50.5111 17.1463C50.5111 17.1463 50.511 17.1463 50.511 17.1463C50.511 17.1463 50.511 17.1463 50.511 17.1463C50.5109 17.1463 50.5109 17.1463 50.5109 17.1463C50.5109 17.1463 50.5108 17.1463 50.5108 17.1463C50.5108 17.1463 50.5108 17.1463 50.5108 17.1463C50.5107 17.1463 50.5107 17.1463 50.5107 17.1463C50.5107 17.1463 50.5107 17.1463 50.5106 17.1463C50.5106 17.1463 50.5106 17.1463 50.5106 17.1463C50.5105 17.1463 50.5105 17.1463 50.5105 17.1463C50.5105 17.1463 50.5105 17.1463 50.5104 17.1463C50.5104 17.1463 50.5104 17.1463 50.5104 17.1463C50.5104 17.1463 50.5103 17.1463 50.5103 17.1463C50.5103 17.1463 50.5103 17.1463 50.5103 17.1463C50.5102 17.1463 50.5102 17.1463 50.5102 17.1463C50.5102 17.1463 50.5102 17.1463 50.5101 17.1463C50.5101 17.1463 50.5101 17.1463 50.5101 17.1463C50.5101 17.1463 50.51 17.1463 50.51 17.1463C50.51 17.1463 50.51 17.1463 50.51 17.1463C50.5099 17.1463 50.5099 17.1463 50.5099 17.1463C50.5099 17.1463 50.5099 17.1463 50.5098 17.1463C50.5098 17.1463 50.5098 17.1463 50.5098 17.1463C50.5098 17.1463 50.5097 17.1463 50.5097 17.1463C50.5097 17.1463 50.5097 17.1463 50.5097 17.1463C50.5096 17.1463 50.5096 17.1463 50.5096 17.1463C50.5096 17.1463 50.5096 17.1463 50.5095 17.1463C50.5095 17.1463 50.5095 17.1463 50.5095 17.1463C50.5095 17.1463 50.5094 17.1463 50.5094 17.1463C50.5094 17.1463 50.5094 17.1463 50.5094 17.1463C50.5094 17.1463 50.5093 17.1463 50.5093 17.1463C50.5093 17.1463 50.5093 17.1463 50.5093 17.1463C50.5092 17.1463 50.5092 17.1463 50.5092 17.1463C50.5092 17.1463 50.5092 17.1463 50.5091 17.1463C50.5091 17.1463 50.5091 17.1463 50.5091 17.1463C50.5091 17.1463 50.5091 17.1463 50.509 17.1463C50.509 17.1463 50.509 17.1463 50.509 17.1463C50.509 17.1463 50.5089 17.1463 50.5089 17.1463C50.5089 17.1463 50.5089 17.1463 50.5089 17.1463C50.5089 17.1463 50.5088 17.1463 50.5088 17.1463C50.5088 17.1463 50.5088 17.1463 50.5088 17.1463C50.5087 17.1463 50.5087 17.1463 50.5087 17.1463C50.5087 17.1463 50.5087 17.1463 50.5087 17.1463C50.5086 17.1463 50.5086 17.1463 50.5086 17.1463C50.5086 17.1463 50.5086 17.1463 50.5086 17.1463C50.5085 17.1463 50.5085 17.1463 50.5085 17.1463C50.5085 17.1463 50.5085 17.1463 50.5084 17.1463C50.5084 17.1463 50.5084 17.1463 50.5084 17.1463C50.5084 17.1463 50.5084 17.1463 50.5083 17.1463C50.5083 17.1463 50.5083 17.1463 50.5083 17.1463C50.5083 17.1463 50.5083 17.1463 50.5082 17.1463C50.5082 17.1463 50.5082 17.1463 50.5082 17.1463C50.5082 17.1463 50.5082 17.1463 50.5081 17.1463C50.5081 17.1463 50.5081 17.1463 50.5081 17.1463C50.5081 17.1463 50.5081 17.1463 50.508 17.1463C50.508 17.1463 50.508 17.1463 50.508 17.1463C50.508 17.1463 50.508 17.1463 50.5079 17.1463C50.5079 17.1463 50.5079 17.1463 50.5079 17.1463C50.5079 17.1463 50.5079 17.1463 50.5078 17.1463C50.5078 17.1463 50.5078 17.1463 50.5078 17.1463C50.5078 17.1463 50.5078 17.1463 50.5077 17.1463C50.5077 17.1463 50.5077 17.1463 50.5077 17.1463C50.5077 17.1463 50.5077 17.1463 50.5077 17.1463C50.5076 17.1463 50.5076 17.1463 50.5076 17.1463C50.5076 17.1463 50.5076 17.1463 50.5076 17.1463C50.5075 17.1463 50.5075 17.1463 50.5075 17.1463C50.5075 17.1463 50.5075 17.1463 50.5075 17.1463C50.5074 17.1463 50.5074 17.1463 50.5074 17.1463C50.5074 17.1463 50.5074 17.1463 50.5074 17.1463C50.5074 17.1463 50.5073 17.1463 50.5073 17.1463C50.5073 17.1463 50.5073 17.1463 50.5073 17.1463C50.5073 17.1463 50.5072 17.1463 50.5072 17.1463C50.5072 17.1463 50.5072 17.1463 50.5072 17.1463C50.5072 17.1463 50.5072 17.1463 50.5071 17.1463C50.5071 17.1463 50.5071 17.1463 50.5071 17.1463C50.5071 17.1463 50.5071 17.1463 50.5071 17.1463C50.507 17.1463 50.507 17.1463 50.507 17.1463C50.507 17.1463 50.507 17.1463 50.507 17.1463C50.507 17.1463 50.5069 17.1463 50.5069 17.1463C50.5069 17.1463 50.5069 17.1463 50.5069 17.1463C50.5069 17.1463 50.5069 17.1463 50.5068 17.1463C50.5068 17.1463 50.5068 17.1463 50.5068 17.1463C50.5068 17.1463 50.5068 17.1463 50.5068 17.1463C50.5067 17.1463 50.5067 17.1463 50.5067 17.1463C50.5067 17.1463 50.5067 17.1463 50.5067 17.1463C50.5067 17.1463 50.5066 17.1463 50.5066 17.1463C50.5066 17.1463 50.5066 17.1463 50.5066 17.1463C50.5066 17.1463 50.5066 17.1463 50.5065 17.1463C50.5065 17.1463 50.5065 17.1463 50.5065 17.1463C50.5065 17.1463 50.5065 17.1463 50.5065 17.1463C50.5064 17.1463 50.5064 17.1463 50.5064 17.1463C50.5064 17.1463 50.5064 17.1463 50.5064 17.1463C50.5064 17.1463 50.5064 17.1463 50.5063 17.1463C50.5063 17.1463 50.5063 17.1463 50.5063 17.1463C50.5063 17.1463 50.5063 17.1463 50.5063 17.1463C50.5063 17.1463 50.5062 17.1463 50.5062 17.1463C50.5062 17.1463 50.5062 17.1463 50.5062 17.1463C50.5062 17.1463 50.5062 17.1463 50.5061 17.1463C50.5061 17.1463 50.5061 17.1463 50.5061 17.1463C50.5061 17.1463 50.5061 17.1463 50.5061 17.1463C50.5061 17.1463 50.506 17.1463 50.506 17.1463C50.506 17.1463 50.506 17.1463 50.506 17.1463C50.506 17.1463 50.506 17.1463 50.506 17.1463C50.5059 17.1463 50.5059 17.1463 50.5059 17.1463C50.5059 17.1463 50.5059 17.1463 50.5059 17.1463C50.5059 17.1463 50.5059 17.1463 50.5058 17.1463C50.5058 17.1463 50.5058 17.1463 50.5058 17.1463C50.5058 17.1463 50.5058 17.1463 50.5058 17.1463C50.5058 17.1463 50.5057 17.1463 50.5057 17.1463C50.5057 17.1463 50.5057 17.1463 50.5057 17.1463C50.5057 17.1463 50.5057 17.1463 50.5057 17.1463C50.5057 17.1463 50.5056 17.1463 50.5056 17.1463C50.5056 17.1463 50.5056 17.1463 50.5056 17.1463C50.5056 17.1463 50.5056 17.1463 50.5056 17.1463C50.5055 17.1463 50.5055 17.1463 50.5055 17.1463C50.5055 17.1463 50.5055 17.1463 50.5055 17.1463C50.5055 17.1463 50.5055 17.1463 50.5055 17.1463C50.5054 17.1463 50.5054 17.1463 50.5054 17.1463C50.5054 17.1463 50.5054 17.1463 50.5054 17.1463C50.5054 17.1463 50.5054 17.1463 50.5054 17.1463C50.5053 17.1463 50.5053 17.1463 50.5053 17.1463C50.5053 17.1463 50.5053 17.1463 50.5053 17.1463C50.5053 17.1463 50.5053 17.1463 50.5053 17.1463C50.5052 17.1463 50.5052 17.1463 50.5052 17.1463C50.5052 17.1463 50.5052 17.1463 50.5052 17.1463C50.5052 17.1463 50.5052 17.1463 50.5052 17.1463C50.5051 17.1463 50.5051 17.1463 50.5051 17.1463C50.5051 17.1463 50.5051 17.1463 50.5051 17.1463C50.5051 17.1463 50.5051 17.1463 50.5051 17.1463C50.5051 17.1463 50.505 17.1463 50.505 17.1463C50.505 17.1463 50.505 17.1463 50.505 17.1463C50.505 17.1463 50.505 17.1463 50.505 17.1463C50.505 17.1463 50.505 17.1463 50.5049 17.1463C50.5049 17.1463 50.5049 17.1463 50.5049 17.1463C50.5049 17.1463 50.5049 17.1463 50.5049 17.1463C50.5049 17.1463 50.5049 17.1463 50.5049 17.1463C50.5048 17.1463 50.5048 17.1463 50.5048 17.1463C50.5048 17.1463 50.5048 17.1463 50.5048 17.1463C50.5048 17.1463 50.5048 17.1463 50.5048 17.1463C50.5048 17.1463 50.5047 17.1463 50.5047 17.1463C50.5047 17.1463 50.5047 17.1463 50.5047 17.1463C50.5047 17.1463 50.5047 17.1463 50.5047 17.1463C50.5047 17.1463 50.5047 17.1463 50.5046 17.1463C50.5046 17.1463 50.5046 17.1463 50.5046 17.1463C50.5046 17.1463 50.5046 17.1463 50.5046 17.1463C50.5046 17.1463 50.5046 17.1463 50.5046 17.1463C50.5046 17.1463 50.5045 17.1463 50.5045 17.1463C50.5045 17.1463 50.5045 17.1463 50.5045 17.1463C50.5045 17.1463 50.5045 17.1463 50.5045 17.1463C50.5045 17.1463 50.5045 17.1463 50.5045 17.1463C50.5044 17.1463 50.5044 17.1463 50.5044 17.1463C50.5044 17.1463 50.5044 17.1463 50.5044 17.1463C50.5044 17.1463 50.5044 17.1463 50.5044 17.1463C50.5044 17.1463 50.5044 17.1463 50.5043 17.1463C50.5043 17.1463 50.5043 17.1463 50.5043 17.1463C50.5043 17.1463 50.5043 17.1463 50.5043 17.1463C50.5043 17.1463 50.5043 17.1463 50.5043 17.1463C50.5043 17.1463 50.5043 17.1463 50.5042 17.1463C50.5042 17.1463 50.5042 17.1463 50.5042 17.1463C50.5042 17.1463 50.5042 17.1463 50.5042 17.1463C50.5042 17.1463 50.5042 17.1463 50.5042 17.1463C50.5042 17.1463 50.5042 17.1463 50.5041 17.1463C50.5041 17.1463 50.5041 17.1463 50.5041 17.1463C50.5041 17.1463 50.5041 17.1463 50.5041 17.1463C50.5041 17.1463 50.5041 17.1463 50.5041 17.1463C50.5041 17.1463 50.5041 17.1463 50.504 17.1463C50.504 17.1463 50.504 17.1463 50.504 17.1463C50.504 17.1463 50.504 17.1463 50.504 17.1463C50.504 17.1463 50.504 17.1463 50.504 17.1463C50.504 17.1463 50.504 17.1463 50.504 17.1463C50.5039 17.1463 50.5039 17.1463 50.5039 17.1463C50.5039 17.1463 50.5039 17.1463 50.5039 17.1463C50.5039 17.1463 50.5039 17.1463 50.5039 17.1463C50.5039 17.1463 50.5039 17.1463 50.5039 17.1463C50.5039 17.1463 50.5039 17.1463 50.5038 17.1463C50.5038 17.1463 50.5038 17.1463 50.5038 17.1463C50.5038 17.1463 50.5038 17.1463 50.5038 17.1463C50.5038 17.1463 50.5038 17.1463 50.5038 17.1463C50.5038 17.1463 50.5038 17.1463 50.5038 17.1463C50.5037 17.1463 50.5037 17.1463 50.5037 17.1463C50.5037 17.1463 50.5037 17.1463 50.5037 17.1463C50.5037 17.1463 50.5037 17.1463 50.5037 17.1463C50.5037 17.1463 50.5037 17.1463 50.5037 17.1463C50.5037 17.1463 50.5037 17.1463 50.5037 17.1463C50.5036 17.1463 50.5036 17.1463 50.5036 17.1463C50.5036 17.1463 50.5036 17.1463 50.5036 17.1463C50.5036 17.1463 50.5036 17.1463 50.5036 17.1463C50.5036 17.1463 50.5036 17.1463 50.5036 17.1463C50.5036 17.1463 50.5036 17.1463 50.5036 17.1463C50.5035 17.1463 50.5035 17.1463 50.5035 17.1463C50.5035 17.1463 50.5035 17.1463 50.5035 17.1463C50.5035 17.1463 50.5035 17.1463 50.5035 17.1463C50.5035 17.1463 50.5035 17.1463 50.5035 17.1463C50.5035 17.1463 50.5035 17.1463 50.5035 17.1463C50.5035 17.1463 50.5034 17.1463 50.5034 17.1463C50.5034 17.1463 50.5034 17.1463 50.5034 17.1463C50.5034 17.1463 50.5034 17.1463 50.5034 17.1463C50.5034 17.1463 50.5034 17.1463 50.5034 17.1463C50.5034 17.1463 50.5034 17.1463 50.5034 17.1463C50.5034 17.1463 50.5034 17.1463 50.5033 17.1463C50.5033 17.1463 50.5033 17.1463 50.5033 17.1463C50.5033 17.1463 50.5033 17.1463 50.5033 17.1463C50.5033 17.1463 50.5033 17.1463 50.5033 17.1463C50.5033 17.1463 50.5033 17.1463 50.5033 17.1463C50.5033 17.1463 50.5033 17.1463 50.5033 17.1463C50.5033 17.1463 50.5033 17.1463 50.5032 17.1463C50.5032 17.1463 50.5032 17.1463 50.5032 17.1463C50.5032 17.1463 50.5032 17.1463 50.5032 17.1463C50.5032 17.1463 50.5032 17.1463 50.5032 17.1463C50.5032 17.1463 50.5032 17.1463 50.5032 17.1463C50.5032 17.1463 50.5032 17.1463 50.5032 17.1463C50.5032 17.1463 50.5032 17.1463 50.5031 17.1463C50.5031 17.1463 50.5031 17.1463 50.5031 17.1463C50.5031 17.1463 50.5031 17.1463 50.5031 17.1463C50.5031 17.1463 50.5031 17.1463 50.5031 17.1463C50.5031 17.1463 50.5031 17.1463 50.5031 17.1463C50.5031 17.1463 50.5031 17.1463 50.5031 17.1463C50.5031 17.1463 50.5031 17.1463 50.5031 17.1463C50.5031 17.1463 50.503 17.1463 50.503 17.1463C50.503 17.1463 50.503 17.1463 50.503 17.1463C50.503 17.1463 50.503 17.1463 50.503 17.1463C50.503 17.1463 50.503 17.1463 50.503 17.1463C50.503 17.1463 50.503 17.1463 50.503 17.1463C50.503 17.1463 50.503 17.1463 50.503 17.1463C50.503 17.1463 50.503 17.1463 50.503 17.1463C50.503 17.1463 50.5029 17.1463 50.5029 17.1463C50.5029 17.1463 50.5029 17.1463 50.5029 17.1463C50.5029 17.1463 50.5029 17.1463 50.5029 17.1463C50.5029 17.1463 50.5029 17.1463 50.5029 17.1463C50.5029 17.1463 50.5029 17.1463 50.5029 17.1463C50.5029 17.1463 50.5029 17.1463 50.5029 17.1463C50.5029 17.1463 50.5029 17.1463 50.5029 17.1463C50.5029 17.1463 50.5029 17.1463 50.5029 17.1463C50.5028 17.1463 50.5028 17.1463 50.5028 17.1463C50.5028 17.1463 50.5028 17.1463 50.5028 17.1463C50.5028 17.1463 50.5028 17.1463 50.5028 17.1463C50.5028 17.1463 50.5028 17.1463 50.5028 17.1463C50.5028 17.1463 50.5028 17.1463 50.5028 17.1463C50.5028 17.1463 50.5028 17.1463 50.5028 17.1463C50.5028 17.1463 50.5028 17.1463 50.5028 17.1463C50.5028 17.1463 50.5028 17.1463 50.5028 17.1463C50.5028 17.1463 50.5027 17.1463 50.5027 17.1463C50.5027 17.1463 50.5027 17.1463 50.5027 17.1463C50.5027 17.1463 50.5027 17.1463 50.5027 17.1463C50.5027 17.1463 50.5027 17.1463 50.5027 17.1463C50.5027 17.1463 50.5027 17.1463 50.5027 17.1463C50.5027 17.1463 50.5027 17.1463 50.5027 17.1463C50.5027 17.1463 50.5027 17.1463 50.5027 17.1463C50.5027 17.1463 50.5027 17.1463 50.5027 17.1463C50.5027 17.1463 50.5027 17.1463 50.5027 17.1463C50.5027 17.1463 50.5026 17.1463 50.5026 17.1463C50.5026 17.1463 50.5026 17.1463 50.5026 17.1463C50.5026 17.1463 50.5026 17.1463 50.5026 17.1463C50.5026 17.1463 50.5026 17.1463 50.5026 17.1463C50.5026 17.1463 50.5026 17.1463 50.5026 17.1463C50.5026 17.1463 50.5026 17.1463 50.5026 17.1463C50.5026 17.1463 50.5026 17.1463 50.5026 17.1463C50.5026 17.1463 50.5026 17.1463 50.5026 17.1463C50.5026 17.1463 50.5026 17.1463 50.5026 17.1463C50.5026 17.1463 50.5026 17.1463 50.5026 17.1463C50.5026 17.1463 50.5026 17.1463 50.5025 17.1463C50.5025 17.1463 50.5025 17.1463 50.5025 17.1463C50.5025 17.1463 50.5025 17.1463 50.5025 17.1463C50.5025 17.1463 50.5025 17.1463 50.5025 17.1463C50.5025 17.1463 50.5025 17.1463 50.5025 17.1463C50.5025 17.1463 50.5025 17.1463 50.5025 17.1463C50.5025 17.1463 50.5025 17.1463 50.5025 17.1463C50.5025 17.1463 50.5025 17.1463 50.5025 17.1463C50.5025 17.1463 50.5025 17.1463 50.5025 17.1463C50.5025 17.1463 50.5025 17.1463 50.5025 17.1463C50.5025 17.1463 50.5025 17.1463 50.5025 17.1463C50.5025 17.1463 50.5025 17.1463 50.5025 17.1463C50.5025 17.1463 50.5025 17.1463 50.5024 17.1463C50.5024 17.1463 50.5024 17.1463 50.5024 17.1463C50.5024 17.1463 50.5024 17.1463 50.5024 17.1463C50.5024 17.1463 50.5024 17.1463 50.5024 17.1463C50.5024 17.1463 50.5024 17.1463 50.5024 17.1463C50.5024 17.1463 50.5024 17.1463 50.5024 17.1463C50.5024 17.1463 50.5024 17.1463 50.5024 17.1463C50.5024 17.1463 50.5024 17.1463 50.5024 17.1463C50.5024 17.1463 50.5024 17.1463 50.5024 17.1463C50.5024 17.1463 50.5024 17.1463 50.5024 17.1463C50.5024 17.1463 50.5024 17.1463 50.5024 17.1463C50.5024 17.1463 50.5024 17.1463 50.5024 17.1463C50.5024 17.1463 50.5024 17.1463 50.5024 17.1463C50.5024 17.1463 50.5024 17.1463 50.5024 17.1463C50.5024 17.1463 50.5024 17.1463 50.5024 17.1463C50.5023 17.1463 50.5023 17.1463 50.5023 17.1463C50.5023 17.1463 50.5023 17.1463 50.5023 17.1463C50.5023 17.1463 50.5023 17.1463 50.5023 17.1463C50.5023 17.1463 50.5023 17.1463 50.5023 17.1463C50.5023 17.1463 50.5023 17.1463 50.5023 17.1463C50.5023 17.1463 50.5023 17.1463 50.5023 17.1463C50.5023 17.1463 50.5023 17.1463 50.5023 17.1463C50.5023 17.1463 50.5023 17.1463 50.5023 17.1463C50.5023 17.1463 50.5023 17.1463 50.5023 17.1463C50.5023 17.1463 50.5023 17.1463 50.5023 17.1463C50.5023 17.1463 50.5023 17.1463 50.5023 17.1463C50.5023 17.1463 50.5023 17.1463 50.5023 17.1463C50.5023 17.1463 50.5023 17.1463 50.5023 17.1463C50.5023 17.1463 50.5023 17.1463 50.5023 17.1463C50.5023 17.1463 50.5023 17.1463 50.5023 17.1463C50.5023 17.1463 50.5023 17.1463 50.5023 17.1463C50.5023 17.1463 50.5023 17.1463 50.5023 17.1463C50.5023 17.1463 50.5023 17.1463 50.5023 17.1463C50.5023 17.1463 50.5023 17.1463 50.5023 17.1463C50.5022 17.1463 50.5022 17.1463 50.5022 17.1463C50.5022 17.1463 50.5022 17.1463 50.5022 17.1463C50.5022 17.1463 50.5022 17.1463 50.5022 17.1463C50.5022 17.1463 50.5022 17.1463 50.5022 17.1463C50.5022 17.1463 50.5022 17.1463 50.5022 17.1463C50.5022 17.1463 50.5022 17.1463 50.5022 17.1463C50.5022 17.1463 50.5022 17.1463 50.5022 17.1463C50.5022 17.1463 50.5022 17.1463 50.5022 17.1463C50.5022 17.1463 50.5022 17.1463 50.5022 17.1463C50.5022 17.1463 50.5022 17.1463 50.5022 17.1463C50.5022 17.1463 50.5022 17.1463 50.5022 17.1463C50.5022 17.1463 50.5022 17.1463 50.5022 17.1463C50.5022 17.1463 50.5022 17.1463 50.5022 17.1463C50.5022 17.1463 50.5022 17.1463 50.5022 17.1463C50.5022 17.1463 50.5022 17.1463 50.5022 17.1463C50.5022 17.1463 50.5022 17.1463 50.5022 17.1463C50.5022 17.1463 50.5022 17.1463 50.5022 17.1463C50.5022 17.1463 50.5022 17.1463 50.5022 17.1463C50.5022 17.1463 50.5022 17.1463 50.5022 17.1463C50.5022 17.1463 50.5022 17.1463 50.5022 17.1463C50.5022 17.1463 50.5022 17.1463 50.5022 17.1463C50.5022 17.1463 50.5022 17.1463 50.5022 17.1463C50.5022 17.1463 50.5022 17.1463 50.5022 17.1463C50.5022 17.1463 50.5022 17.1463 50.5022 17.1463C50.5022 17.1463 50.5022 17.1463 50.5022 17.1463C50.5022 17.1463 50.5022 17.1463 50.5022 17.1463C50.5022 17.1463 50.5022 17.1463 50.5022 17.1463C50.5022 17.1463 50.5022 17.1463 50.5022 17.1463C50.5022 17.1463 50.5022 17.1463 50.5022 17.1463C50.5022 17.1463 50.5022 17.1463 50.5021 17.1463C50.5021 17.1463 50.5021 17.1463 50.5021 17.1463C50.5021 17.1463 50.5021 17.1463 50.5021 17.1463C50.5021 17.1463 50.5021 17.1463 50.5021 17.1463C50.5021 17.1463 50.5021 17.1463 50.5021 17.1463C50.5021 17.1463 50.5021 17.1463 50.5021 17.1463C50.5021 17.1463 50.5021 17.1463 50.5021 17.1463C50.5021 17.1463 50.5021 17.1463 50.5021 17.1463C50.5021 17.1463 50.5021 17.1463 50.5021 17.1463C50.5021 17.1463 50.5021 17.1463 50.5021 17.1463C50.5021 17.1463 50.5021 17.1463 50.5021 17.1463C50.5021 17.1463 50.5021 17.1463 50.5021 17.1463C50.5021 17.1463 50.5021 17.1463 50.5021 17.1463C50.5021 17.1463 50.5021 17.1463 50.5021 17.1463C50.5021 17.1463 50.5021 17.1463 50.5021 17.1463C50.5021 17.1463 50.5021 17.1463 50.5021 17.1463C50.5021 17.1463 50.5021 17.1463 50.5021 17.1463C50.5021 17.1463 50.5021 17.1463 50.5021 17.1463C50.5021 17.1463 50.5021 17.1463 50.5021 17.1463C50.5021 17.1463 50.5021 17.1463 50.5021 17.1463C50.5021 17.1463 50.5021 17.1463 50.5021 17.1463C50.5021 17.1463 50.5021 17.1463 50.5021 17.1463C50.5021 17.1463 50.5021 17.1463 50.5021 17.1463C50.5021 17.1463 50.5021 17.1463 50.5021 17.1463C50.5021 17.1463 50.5021 17.1463 50.5021 17.1463C50.5021 17.1463 50.5021 17.1463 50.5021 17.1463C50.5021 17.1463 50.5021 17.1463 50.5021 17.1463C50.5021 17.1463 50.5021 17.1463 50.5021 17.1463C50.5021 17.1463 50.5021 17.1463 50.5021 17.1463C50.5021 17.1463 50.5021 17.1463 50.5021 17.1463C50.5021 17.1463 50.5021 17.1463 50.5021 17.1463C50.5021 17.1463 50.5021 17.1463 50.5021 17.1463C50.5021 17.1463 50.5021 17.1463 50.5021 17.1463C50.5021 17.1463 50.5021 17.1463 50.5021 17.1463C50.5021 17.1463 50.5021 17.1463 50.5021 17.1463C50.5021 17.1463 50.5021 17.1463 50.5021 17.1463C50.5021 17.1463 50.5021 17.1463 50.5021 17.1463C50.5021 17.1463 50.5021 17.1463 50.5021 17.1463C50.5021 17.1463 50.5021 17.1463 50.5021 17.1463C50.5021 17.1463 50.5021 17.1463 50.5021 17.1463C50.5021 17.1463 50.5021 17.1463 50.5021 17.1463C50.5021 17.1463 50.5021 17.1463 50.5021 17.1463C50.5021 17.1463 50.5021 17.1463 50.5021 17.1463C50.5021 17.1463 50.5021 17.1463 50.5021 17.1463C50.5021 17.1463 50.5021 17.1463 50.5021 17.1463C50.5021 17.1463 50.5021 17.1463 50.5021 17.1463C50.5021 17.1463 50.5021 17.1463 50.5021 17.1463C50.5021 17.1463 50.5021 17.1463 50.5021 17.1463C50.5021 17.1463 50.5021 17.1463 50.5021 17.1463C50.5021 17.1463 50.5021 17.1463 50.5021 17.1463C50.5021 17.1463 50.5021 17.1463 50.5021 17.1463C50.5021 17.1463 50.5021 17.1463 50.5021 17.1463C50.5021 17.1463 50.5021 17.1463 50.5021 17.1463C50.5021 17.1463 50.5021 17.1463 50.5021 17.1463C50.5021 17.1463 50.5021 17.1463 50.5021 17.1463C50.5021 17.1463 50.5021 17.1463 50.5021 17.1463C50.5021 17.1463 50.5021 17.1463 50.5021 17.1463C50.5021 17.1463 50.5021 17.1463 50.5021 17.1463C50.5021 17.1463 50.5021 17.1463 50.5021 17.1463C50.5021 17.1463 50.5021 17.1463 50.5021 17.1463C50.5021 17.1463 50.5021 17.1463 50.5021 17.1463C50.5021 17.1463 50.5021 17.1463 50.5021 17.1463C50.5021 17.1463 50.5021 17.1463 50.5021 17.1463C50.5021 17.1463 50.5021 17.1463 50.5021 17.1463C50.5021 17.1463 50.5021 17.1463 50.5021 17.1463C50.5021 17.1463 50.5021 17.1463 50.5021 17.1463C50.5021 17.1463 50.5021 17.1463 50.5021 17.1463C50.5021 17.1463 50.5021 17.1463 50.5021 17.1463C50.5021 17.1463 50.5021 17.1463 50.5021 17.1463C50.5021 17.1463 50.5021 17.1463 50.5021 17.1463C50.5021 17.1463 50.5021 17.1463 50.5021 17.1463C50.5021 17.1463 50.5021 17.1463 50.5021 17.1463C50.5021 17.1463 50.5021 17.1463 50.5021 17.1463C50.5021 17.1463 50.5021 17.1463 50.5021 17.1463C50.5021 17.1463 50.5021 17.1463 50.5021 17.1463C50.5021 17.1463 50.5021 17.1463 50.5021 17.1463C50.5021 17.1463 50.5021 17.1463 50.5021 17.1463C50.5021 17.1463 50.5021 17.1463 50.5021 17.1463C50.5021 18.1463 50.5021 19.1463 50.5021 18.1463ZM50.5194 19.1463H54.9583V17.1463H50.5194V19.1463ZM54.9583 19.1463C55.1905 19.1463 55.3746 19.34 55.3746 19.5518H57.3746C57.3746 18.221 56.2806 17.1463 54.9583 17.1463V19.1463ZM55.3746 19.5518V19.8089H57.3746V19.5518H55.3746ZM56.3746 20.8089H56.4092V18.8089H56.3746V20.8089ZM21.865 39.3875C23.1183 39.3875 24.1604 38.3642 24.1604 37.102H22.1604C22.1604 37.2453 22.0281 37.3875 21.865 37.3875V39.3875ZM24.1604 37.102V30.1086H22.1604V37.102H24.1604ZM24.1604 30.1086C24.1604 28.8463 23.1183 27.823 21.865 27.823V29.823C22.0281 29.823 22.1604 29.9653 22.1604 30.1086H24.1604ZM21.865 27.823C20.6118 27.823 19.5696 28.8463 19.5696 30.1086H21.5696C21.5696 29.9653 21.7019 29.823 21.865 29.823V27.823ZM19.5696 30.1086V37.102H21.5696V30.1086H19.5696ZM19.5696 37.102C19.5696 38.39 20.6205 39.3875 21.865 39.3875V37.3875C21.6932 37.3875 21.5696 37.2538 21.5696 37.102H19.5696ZM29.998 39.3875C31.2512 39.3875 32.2934 38.3642 32.2934 37.102H30.2934C30.2934 37.2453 30.1611 37.3875 29.998 37.3875V39.3875ZM32.2934 37.102V30.1086H30.2934V37.102H32.2934ZM32.2934 30.1086C32.2934 28.8463 31.2512 27.823 29.998 27.823V29.823C30.1611 29.823 30.2934 29.9653 30.2934 30.1086H32.2934ZM29.998 27.823C28.7448 27.823 27.7026 28.8463 27.7026 30.1086H29.7026C29.7026 29.9653 29.8349 29.823 29.998 29.823V27.823ZM27.7026 30.1086V37.102H29.7026V30.1086H27.7026ZM27.7026 37.102C27.7026 38.39 28.7535 39.3875 29.998 39.3875V37.3875C29.8262 37.3875 29.7026 37.2538 29.7026 37.102H27.7026ZM38.1352 39.3875C39.3885 39.3875 40.4307 38.3642 40.4307 37.102H38.4307C38.4307 37.2453 38.2983 37.3875 38.1352 37.3875V39.3875ZM40.4307 37.102V30.1086H38.4307V37.102H40.4307ZM40.4307 30.1086C40.4307 28.8463 39.3885 27.823 38.1352 27.823V29.823C38.2983 29.823 38.4307 29.9653 38.4307 30.1086H40.4307ZM38.1352 27.823C36.882 27.823 35.8398 28.8463 35.8398 30.1086H37.8398C37.8398 29.9653 37.9722 29.823 38.1352 29.823V27.823ZM35.8398 30.1086V37.102H37.8398V30.1086H35.8398ZM35.8398 37.102C35.8398 38.3814 36.8647 39.3875 38.1352 39.3875V37.3875C38.0383 37.3875 37.9671 37.3518 37.9199 37.3049C37.8729 37.2583 37.8398 37.1912 37.8398 37.102H35.8398ZM54.9929 20.2145H5.02442V22.2145H54.9929V20.2145ZM5.02442 19.1463H50.5021V17.1463H5.02442V19.1463Z" fill="#2E2E2E" mask="url(#path-1-outside-1_877_1538)"/>
</svg>
