{
    "name": "Teatro Casa de la Paz UAM",
    "labels": [
        "Sé un espectador"
    ],
    "price": "",
    "categories": [
        "Teatros"
    ],
    "schedule": [
        "10:00-19:00",
        "10:00-19:00",
        "10:00-19:00",
        "10:00-19:00",
        "10:00-19:00",
        "Cerrado",
        "Cerrado"
    ],
    "contact": "+52 (55) 5286 5315 / 5286 0403",
    "location": {
        "map_url": "http://maps.google.com/maps?daddr=19.4197%2C-99.1712",
        "address": "Cozumel #33, Col. Roma. 06700, Condesa"
    },
    "description": "Espacio de la Universidad Autónoma Metropolitana destinado a la presentación y difusión de obras de la literatura universal, a través de las artes escénicas contemporáneas.",
    "external_urls": [
        "https://m.facebook.com/teatrocasadelapaz/",
        "http://www.uam.mx/ss/s2/comunicacionsocial/cultura.html",
        "mailto:tdelapaz@correo.uam.mx"
    ],
    "url": "http://cdmxtravel.com/es/lugares/teatro-casa-de-la-paz-uam.html",
    "destination": "Condesa"
}