{
    "name": "The Dog House Pub",
    "labels": [
        "Vive la noche"
    ],
    "price": "Desde $200 MXN",
    "categories": [
        "Pub"
    ],
    "schedule": [
        "13:00-22:30",
        "13:00-22:30",
        "13:00-00:00",
        "13:00-00:00",
        "13:00-00:00",
        "10:00-00:00",
        "10:00-18:00"
    ],
    "contact": "+52 (55) 8436 1195",
    "location": {
        "map_url": "http://maps.google.com/maps?daddr=19.421%2C-99.1666",
        "address": "Sinaloa #61B, Col. Roma Norte.  06700, Roma"
    },
    "description": "The Doghouse es un espacio adaptado como el tradicional pub británico. Lugar de atmósfera agradable, luz tenue y la mezcla de la gastronomía acompañada de una buena cerveza.\n\nTiene disponible variedad de cocteles y un menú nuevo cada día según la propuesta del chef. Además ofrece el english breakfast, mejor conocido como el desayuno inglés, salchichas con baked beans y pan tostado.",
    "external_urls": [
        "https://www.facebook.com/thedoghousepubmx/"
    ],
    "url": "http://cdmxtravel.com/es/lugares/the-dog-house-pub.html",
    "destination": "Roma"
}