{
    "name": "\"La piedad en el desierto\" de Manuel Rodríguez Lozano",
    "labels": [
        "México monumental"
    ],
    "price": "Desde $70 MXN",
    "categories": [
        "Murales"
    ],
    "schedule": [
        "Cerrado",
        "10:00-17:00",
        "10:00-17:00",
        "10:00-17:00",
        "10:00-17:00",
        "10:00-17:00",
        "10:00-17:00"
    ],
    "contact": "+52 (55) 5512 2593 ext. 1305",
    "location": {
        "map_url": "http://maps.google.com/maps?daddr=19.4354%2C-99.1411",
        "address": "Juárez #1, Col. Centro.  06050, Alameda"
    },
    "description": "Es un mural realizado por Manuel Rodríguez Lozano. Originalmente fue creado en los muros del Palacio de Lecumberri en 1942, pero tiempo después fue desprendido y actualmente forma parte de los murales en exhibición del Museo del Palacio de Bellas Artes.\n\nLa idea del mural nació de los pensamientos del cautiverio que, según los expertos, remite al dolor y padecimiento de los mexicanos, especialmente en las intervenciones extranjeras, como fue la Conquista.",
    "external_urls": [
        "http://es-es.facebook.com/palaciobellasartesoficial",
        "http://twitter.com/PalacioOficial",
        "http://palacio.bellasartes.gob.mx",
        "mailto:gerenciapba@inba.gob.mx"
    ],
    "url": "http://cdmxtravel.com/es/lugares/la-piedad-en-el-desierto-de-manuel-rodriguez-lozano.html",
    "destination": "Alameda"
}