{
    "name": "Consejo Nacional para la Cultura y las Artes",
    "labels": [
        "Cultura todos los días"
    ],
    "price": "",
    "categories": [
        "Centros culturales"
    ],
    "schedule": [
        "08:00-18:00",
        "08:00-18:00",
        "08:00-18:00",
        "08:00-18:00",
        "08:00-18:00",
        "Cerrado",
        "Cerrado"
    ],
    "contact": "+52 (55) 4155 0200 ext. 9798",
    "location": {
        "map_url": "http://maps.google.com/maps?daddr=19.4308%2C-99.1606",
        "address": "Av. Paseo de la Reforma #175, Col. Cuauhtémoc. 06500, Reforma-Zona Rosa"
    },
    "description": "El Consejo Nacional para la Cultura y las Artes se fundó el 7 de diciembre de 1988 como un órgano desconcentrado de la SEP, Secretaría de Educación Pública, bajo un decreto del Gobierno de la República Mexicana. Esta entidad gubernamental se encarga de administrar y gestionar a las instituciones públicas cuya tarea es difundir la cultura y las artes.\n\nUna de las principales labores del Consejo además de difundir es fomentar e impulsar las artes. De este modo es responsable de programas, publicaciones, exposiciones, eventos y centros de cultura en toda la Ciudad de México y el país.\n\nDada la gran importancia que tienen las artes y la cultura en México, el Consejo se encarga de elaborar programas para el fomento a la lectura, la creación artística: danza, teatro, cine entre otros; y bajo el mismo precepto le da amplia libertad a los creadores.\n\nSus oficinas centrales se encuentran en las avenidas Insurgentes y Reforma, éstas cuentan con un auditorio y una librería Educal, librería encargada de difundir la labor editorial de la Secretaría de Cultura, el Subsistema de Preparatoria Abierta de la SEP y un centenar de instituciones dedicadas a la investigación y a la cultura.",
    "external_urls": [
        "https://www.facebook.com/SecretariaCulturaMx/",
        "https://instagram.com/conaculta/",
        "https://twitter.com/cultura_mx",
        "https://www.youtube.com/user/conacultavideo",
        "https://www.cultura.gob.mx/acerca_de/"
    ],
    "url": "http://cdmxtravel.com/es/lugares/consejo-nacional-para-la-cultura-y-las-artes.html",
    "destination": "Reforma-Zona Rosa"
}