{
    "name": "Attitude Altavista",
    "labels": [
        "Shopping"
    ],
    "price": "",
    "categories": [
        "Mobiliario",
        "diseño e interiorismo"
    ],
    "schedule": null,
    "contact": "(55) 5616 1617",
    "location": {
        "map_url": "http://maps.google.com/maps?daddr=19.3483%2C-99.1926",
        "address": "Altavista #58, Col. San Ángel. 01000, San Ángel"
    },
    "description": "Nace de la experiencia de un grupo de arquitectos. Su staff diseña y fabrica muebles exclusivos, de calidad y de sublime estética, lo que ha llevado a la marca a viajar por todos los rincones del mundo.",
    "external_urls": [
        "https://www.facebook.com/attitudecollection.mx"
    ],
    "url": "http://cdmxtravel.com/es/lugares/attitude-altavista.html",
    "destination": "San Ángel"
}