{
    "name": "Talleres del Museo de Arte Popular",
    "labels": [
        "Museos",
        "Cultura todos los días",
        "Tiempo libre"
    ],
    "price": "Desde $300 MXN",
    "categories": [
        "Arte",
        "Casas de cultura",
        "Diseño mexicano",
        "Delegaciones"
    ],
    "schedule": null,
    "contact": "(55) 55102201 ext. 130",
    "location": {
        "map_url": "http://maps.google.com/maps?daddr=19.4338%2C-99.1463",
        "address": "Calle Revillagigedo 11, Centro Histórico. Delegación Cuauhtémoc , Centro Histórico"
    },
    "description": "Conoce la tradición y aprende técnicas artesanales de la mano de los mejores maestros.\n\nTalleres para niños y público en general que buscan promover y reconocer el valor del\ntrabajo artesanal. Están dirigidos por maestros y expertos que comparten técnicas de arte\npopular que reflejan la exuberante biodiversidad, complejidad y tradición de la cultura\nmexicana. Entre los talleres ofrecidos están los de alebrijes, popotillo, tejido con vara de\nromerillo, tejido con chuspata o tule, empuntado o rapacejo, bordado de rebozo,\ndecoración de esferas de cartón, y elaboración de piezas de totomoxtle. El museo también\nofrece talleres especializados para artesanos.",
    "external_urls": [
        "https://www.facebook.com/MuseoArtePopular/ ",
        "https://www.instagram.com/map_mexico/",
        "https://www.tripadvisor.com.mx/Attraction_Review-g150800-d1150578-Reviews-Museo_de_Arte_Popular-Mexico_City_Central_Mexico_and_Gulf_Coast.html",
        "https://twitter.com/map_mexico",
        "https://www.youtube.com/user/museodeartepopular",
        "http://www.map.df.gob.mx",
        "mailto:jorge.becerra@cdmx.gob.mx"
    ],
    "url": "http://cdmxtravel.com/es/lugares/talleres-del-museo-de-arte-popular.html",
    "destination": "Centro Histórico"
}