{
    "name": "Peyrelongue Masaryk",
    "labels": [
        "Shopping"
    ],
    "price": "",
    "categories": [
        "Accesorios",
        "Joyería y relojería"
    ],
    "schedule": [
        "11:00-20:00",
        "11:00-20:00",
        "11:00-20:00",
        "11:00-20:00",
        "11:00-20:00",
        "12:00-18:00",
        "Cerrado"
    ],
    "contact": "+52 (55) 5281 5050",
    "location": {
        "map_url": "http://maps.google.com/maps?daddr=19.4323%2C-99.2001",
        "address": "Av. Presidente Masaryk #431, Col. Polanco. 11560, Polanco-Chapultepec"
    },
    "description": "Trabaja con las mejores marcas de relojes de lujo del mundo, además ofrece servicio de restauración y reparación. En la sección de joyería disponen de piezas de diseñadores únicas.",
    "external_urls": [
        "https://www.facebook.com/pages/Peyrelongue-Chronos/194792683919190",
        "https://twitter.com/Peyrelongue_C",
        "http://www.chronos.com.mx/"
    ],
    "url": "http://cdmxtravel.com/es/lugares/peyrelongue-masaryk.html",
    "destination": "Polanco-Chapultepec"
}