{
    "name": "Tienda del Museo de las Culturas Populares",
    "labels": [
        "Puro sabor local"
    ],
    "price": "",
    "categories": [
        "Artesanías"
    ],
    "schedule": [
        "Cerrado",
        "10:00-20:00",
        "10:00-20:00",
        "10:00-20:00",
        "10:00-20:00",
        "10:00-20:00",
        "10:00-20:00"
    ],
    "contact": "+52 (55) 4155 0920",
    "location": {
        "map_url": "http://maps.google.com/maps?daddr=19.3499%2C-99.161",
        "address": "Hidalgo #289, Col. del Carmen. 04000, Coyoacán"
    },
    "description": "Este museo alberga mucho del trabajo de las manos artesanas de diversas comunidades del país. Aquí se pueden adquirir desde textiles, con un tiempo de elaboración de semanas o meses, hasta cartonería o trabajo en vidrio, elaborado mediante procesos ancestrales.",
    "external_urls": null,
    "url": "http://cdmxtravel.com/es/lugares/tienda-del-museo-de-las-culturas-populares.html",
    "destination": "Coyoacán"
}