{
    "name": "Conservatorio Nacional de Música",
    "labels": [
        "Cultura todos los días"
    ],
    "price": "",
    "categories": [
        "Centros culturales"
    ],
    "schedule": [
        "08:00-20:00",
        "08:00-20:00",
        "08:00-20:00",
        "08:00-20:00",
        "08:00-20:00",
        "Cerrado",
        "Cerrado"
    ],
    "contact": "+52 (55) 8647 5390",
    "location": {
        "map_url": "http://maps.google.com/maps?daddr=19.4322%2C-99.2072",
        "address": "Av. Presidente Masaryk #582, Col. Polanco. 11560, Polanco-Chapultepec"
    },
    "description": "Desde 1886 forma a músicos profesionales de alto nivel, en las cuatro áreas de orientación musical: interpretación, investigación, creación y docencia. El conservatorio promueve la educación artística mediante la participación de los alumnos y maestros en diferentes ámbitos musicales. Realiza diferentes actividades gratuitas, como conciertos, recitales, conferencias, clases magistrales y talleres entre otras.",
    "external_urls": [
        "https://www.facebook.com/conservatoriomx/",
        "https://twitter.com/ConservatorioMX",
        "https://www.youtube.com/user/bellasartesmex",
        "https://conservatorio.inba.gob.mx/",
        "mailto:cnm@inba.com.gob.mx"
    ],
    "url": "http://cdmxtravel.com/es/lugares/conservatorio-nacional-de-musica.html",
    "destination": "Polanco-Chapultepec"
}