{
    "name": "Biblioteca Nacional de México",
    "labels": [
        "Cultura todos los días"
    ],
    "price": "",
    "categories": [
        "Bibliotecas"
    ],
    "schedule": [
        "09:00-20:00",
        "09:00-20:00",
        "09:00-20:00",
        "09:00-20:00",
        "09:00-20:00",
        "Cerrado",
        "Cerrado"
    ],
    "contact": "+52 (55) 5622 6827",
    "location": {
        "map_url": "http://maps.google.com/maps?daddr=19.3163%2C-99.1848",
        "address": "Centro Cultural Universitario s/n, Ciudad Universitaria. 04510, Ciudad Universitaria"
    },
    "description": "Inaugurada en 1884 en la sede del ex-convento de San Agustín. Se entregó a la universidad para su protección en 1914 debido a las crisis revolucionarias, y devuelta al Gobierno una vez finalizadas éstas. Tras serios avatares administrativos y junto con la autonomía de la Universidad Nacional, se decidió que de nuevo fuera custodiada por ella. Desde entonces y hasta la actualidad conserva su carácter nacional y tiene buenas condiciones para seguir reuniendo, organizando y preservando la memoria bibliográfica y documental del país.\n\nDentro de su valioso acervo están los Fondos Reservados, que requieren un resguardo especial, con libros raros, curiosos y manuscritos. Colecciones especiales por bibliotecas particulares de personajes ilustres y que han sido donadas a la universidad. Fondo Contemporáneo cuenta con obras monográficas, una sala de consulta, Mapoteca, Videoteca y servicio especial para invidentes.\n\nHay un servicio de visitas guiadas previa solicitud con 3 días de antelación.",
    "external_urls": [
        "https://www.facebook.com/BiblioNacMex.HemeroNacMex.IIBUNAM?ref=sgm",
        "https://twitter.com/IIBUNAM",
        "https://www.youtube.com/user/IIBUNAM",
        "http://bnm.unam.mx/",
        "mailto:consulta@iib.unam.mx"
    ],
    "url": "http://cdmxtravel.com/es/lugares/biblioteca-nacional-de-mexico.html",
    "destination": "Ciudad Universitaria"
}