{
    "name": "La Buena Barra",
    "labels": [
        "Vive la noche"
    ],
    "price": "Desde $700 MXN",
    "categories": [
        "Cantina"
    ],
    "schedule": [
        "13:00-02:00",
        "13:00-02:00",
        "13:00-02:00",
        "13:00-02:00",
        "13:00-02:00",
        "13:00-02:00",
        "13:00-18:00"
    ],
    "contact": "+52 (55) 5280 6699",
    "location": {
        "map_url": "http://maps.google.com/maps?daddr=19.4318%2C-99.1938",
        "address": "Aristóteles #124, Col. Polanco. 11560, Polanco-Chapultepec"
    },
    "description": "La Buena Barra es un restaurante estilo cantina con una terraza que ofrece una vista espectacular de la ciudad. En un ambiente elegante donde cada detalle ha sido cuidadosamente planeado, se ofrecen platillos mexicanos con un toque original.\n\nLos dueños son originarios de Monterrey, por lo que son especialistas en carnes y comida norteña. Se pueden ordenar tacos de jaiba, salmón al chipotle y trompos de pastor a la mesa. Los cocteles hechos a base de mezcal son un must.",
    "external_urls": [
        "https://www.facebook.com/labuenabarramx/",
        "https://www.instagram.com/labuenabarramx/?hl=es-la",
        "https://www.tripadvisor.com.mx/Restaurant_Review-g150800-d6404062-Reviews-La_Buena_Barra_CDMX-Mexico_City_Central_Mexico_and_Gulf_Coast.html",
        "https://twitter.com/labuenabarramx?lang=es",
        "https://grupobarra.com/buenabarra/",
        "mailto:rp.df@labuenabarra.com.mx"
    ],
    "url": "http://cdmxtravel.com/es/lugares/la-buena-barra.html",
    "destination": "Polanco-Chapultepec"
}