{
    "name": "¡Recórcholis! Forum Buenavista México",
    "labels": [
        "En familia"
    ],
    "price": "",
    "categories": [
        "Centros de entretenimiento familiares"
    ],
    "schedule": [
        "11:00-22:00",
        "11:00-22:00",
        "11:00-22:00",
        "11:00-22:00",
        "11:00-23:00",
        "11:00-23:00",
        "11:00-22:00"
    ],
    "contact": "+52 800 881 8811",
    "location": {
        "map_url": "http://maps.google.com/maps?daddr=19.4474%2C-99.152",
        "address": "Eje 1 Norte Mosqueta #259, Col. Buenavista.  06350, Norte"
    },
    "description": "Recorcholis es una cadena de entretenimiento y diversión donde convergen zonas infantiles, boliche profesional e infantil, juegos mecánicos, videojuegos, juegos de destreza, zona de snacks, pabellones interactivos, pista de hielo y más atractivos. Apto para todas las edades.",
    "external_urls": [
        "https://www.facebook.com/RECORCHOLISoficial/timeline/",
        "https://www.tripadvisor.com.mx/ShowUserReviews-g150800-d1603560-r390855801-Forum_Buenavista-Mexico_City_Central_Mexico_and_Gulf_Coast.html",
        "https://twitter.com/recorcholis/",
        "https://www.recorcholis.com.mx/index.php/sucursales/forumbuenavista"
    ],
    "url": "http://cdmxtravel.com/es/lugares/recorcholis-forum-buenavista-mexico.html",
    "destination": "Norte"
}