{
    "name": "Berger Masaryk",
    "labels": [
        "Shopping"
    ],
    "price": "",
    "categories": [
        "Joyería y relojería"
    ],
    "schedule": [
        "11:00-19:00",
        "11:00-19:00",
        "11:00-19:00",
        "11:00-19:00",
        "11:00-19:00",
        "11:00-17:00",
        "11:00-17:00"
    ],
    "contact": "55 9138 0500",
    "location": {
        "map_url": "http://maps.google.com/maps?daddr=19.4317%2C-99.2004",
        "address": "Av. Presidente Masaryk #438, Col. Polanco Chapultepec. 11560, Polanco-Chapultepec"
    },
    "description": "Las mejores marcas de relojes a nivel mundial, así como joyería fina, es lo que se puede encontrar en esta sucursal de Berger, donde los regalos especiales surgen y las ideas y compromisos se concretan.",
    "external_urls": [
        "https://www.facebook.com/joyerosberger",
        "https://www.instagram.com/bergerjoyeros/",
        "http://www.berger.com.mx/",
        "mailto:concierge@berger.com.mx"
    ],
    "url": "http://cdmxtravel.com/es/lugares/berger-masaryk.html",
    "destination": "Polanco-Chapultepec"
}