{
    "name": "Arte Mexicano para el mundo",
    "labels": [
        "Museos",
        "Cultura todos los días"
    ],
    "price": "Gratuito",
    "categories": [
        "Arte",
        "Galerías"
    ],
    "schedule": [
        "09:00-19:00",
        "09:00-19:00",
        "09:00-19:30",
        "09:00-19:30",
        "09:00-19:30",
        "09:00-19:30",
        "09:00-19:30"
    ],
    "contact": "+52 (55) 5518 6992",
    "location": {
        "map_url": "http://maps.google.com/maps?daddr=19.4337%2C-99.1342",
        "address": "Monte de Piedad #11, Col. Centro Histórico. 06010, Centro Histórico"
    },
    "description": "Es un espacio al interior de la sucursal más importante de Nacional Monte de Piedad, ubicada en el Centro Histórico donde se exhiben las artesanías y joyas de varios mexicanos. Cuenta con salas de venta y exhibición, y su galería y restaurante tienen vista panorámica a la plancha del Zócalo. Hay de todos los precios y de diferentes estilos de artesanías dependiendo del estado de donde vengan.\n\nMás información en Fideicomiso del Centro Histórico",
    "external_urls": [
        "https://www.facebook.com/ArteMexicano/"
    ],
    "url": "http://cdmxtravel.com/es/lugares/arte-mexicano-para-el-mundo.html",
    "destination": "Centro Histórico"
}