{
    "name": "Mercado de Flores y Plantas Cuemanco",
    "labels": [
        "Al aire libre",
        "Puro sabor local",
        "En familia"
    ],
    "price": "",
    "categories": [
        "Parques",
        "Jardines",
        "Mercados y bazares",
        "Artesanías",
        "Centros de entretenimiento familiares",
        "Huertos"
    ],
    "schedule": [
        "09:00-18:00",
        "09:00-18:00",
        "09:00-18:00",
        "09:00-18:00",
        "09:00-18:00",
        "09:00-18:00",
        "09:00-18:00"
    ],
    "contact": "55 2300 3644",
    "location": {
        "map_url": "http://maps.google.com/maps?daddr=19.2994%2C-99.0977",
        "address": "Canal Nacional 2000, Coapa, Cuemanco. 16036, Xochimilco"
    },
    "description": "Antes de que fuera un mercado, era una zona lacustre pero 1991 el gobierno decidió imponer el proyecto del rescate ecológico de Xochimilco, con el cual se construyó el parque ecológico, el deportivo ecológico y el mercado de plantas y flores de Cuemanco.\n\nSumérgete en un viaje de colores y olores en una extensa variedad de flores y plantas al sur de la Ciudad de México. A través de 17 hectáreas y 1469 locales, en este mercado se pueden encontrar una variedad de plantas que crecen en invernadero y en sembradíos que hay en el país, principalmente de los estados de Puebla, Morelos y Guerrero.\n\nDisfruta de un recorrido lleno de colores y olores que dejan extasiados a los paseantes en el mercado de flores y plantas de Cuemanco. Uno de los grandes atractivos de Xochimilco es que los chinamperos cosechan flores y plantas de ornato para interiores y exteriores. A precios muy económicos se pueden comprar bromelias, violetas, patas de elefante, pinos y más bellezas.\n\n\n\n",
    "external_urls": [
        "https://www.facebook.com/Mercado-de-Plantas-y-Flores-de-Cuemanco-CDMX-654424248097738/",
        "https://www.tripadvisor.com.mx/Attraction_Review-g150800-d152520-Reviews-Mercado_de_Flores-Mexico_City_Central_Mexico_and_Gulf_Coast.html",
        "https://twitter.com/DelegacionXochi",
        "https://www.youtube.com/channel/UCFMkI-j4XyE9BbTnZTuh8Dw",
        "https://mercado-de-plantas-y-flores-cuemanco.negocio.site/"
    ],
    "url": "http://cdmxtravel.com/es/lugares/mercado-de-flores-y-plantas-cuemanco.html",
    "destination": "Xochimilco"
}