{
    "name": "Péndulo Roma",
    "labels": [
        "Vive la noche"
    ],
    "price": "Desde $200 MXN",
    "categories": [
        "Bar"
    ],
    "schedule": [
        "08:00-23:00",
        "08:00-23:00",
        "08:00-23:00",
        "08:00-00:00",
        "08:00-01:00",
        "09:00-01:00",
        "08:00-23:00"
    ],
    "contact": "55 5574 7034",
    "location": {
        "map_url": "http://maps.google.com/maps?daddr=19.4183%2C-99.1587",
        "address": "Álvaro Obregón #86, Col. Roma Sur. 06700, Roma"
    },
    "description": "El Péndulo no sólo es una librería, sino el ambiente perfecto para leer acompañado de un buen trago o café, para pasarla con los amigos o asistir a eventos culturales. Todo esto pasa en la Terraza del Péndulo Roma, donde los cocteles de colores alegran las mesas y las conversaciones.",
    "external_urls": [
        "https://twitter.com/el_pendulo",
        "http://pendulo.com/"
    ],
    "url": "http://cdmxtravel.com/es/lugares/pendulo-roma.html",
    "destination": "Roma"
}