{
    "name": "Club Atlético del Hotel Four Seasons",
    "labels": [
        "Tiempo libre"
    ],
    "price": "",
    "categories": [
        "Spas"
    ],
    "schedule": [
        "06:30-22:00",
        "06:30-22:00",
        "06:30-22:00",
        "06:30-22:00",
        "06:30-22:00",
        "06:30-22:00",
        "06:30-22:00"
    ],
    "contact": "+52 (55) 5230 1818",
    "location": {
        "map_url": "http://maps.google.com/maps?daddr=19.4223%2C-99.174",
        "address": "Paseo de la Reforma #500, Col. Juárez. 06600, Reforma-Zona Rosa"
    },
    "description": "Masajes y tratamientos para revitalizar el cuerpo de los pies a la cabeza. Se requiere de previa cita con 24 horas de anticipación. Cuenta con dos cubículos de tratamiento, un gimnasio, alberca, hidromasaje, casilleros y sauna.",
    "external_urls": [
        "https://www.facebook.com/FourSeasonsHotelMexico",
        "http://www.pinterest.com/fsmexico/",
        "https://twitter.com/FSMexico",
        "http://www.fourseasons.com/es/mexico/spa/"
    ],
    "url": "http://cdmxtravel.com/es/lugares/club-atletico-del-hotel-four-seasons.html",
    "destination": "Reforma-Zona Rosa"
}