{
    "name": "Calle peatonal Lic. Verdad",
    "labels": [
        "Al aire libre"
    ],
    "price": "",
    "categories": [
        "Plazas"
    ],
    "schedule": [
        "00:01-23:59",
        "00:01-23:59",
        "00:01-23:59",
        "00:01-23:59",
        "00:01-23:59",
        "00:01-23:59",
        "00:01-23:59"
    ],
    "contact": null,
    "location": {
        "map_url": "http://maps.google.com/maps?daddr=19.434%2C-99.1309",
        "address": "Lic. Verdad s/n, Col. Centro. 06000, Centro Histórico"
    },
    "description": "Esta calle a pesar de ser pequeña al caminar por ella se puede viajar a través de la historia. Pues la conforma el Palacio de Autonomía, que con más de 500 años de antigüedad y cimentado sobre los restos de la cultura prehispánica, fue testigo del movimiento estudiantil de 1929 en el que se obtuvo la autonomía universitaria.\n\nTambién se encuentra Ex Teresa Arte Actual, un proyecto que el INBA inició en 1993 para dar a conocer las expresiones artísticas de vanguardia. Originalmente este edificio fue el  Convento de San José y el Templo de Santa Teresa la Antigua, cuya construcción data del siglo XVII.",
    "external_urls": null,
    "url": "http://cdmxtravel.com/es/lugares/calle-peatonal-lic-verdad.html",
    "destination": "Centro Histórico"
}