{
    "name": "La Botica Campeche",
    "labels": [
        "Vive la noche"
    ],
    "price": "Desde $150 MXN",
    "categories": [
        "Bar",
        "Mezcalería"
    ],
    "schedule": [
        "17:00-00:00",
        "17:00-00:00",
        "17:00-00:00",
        "17:00-02:00",
        "17:00-02:00",
        "17:00-02:00",
        "17:00-00:00"
    ],
    "contact": "+52 (55) 5211 6045",
    "location": {
        "map_url": "http://maps.google.com/maps?daddr=19.4101%2C-99.1757",
        "address": "Campeche #396, Col. Condesa. 06700, Condesa"
    },
    "description": "Su característica son los destilados de nivel, lo que la coloca como una de las mezcalerías más importantes del Distrito Federal.\n\nEn La Botica se surten directamente de productores de mezcal de todo el país, principalmente de Tamaulipas, Oaxaca, Durango, Guerrero, Zacatecas, San Luis Potosí, Michoacán y Puebla. Este sitio exalta la tradición de consumir alcohol mexicano de primera calidad.",
    "external_urls": [
        "https://www.facebook.com/laBoticaMezcaleria?fref=ts",
        "https://www.yelp.com/biz/la-botica-m%C3%A9xico-2?hrid=BYs57yQwmDpuQLBoPlj6-g"
    ],
    "url": "http://cdmxtravel.com/es/lugares/la-botica-campeche.html",
    "destination": "Condesa"
}