{
    "name": "Descubre a los animales más populares del Zoológico de Chapultepec",
    "labels": [
        "En familia",
        "MICE",
        "Por recinto"
    ],
    "price": "Gratuito",
    "categories": [
        "Zoológicos",
        "Centros de entretenimiento familiares",
        "Espacios de reunión",
        "Con eventos"
    ],
    "schedule": [
        "09:00-16:30",
        "09:00-16:30",
        "09:00-16:30",
        "09:00-16:30",
        "09:00-16:30",
        "09:00-16:30",
        "09:00-16:30"
    ],
    "contact": null,
    "location": {
        "map_url": "http://maps.google.com/maps?daddr=%2C",
        "address": "Calle Chivatito s/n 1a sección del Bosque de Chapultepec, Col. San Miguel Chapultepec, Delegación Miguel Hidalgo, CDMX 11850, Polanco-Chapultepec"
    },
    "description": "Especies que han sido criadas en cautiverio con el objetvio de preservarlas...\n\nLa naturaleza es uno los elementos más poderosos que podamos encontrar en nuestro globo. Además no solamente nos deja apreciar sus hermosos espacios naturales o sus impresionantes manifestaciones, sino que también nos ha dado la oportunidad de admirar una gran diversidad animal. Cada una de las especies del reino animal cuenta con características únicas, y tal vez por eso, desde hace más de 100 años estos seres vivos han sido ampliamente estudiados y venerados por cientos de personas en el mundo.\n\nUn dato curioso, es que en el siglo XVII surgieron las llamadas: “casas de fieras”, colecciones privadas de especies exóticas, que los reyes de la época mandaban pedir para su deleite. Así fue, como apareció en el Londres de 1828 uno de los primeros “jardines zoológicos” que conoció el hombre.\n\nLa propuesta se fue popularizando en muchos lugares del mundo incluyendo México dónde el biólogo Alfonso L. Herrera inauguró en 1924 el emblemático “Zoológico de Chapultepec”, el cual es considerado como uno de los mejores zoológicos en toda América Latina. El recinto alberga a un total de 243 ejemplares de fauna silvestre y para rendirle homenaje a este importante espacio de la CDMX, hemos juntado en una breve lista a los animales más célebre y exóticos que han llegado a vivir ahí.\n\n\n\nCóndor de California\n\nEste extraordinario ejemplar fue traído en forma de huevo desde el Zoológico de San Diego, y pronto se convirtió en uno de los cuatro cóndores nacidos en tierras mexicanas. Las propuestas que existen para nombrarlo son: Kiligua (los que van), Kumiai (gente de la tierra) o Cucapá (gente de agua). Lamentablemente la especie se encuentra en peligro de extinción, y México es uno de los pocos lugares donde todavía se puede encontrar.\n\n\n\nPanda gigante\n\nEste año se celebra la exitosa crianza de Shuan Shuan y Xin Xin, dos hermosas pandas gigantes, traídas desde China, quienes son las únicas de su tipo en Latinoamérica. Su crecimiento se dio gracias al Programa de Reproducción en Cautiverio del Panda Gigante, un esfuerzo que ha sido elogiado por el embajador de China, Qui Xiaoqi.\n\n\n\nMuflón europeo​\n\nEste exótico animal fue uno de los más esperados en la historia del Zoológico de Chapultepec, ya que este ejemplar es típico de las regiones europeas. Su nacimiento ocurrió el 2017 y todavía estamos a la expectativa del nombre con el que bautizarán a este magnífico mamífero.\n\n\n\nJirafa reticulada\n\nHace poco, nacieron en la capital mexicana algunas crías nuevas, lo cual fue motivo de celebración, ya que esto se logró gracias a los cuidados de reproducción que le dieron a los animales un grupo de veterinarios mexicanos. Pronto se darán a conocer los nombres de las nuevas jirafas.\n\n\n\nHipopótamo del Nilo\n\nSu nacimiento representa un gran logro, ya que la especie no había tenido un desarrollo notorio en casi 10 años. Aún no se sabe su nombre, pero sin duda, le hará compañía al ya muy querido hipopótamo Manik.\n\nAntílope Impala\n\nLa llegada de estas crías significa mucho, ya que los antílopes están en peligro extinción, debido a que son cazados por su majestuosa ornamenta. Así que la protección que se le brinde a este fabuloso animal debe ser extrema. Por ello es que en Chapultepec han celebrado su reproducción, aunque aún no se sabe el nombre de estas hermosas criaturas.\n\n\n\n",
    "external_urls": [
        "https://www.facebook.com/ChapultepecCDMX",
        "https://www.instagram.com/chapultepeccdmx/",
        "https://www.tripadvisor.com.mx/Attraction_Review-g150800-d184382-Reviews-Parque_Zoologico_de_Chapultepec-Mexico_City_Central_Mexico_and_Gulf_Coast.html",
        "https://twitter.com/chapultepeccdmx",
        "http://chapultepec.cdmx.gob.mx/",
        "http://chapultepec.cdmx.gob.mx/sitio/zoologico-de-chapultepec"
    ],
    "url": "http://cdmxtravel.com/es/lugares/descubre-a-los-animales-mas-populares-del-zoologico-de-chapultepec.html",
    "destination": "Polanco-Chapultepec"
}