{
    "name": "Bimba y Lola Antara",
    "labels": [
        "Shopping"
    ],
    "price": "",
    "categories": [
        "Moda",
        "Accesorios"
    ],
    "schedule": [
        "11:00-21:00",
        "11:00-21:00",
        "11:00-21:00",
        "11:00-21:00",
        "11:00-21:00",
        "11:00-21:00",
        "11:00-21:00"
    ],
    "contact": "+52 (55) 5283 7200",
    "location": {
        "map_url": "http://maps.google.com/maps?daddr=19.4393%2C-99.2032",
        "address": "Ejército Nacional #843. local B-102, Col. Granada. 11520, Polanco-Chapultepec"
    },
    "description": "Marca española en la que puedes encontrar variedad de accesorios, bolsos y ropa, con diseños inspirados en la naturaleza, el cine y el arte. Bimba y Lola no deja de crecer con más de 180 tiendas por todos los países.",
    "external_urls": [
        "https://www.facebook.com/BimbayLolaOfficial/",
        "https://www.instagram.com/bimbaylola",
        "https://twitter.com/bimbaylola",
        "https://www.youtube.com/user/bimbaylolastories",
        "https://www.bimbaylola.mx/mx_es/",
        "mailto:contacto@bimbaylola.com"
    ],
    "url": "http://cdmxtravel.com/es/lugares/bimba-y-lola-antara.html",
    "destination": "Polanco-Chapultepec"
}