{
    "name": "Show Center",
    "labels": [
        "Vive la noche"
    ],
    "price": "Desde $600 MXN",
    "categories": [
        "Centros nocturnos"
    ],
    "schedule": [
        "Cerrado",
        "Cerrado",
        "Cerrado",
        "22:00-03:00",
        "22:00-03:00",
        "22:00-03:00",
        "Cerrado"
    ],
    "contact": "+52 (55) 5523 2329    5523 2331",
    "location": {
        "map_url": "http://maps.google.com/maps?daddr=19.3956%2C-99.1715",
        "address": "Insurgentes Sur #640, Col. Del Valle. 03100, World Trade Center"
    },
    "description": "Si se trata de reír a carcajadas este es el lugar ideal. Un grupo de comediantes, imitadores y especialistas del humor se encargan de amenizar las noches para cerrar con broche de oro la semana. Los shows son de jueves a sábado con personajes famosos como Platanito, Indio Brayan, Jaime Rubiel y más. Antes de ir, hay que tomar en cuenta que muchos chistes son “rojos” o albures.",
    "external_urls": [
        "https://www.facebook.com/pages/ShowCenter/140613802633498"
    ],
    "url": "http://cdmxtravel.com/es/lugares/show-center.html",
    "destination": "World Trade Center"
}