{
    "name": "Mercado de Artesanías de la Ciudadela",
    "labels": [
        "Al aire libre",
        "Cultura todos los días",
        "Puro sabor local",
        "En familia",
        "Tiempo libre",
        "MICE",
        "Museos",
        "Shopping"
    ],
    "price": "",
    "categories": [
        "Plazas",
        "Centros culturales",
        "Mercados y bazares",
        "Artesanías",
        "Centros de entretenimiento familiares",
        "Diseño mexicano",
        "Espacios de reunión",
        "Museos de arte e historia",
        "Comercios centenarios"
    ],
    "schedule": [
        "10:00-19:00",
        "10:00-19:00",
        "10:00-19:00",
        "10:00-19:00",
        "10:00-19:00",
        "10:00-19:00",
        "10:00-18:00"
    ],
    "contact": "+52 (55) 5510 1828",
    "location": {
        "map_url": "http://maps.google.com/maps?daddr=19.4305%2C-99.1491",
        "address": "Balderas s/n, Col. Centro. 06040, Alameda"
    },
    "description": "Ubicado en la calle de Balderas, frente al jardín Morelos, y conocida como La Plaza de la Ciudadela se encontraba el antiguo deposito de armas, hacia 1964 con el apoyo del gobierno de la ciudad de México y Ayuntamiento de Zacatlán Puebla, se instala la entonces feria de la manzana, en cuyas exhibiciones se unen los primeros artesanos quienes apoyados por la secretaria de industria y comercio solicitan permisos para acceder al predio abandonado e instalar ahí las primeras ferias artesanales itinerantes de la ciudad de México.\n\nA partir del primero de junio de 1965 se establece el primer mercado de artesanías, con el nombre de “La Feria de la Ciudadela” y un año mas tarde se consolidaría como la Unión de artesanos y similares de la republica mexicana. Dando origen así al Mercado de Artesanías “La Ciudadela”, exponiendo productos elaborados de distintas regiones de nuestro pais, desde hace 49 años.\n\nEn el mercado de la Ciudadela hay una gran variedad de curiosidades y artesanías hechas por manos mexicanas como bordados y joyería. Se puede encontrar desde una pulsera de vidrio hasta una cabecera tallada. Se creó en 1968 cuando se llevaron a cabo los Juegos Olímpicos; el gobierno convocó a artesanos de todo el país para exhibir sus trabajos y aprovechar el turismo que llegó de todo el mundo.",
    "external_urls": [
        "https://www.facebook.com/MERCADODEARTESANIASLACIUDADELA",
        "https://www.instagram.com/mercadodeartesaniaslaciudadela/?hl=es-la&fbclid=IwAR1ZpMwcT46OrSoOwAOZ8rVxDPjZkfWeLc8i9R6JrbHPP59jnC5Pd8XcQ8M",
        "https://www.tripadvisor.com.mx/Attraction_Review-g150800-d152540-Reviews-Mercado_De_Artesanias_La_Ciudadela-Mexico_City_Central_Mexico_and_Gulf_Coast.html",
        "https://twitter.com/laciudadelamx",
        "http://laciudadela.com.mx/"
    ],
    "url": "http://cdmxtravel.com/es/lugares/mercado-de-artesanias-de-la-ciudadela.html",
    "destination": "Alameda"
}