{
    "name": "Centro Cultural Donceles 66",
    "labels": [
        "Museos",
        "Puro sabor local",
        "Cultura todos los días",
        "Sé un espectador",
        "MICE",
        "Por recinto"
    ],
    "price": "",
    "categories": [
        "Arte",
        "Patrimonio Cultural Inmaterial",
        "Bibliotecas",
        "Centros culturales",
        "Centros de espectáculos y salas de conciertos",
        "Espacios de reunión",
        "Con eventos"
    ],
    "schedule": [
        "09:00-19:00",
        "09:00-19:00",
        "09:00-19:00",
        "09:00-19:00",
        "09:00-19:00",
        "09:00-19:00",
        "09:00-19:00"
    ],
    "contact": "+52 (55) 9150 1462",
    "location": {
        "map_url": "http://maps.google.com/maps?daddr=19.4364%2C-99.135",
        "address": "Donceles #66, Col. Centro Histórico. 06000, Centro Histórico"
    },
    "description": "Un lugar de encuentro y conversación que estimula los sentidos. Se encuentra en una casona de 1756 en la antigua sede de la Academia Mexicana de la Lengua. El recinto cuenta con librería, biblioteca, café, restaurante y salones para talleres, cursos y presentaciones.",
    "external_urls": [
        "https://www.facebook.com/donceles66encuentroyconversacion",
        "http://www.pinterest.com/editorialjus/",
        "https://twitter.com/EditorialJus1",
        "https://www.youtube.com/user/EditorialJus",
        "mailto:informes@donceles66.com.mx"
    ],
    "url": "http://cdmxtravel.com/es/lugares/centro-cultural-donceles-66.html",
    "destination": "Centro Histórico"
}