{
    "name": "Biblioteca Nacional de Antropología e Historia",
    "labels": [
        "Cultura todos los días",
        "MICE"
    ],
    "price": "",
    "categories": [
        "Bibliotecas",
        "Espacios de reunión"
    ],
    "schedule": [
        "09:00-17:00",
        "09:00-17:00",
        "09:00-17:00",
        "09:00-17:00",
        "09:00-17:00",
        "Cerrado",
        "Cerrado"
    ],
    "contact": "(55) 5553 6865",
    "location": {
        "map_url": "http://maps.google.com/maps?daddr=19.4261%2C-99.1863",
        "address": "Av. Paseo de la Reforma s/n, Col. Polanco. 11560, Polanco-Chapultepec"
    },
    "description": "Tiene sus orígenes en la primera etapa del México independiente con la creación del Museo Nacional en 1825, pero no fue hasta 1888 cuando se inauguró formalmente la biblioteca. En 1939 recibe el nombre de Biblioteca Nacional de Antropología e Historia y se ubicó en su recinto actual, en el Museo Nacional de Antropología, que recuerda a Eusebio Dávalos Hurtado, primer antropólogo físico egresado de la Escuela Nacional de Antropología e Historia, además de científico, promotor cultural y curador.\n\nEn Latinoamérica es la biblioteca más completa en el ámbito de historia, antropología, arqueología, lingüística, etnohistoria y otras ciencias afines.\n\nSu acervo resguarda códices que fueron registrados en 1997 dentro del programa Memoria del Mundo de la UNESCO, manuscritos, periódicos del siglo XIX, libros de órdenes religiosas, mapas, planos, testimonios de personas que vivieron la revolución de 1910, así como tesis e investigaciones actuales.",
    "external_urls": [
        "https://www.facebook.com/BNAH.INAH",
        "https://www.youtube.com/user/INAHTV",
        "http://www.bnah.inah.gob.mx/index.php",
        "mailto:contacto.bnah@inah.gob.mx"
    ],
    "url": "http://cdmxtravel.com/es/lugares/biblioteca-nacional-de-antropologia-e-historia.html",
    "destination": "Polanco-Chapultepec"
}