{
    "name": "Calzada de los Poetas",
    "labels": [
        "México monumental"
    ],
    "price": "Gratuito",
    "categories": [
        "Monumentos"
    ],
    "schedule": [
        "Cerrado",
        "05:00-16:30",
        "05:00-16:30",
        "05:00-16:30",
        "05:00-16:30",
        "05:00-16:30",
        "05:00-16:30"
    ],
    "contact": null,
    "location": {
        "map_url": "http://maps.google.com/maps?daddr=19.4194%2C-99.1856",
        "address": "Calz. de los Poetas, Col. Bosque de Chapultepec I Sección. 11580, Polanco-Chapultepec"
    },
    "description": "La Calzada de los Poetas, en el Bosque de Chapultepec, es un camino donde se encuentran los bustos de ilustres poetas mexicanos. Se encuentran los literatos Antonio Plaza, Joaquín Fernández de Lizardi, Juan Ruiz de Alarcón, Manuel Acuña, Manuel Gutiérrez Nájera, Manuel José Othón, Rafael Delgado, Ramón López Velarde, Salvador Díaz Mirón y Sor Juana Inés de la Cruz.",
    "external_urls": [
        "http://www.twitter.com/ChapultepecMx",
        "http://www.sedema.df.gob.mx/bosquedechapultepec/index.php?option=com_content&view=article&id=137:calzada-de-los-poetas&catid=89:primera-seccion&Itemid=98"
    ],
    "url": "http://cdmxtravel.com/es/lugares/calzada-de-los-poetas.html",
    "destination": "Polanco-Chapultepec"
}