{
    "name": "Parque Juana de Asbaje",
    "labels": [
        "Al aire libre"
    ],
    "price": "",
    "categories": [
        "Parques"
    ],
    "schedule": [
        "07:00-19:00",
        "07:00-19:00",
        "07:00-19:00",
        "07:00-19:00",
        "07:00-19:00",
        "07:00-21:00",
        "07:00-21:00"
    ],
    "contact": null,
    "location": {
        "map_url": "http://maps.google.com/maps?daddr=19.2894%2C-99.1676",
        "address": "Moneda #1, Col. Tlalpan Centro.\r\n 14000, Tlalpan"
    },
    "description": "Se estableció en 1999 en los terrenos que eran parte del Sanatorio Psiquiátrico Floresta. Tiene plantaciones de aguacate, tejocote, pera y árboles con más de 70 años de edad. Además, cuenta con un área de juegos infantiles.",
    "external_urls": null,
    "url": "http://cdmxtravel.com/es/lugares/parque-juana-de-asbaje.html",
    "destination": "Tlalpan"
}