{
    "name": "Capilla de la Asunción",
    "labels": [
        "México monumental"
    ],
    "price": "Desde $52 MXN",
    "categories": [
        "Recintos religiosos"
    ],
    "schedule": [
        "07:00-20:00",
        "07:00-20:00",
        "07:00-20:00",
        "07:00-20:00",
        "07:00-20:00",
        "07:00-20:00",
        "07:00-20:00"
    ],
    "contact": "+52 (55) 5676 8879",
    "location": {
        "map_url": "http://maps.google.com/maps?daddr=19.2685%2C-99.1022",
        "address": "Av. de Hidalgo s/n, Barrio de la Asunción. 16040, Xochimilco"
    },
    "description": "Esta capilla fue edificada en 1860 y restaurada en 1927. En su interior se resguarda un órgano del siglo XVII; fue declarada monumento histórico en 1932. Se trata del punto de reunión del Barrio de la Asunción en Xochimilco.",
    "external_urls": [
        "http://www.heraldo.com.mx/distrito-federal/xochimilco/16040/barrio-la-asuncion/"
    ],
    "url": "http://cdmxtravel.com/es/lugares/capilla-de-la-asuncion.html",
    "destination": "Xochimilco"
}