{
    "name": "La Chilanguita Centro",
    "labels": [
        "Vive la noche"
    ],
    "price": "Desde $250 MXN",
    "categories": [
        "Bar"
    ],
    "schedule": [
        "13:00-02:00",
        "13:00-02:00",
        "13:00-02:00",
        "13:00-02:00",
        "13:00-02:00",
        "13:00-02:00",
        "13:00-18:00"
    ],
    "contact": "+52 (55) 5709 7266",
    "location": {
        "map_url": "http://maps.google.com/maps?daddr=19.4282%2C-99.1348",
        "address": "Mesones #87, Col. Centro. 06000, Centro Histórico"
    },
    "description": "Con el folclore que caracteriza a las tradiciones mexicanas, en La Chilanguita se exalta en sus paredes y decorado al defeño que todos llevan dentro.\n\nEl logo es un taxi verde del típico “vochito” que ya no se encuentra en circulación pero que fue tan característico de la ciudad de México. En todas sus sucursales se escucha música variada y se comen platillos mexicanos.",
    "external_urls": [
        "https://www.facebook.com/LaChilanguitaMX/timeline",
        "https://www.tripadvisor.com.mx/Restaurant_Review-g150800-d7352004-Reviews-La_Chilanguita-Mexico_City_Central_Mexico_and_Gulf_Coast.html",
        "https://twitter.com/LasChilanguitas",
        "http://www.la.chilanguita.com.mx/",
        "mailto:redeschilanguita@gmail.com"
    ],
    "url": "http://cdmxtravel.com/es/lugares/la-chilanguita-centro.html",
    "destination": "Centro Histórico"
}