{
    "name": "Museo de Sitio de la SEP",
    "labels": [
        "Museos",
        "Cultura todos los días",
        "En familia",
        "Por recinto"
    ],
    "price": "Gratuito",
    "categories": [
        "Ciencia e historia",
        "Galerías",
        "Centros de entretenimiento familiares",
        "Con eventos"
    ],
    "schedule": [
        "09:00-17:00",
        "09:00-17:00",
        "09:00-17:00",
        "09:00-17:00",
        "09:00-17:00",
        "Cerrado",
        "Cerrado"
    ],
    "contact": "(55) 3601 1000 ext. 51488",
    "location": {
        "map_url": "http://maps.google.com/maps?daddr=19.4372%2C-99.1324",
        "address": "República de Argentina #28, Col. Centro. 06020, Centro Histórico"
    },
    "description": "El Museo de Sitio incluye un recorrido por el edificio de la Secretaría de Educación Pública, y una muestra de las piezas arqueológicas que fueron halladas durante las obras de restauración en la iglesia y convento de Santa María del Divino Verbo de la Encarnación, que se encuentra ahí mismo.\n\nEl edificio fue inaugurado durante el gobierno de Álvaro Obregón, con José Vasconcelos como secretario de Educación, el 9 de julio de 1922. Al siguiente año, el pintor Diego Rivera comenzó a pintar los muros, como una forma de alfabetización artística para el pueblo. En las paredes se plasmó una representación sobre la vida cotidiana, las costumbres e historia del país.",
    "external_urls": [
        "https://www.facebook.com/SEPmx",
        "https://www.flickr.com/photos/sepmx/",
        "https://www.tripadvisor.com.mx/Attraction_Review-g150800-d558913-Reviews-Murales_de_Diego_Rivera_en_la_Secretaria_de_Educacion_Publica-Mexico_City_Central_.html",
        "https://twitter.com/SEP_mx",
        "https://www.youtube.com/user/canalsep",
        "http://sic.gob.mx/ficha.php?table=museo&table_id=706",
        "mailto:museodesitiosep@sep.gob.mx"
    ],
    "url": "http://cdmxtravel.com/es/lugares/museo-de-sitio-de-la-sep.html",
    "destination": "Centro Histórico"
}