{
    "name": "Centro Cultural Nacional Pedro Infante",
    "labels": [
        "Museos"
    ],
    "price": "Gratuito",
    "categories": [
        "Singulares"
    ],
    "schedule": [
        "15:00-19:00",
        "15:00-19:00",
        "15:00-19:00",
        "15:00-19:00",
        "15:00-19:00",
        "15:00-19:00",
        "09:00-13:00"
    ],
    "contact": "+52 (55) 5814 1100 ext. 2212",
    "location": {
        "map_url": "http://maps.google.com/maps?daddr=19.3569%2C-99.2995",
        "address": "Avenida Juárez #192, Col. Cuajimalpa. 05000, Cuajimalpa / Desierto de los Leones"
    },
    "description": "La nueva casa de Pedro Infante en donde se resguarda y preserva la memoria de este grande ídolo de la época de oro del cine mexicano. Se localiza en Cuajimalpa.\n\n",
    "external_urls": [
        "https://www.facebook.com/Museo-Centro-Cultural-Nacional-Pedro-Infante-Oficial-2169539609768423/"
    ],
    "url": "http://cdmxtravel.com/es/lugares/centro-cultural-nacional-pedro-infante.html",
    "destination": "Cuajimalpa / Desierto de los Leones"
}