{
    "name": "Escape Rooms Condesa",
    "labels": [
        "Tiempo libre"
    ],
    "price": "Desde $350 MXN",
    "categories": [
        "Casinos",
        "bingos y salas de juegos"
    ],
    "schedule": [
        "09:30-21:30",
        "09:30-21:30",
        "09:30-21:30",
        "09:30-21:30",
        "09:30-21:30",
        "09:30-21:30",
        "09:30-21:30"
    ],
    "contact": "+52 (55) 6844 8875",
    "location": {
        "map_url": "http://maps.google.com/maps?daddr=19.4069%2C-99.1688",
        "address": "Tlaxcala #162, Col. Condesa.  06760, Condesa"
    },
    "description": "Escape Rooms México es un juego de retos de miedo y aventura. La dinámica es entrar a un cuarto donde deberás de resolver los acertijos y así escapar en un tiempo máximo de una hora, existen nueve diferentes experiencias.\n\nLos escapes que podrás elegir en esta sede son:\n\n- Santa inquisición.\n\n- El tesoro de Moctezuma\n\n- Zombie Police Station\n\n- Alcatraz\n\n- Vampiros\n\n- Vuelo 13\n\n- Psiquiátrico Condesa\n\n- El Purgatorio\n\n¿Lo lograrás?\n\nPara más información de promociones se recomienda ingresar a la página oficial del lugar.\n\n",
    "external_urls": [
        "https://www.facebook.com/escaperoomsmexico/",
        "https://www.escaperoomsmexico.com/",
        "mailto:escaperoomsmexico@gmail.com"
    ],
    "url": "http://cdmxtravel.com/es/lugares/escape-rooms-condesa.html",
    "destination": "Condesa"
}