{
    "name": "Museo del Objeto del Objeto (Modo)",
    "labels": [
        "Museos",
        "Cultura todos los días",
        "En familia",
        "Tiempo libre",
        "MICE",
        "Por recinto"
    ],
    "price": "Desde $50 MXN",
    "categories": [
        "Arte",
        "Ciencia e historia",
        "Singulares",
        "Centros culturales",
        "Centros de entretenimiento familiares",
        "Diseño mexicano",
        "Espacios de reunión",
        "Con eventos",
        "Museos de arte e historia"
    ],
    "schedule": [
        "Cerrado",
        "10:00-18:00",
        "10:00-18:00",
        "10:00-18:00",
        "10:00-18:00",
        "10:00-18:00",
        "10:00-18:00"
    ],
    "contact": "(55) 5533 9637",
    "location": {
        "map_url": "http://maps.google.com/maps?daddr=19.4203%2C-99.1591",
        "address": "Colima #145, Col. Roma Norte. 06700, Roma"
    },
    "description": "El Modo relata quiénes somos a través de los objetos cotidianos. Los objetos hablan de una sociedad, de un momento histórico, de las modas y tendencias... Ubicado en uno de los pocos edificios art nouveau que quedan en pie en la Ciudad de México, el Modo forma parte de la efervescente comunidad artística de la colonia Roma.\n\nUn lugar para echar a andar la nostalgia que pone énfasis en la comunicación y el diseño en México bajo una perspectiva histórica. Tiene un acervo de 100 mil objetos de 1810 a la fecha. Las colecciones más importantes son las de documentos históricos, fotografía, propaganda política y funeraria, así como ejemplos de diseño de empaques, envases, publicidad, artes gráficas y artefactos en desuso. Posee objetos que no reconocen los niños: casetes, discos de acetato, las antiguas cremas Nivea, cajas de cerillos La Central, una tornamesa Sony Lewfer, objetos de uso común que fueron parte de la vida de las personas en otras épocas.\n\nEl museo se alió con la marca Inspireka para crear una sala lúdica en la que los niños puedan jugar al mismo tiempo que aprenden.",
    "external_urls": [
        "https://www.facebook.com/museomodo/",
        "https://www.instagram.com/MuseoMODO/",
        "https://www.tripadvisor.com.mx/Attraction_Review-g150800-d3929678-Reviews-MODO_Museo_del_Objeto_del_Objeto-Mexico_City_Central_Mexico_and_Gulf_Coast.html",
        "https://twitter.com/museomodo",
        "https://www.youtube.com/user/MuseoModo",
        "http://elmodo.mx/"
    ],
    "url": "http://cdmxtravel.com/es/lugares/museo-del-objeto-del-objeto-modo.html",
    "destination": "Roma"
}