{
    "name": "Bus Bici Eje 7 Sur",
    "labels": [
        "Diversión y adrenalina"
    ],
    "price": "",
    "categories": [
        "Ciclovías"
    ],
    "schedule": [
        "00:01-23:59",
        "00:01-23:59",
        "00:01-23:59",
        "00:01-23:59",
        "00:01-23:59",
        "00:01-23:59",
        "00:01-23:59"
    ],
    "contact": "55 5005 24 24",
    "location": {
        "map_url": "http://maps.google.com/maps?daddr=19.376%2C-99.1875",
        "address": "Extremadura s/n, Col. Insurgentes Mixcoac. 03920, World Trade Center"
    },
    "description": "De acuerdo con el sistema Ecobici, esta ruta comprende desde Mixcoac hasta División del Norte, sobre Eje 7 Sur. El recorrido total es de 7.3 kilómetros. Cuenta con el espacio necesario para el ciclista, sin interrumpir el tránsito de los automóviles y acatando los señalamientos viales. Se recomienda el uso de chaleco o ropa que identifique al ciclista.",
    "external_urls": [
        "https://www.facebook.com/ecobici",
        "https://www.instagram.com/ecobicicdmx/",
        "https://twitter.com/ecobici",
        "https://www.ecobici.cdmx.gob.mx/"
    ],
    "url": "http://cdmxtravel.com/es/lugares/bus-bici-eje-7-sur.html",
    "destination": "World Trade Center"
}