{
    "name": "Museo del Estanquillo",
    "labels": [
        "Museos",
        "Por recinto"
    ],
    "price": "Gratuito",
    "categories": [
        "Arte",
        "Ciencia e historia",
        "Singulares",
        "Con eventos"
    ],
    "schedule": [
        "10:00-17:45",
        "Cerrado",
        "10:00-17:45",
        "10:00-17:45",
        "10:00-17:45",
        "10:00-17:45",
        "10:00-17:45"
    ],
    "contact": "(55) 5521 3052",
    "location": {
        "map_url": "http://maps.google.com/maps?daddr=19.4333%2C-99.1361",
        "address": "Isabel La Católica #26, Col. Centro. 06000, Centro Histórico"
    },
    "description": "El museo se fundó en 2006 a partir de la colección de objetos —más de 20 mil— que atesoraba el escritor y cronista Carlos Monsiváis. Justamente el nombre del museo obedece al nombre que recibían antes los comercios pequeños en los que era posible encontrar todo tipo de mercancías, los estanquillos florecieron entre el siglo XIX y XX.\n\nEn el museo se exhiben fotografías, pinturas, documentos históricos, grabados y miniaturas de la vida económica, cultural y social de México. Adicionalmente, se ofrece una sala de lectura, talleres y visitas guiadas.",
    "external_urls": [
        "http://museodelestanquillo-mx.blogspot.mx/",
        "https://www.facebook.com/museodel.estanquillo.9",
        "https://www.instagram.com/museodelestanquillo/",
        "https://www.tripadvisor.com.mx/Attraction_Review-g150800-d4456195-Reviews-Museo_Del_Estanquillo-Mexico_City_Central_Mexico_and_Gulf_Coast.html",
        "https://twitter.com/m_estanquillo",
        "https://www.youtube.com/channels?q=museo+del+estanquillo",
        "http://www.museodelestanquillo.com/",
        "mailto:serviciosalpublico@museodelestanquillo.com"
    ],
    "url": "http://cdmxtravel.com/es/lugares/museo-del-estanquillo.html",
    "destination": "Centro Histórico"
}