{
    "name": "Ecoturismo Olintlalli",
    "labels": [
        "México monumental",
        "Al aire libre",
        "En familia",
        "Puro sabor local"
    ],
    "price": "Desde $100 MXN",
    "categories": [
        "Patrimonio Mundial Cultural",
        "Jardines",
        "Lagos",
        "Centros de entretenimiento familiares",
        "Huertos",
        "Temazcales"
    ],
    "schedule": [
        "10:00-18:00",
        "10:00-18:00",
        "10:00-18:00",
        "10:00-18:00",
        "10:00-18:00",
        "10:00-18:00",
        "10:00-18:00"
    ],
    "contact": "5676 4631",
    "location": {
        "map_url": "http://maps.google.com/maps?daddr=19.2783%2C-99.0931",
        "address": "16034, Xochimilco"
    },
    "description": "Embárcate y conoce las técnicas de cultivo tradicional en chinampa o acampa en una zona de la reserva ecológica de Xochimilco.\n\nOlintlalli ofrece distintos tipos de experiencias y actividades que pueden incluir la visita a una chinampa demostrativa de más de 1 hectárea donde se cultivan hortalizas orgánicas.\n\nAquí se ofrece la explicación del origen de las chinampas, la demostración de técnicas tradicionales de cultivo y la aplicación de conocimientos ancestrales. Adicionalmente, se dispone de otra hectárea habilitada como espacio de convivencia con palapa, temazcal autóctono y jardín para campismo.\n\nSus terrenos se encuentran en la reserva ecológica de Xochimilco a la que se accede por medio de un bonito recorrido en trajinera (para la entrada y salida) que puede incluir la visita al ajolotario. También cuentan con un punto de venta para sus flores y hortalízas agroecológicos.\n\nPrecio varia segun servicios contratados\n\nTemazcal autóctono\n\nSafari fotográfico\n\nPaquete escolar\n\nLunadas\n\nChinampas demostrativas\n\nRentas de palapas\n\nTradición oral",
    "external_urls": [
        "https://es-la.facebook.com/Ecoturismo-Olintlalli-312454332208337/",
        "https://twitter.com/olintlalli",
        "http://www.olintlalli.com.mx",
        "mailto:olintlalli@yahoo.com.mx"
    ],
    "url": "http://cdmxtravel.com/es/lugares/ecoturismo-olintlalli.html",
    "destination": "Xochimilco"
}