{
    "name": "Casa Zen A. C.",
    "labels": [
        "México monumental"
    ],
    "price": "",
    "categories": [
        "Recintos religiosos"
    ],
    "schedule": [
        "19:00-21:30",
        "19:00-21:30",
        "19:00-21:30",
        "Cerrado",
        "Cerrado",
        "Cerrado",
        "Cerrado"
    ],
    "contact": "+52 (55) 5669 3726",
    "location": {
        "map_url": "http://maps.google.com/maps?daddr=19.387%2C-99.1805",
        "address": "Carolina #10, Col. Ampliación Nápoles. 03840, San Ángel"
    },
    "description": "La meditación hoy en día ha sido facilitadora de paz y tranquilidad para la mente y el cuerpo de las personas que se encuentran bajo estrés cotidiano. Por la suma eficacia de este ejercicio de relajación, en la Ciudad de México hay varios centros que guían a los intersados en esta práctica. Éste, en específico, sigue la tradición Soto-Rinzai del budismo zen. Se ubica muy cerca del WTC.",
    "external_urls": [
        "mailto:gerardogally@editorialpax.co"
    ],
    "url": "http://cdmxtravel.com/es/lugares/casa-zen-a-c.html",
    "destination": "San Ángel"
}