{
    "name": "Keith Dannemiller Mexico City Photo Tours",
    "labels": [
        "México monumental",
        "Puro sabor local",
        "Vive la noche",
        "MICE"
    ],
    "price": "Desde $2,000 MXN",
    "categories": [
        "Monumentos",
        "Palacios",
        "Murales",
        "Recintos religiosos",
        "Patrimonio Mundial Cultural",
        "Patrimonio Cultural Inmaterial",
        "Mercados y bazares",
        "Cantina",
        "Pulquería",
        "Espacios de reunión"
    ],
    "schedule": [
        "08:00-17:00",
        "08:00-17:00",
        "08:00-17:00",
        "08:00-17:00",
        "08:00-17:00",
        "08:00-17:00",
        "08:00-17:00"
    ],
    "contact": "(55) 2541-5192",
    "location": {
        "map_url": "http://maps.google.com/maps?daddr=19.4353%2C-99.1412",
        "address": "Av. Juárez S/N, Centro Histórico de la Ciudad de México,CDMX 06050, Centro Histórico"
    },
    "description": "Recorridos guiados por Keith Dannemiller, fotoperiodista veterano de TIME, Newsweek, The New York Times, Fortune, Forbes, The Guardian, Al Jazeera America y Stern. Este experto en la Ciudad de México lleva al visitante a descubrir el enorme mosaico de posibilidades visuales que ofrece, su arquitectura, iglesias, residentes, barrios y las personas que le dan vida. Mexico City Photo Tours opera en grupos pequeños de 1 a 4 personas. Por eso, usted como participante está asegurado mucho tiempo personal y individual con un servidor, su guía para la caminata. Vale la pena recordar que la palabra sobresaliente con nosotros será ‘fotografía’. Aprenderá en un ambiente estilo ‘taller ambulatorio’, mientras que caminemos en las calles de la Ciudad de Mexico.\n\n",
    "external_urls": [
        "https://www.facebook.com/keith.dannemiller",
        "https://www.instagram.com/keithdannemiller/",
        "https://www.keithdannemiller.com/",
        "mailto:kdannemiller1@mac.com"
    ],
    "url": "http://cdmxtravel.com/es/lugares/keith-dannemiller-mexico-city-photo-tours.html",
    "destination": "Centro Histórico"
}