{
    "name": "Foro Rock Bizarro",
    "labels": [
        "Vive la noche"
    ],
    "price": "Desde $300 MXN",
    "categories": [
        "Bar",
        "Centros nocturnos"
    ],
    "schedule": [
        "Cerrado",
        "Cerrado",
        "20:00-03:00",
        "20:00-03:00",
        "20:00-03:00",
        "20:00-03:00",
        "Cerrado"
    ],
    "contact": "+52 (55) 5264 3411",
    "location": {
        "map_url": "http://maps.google.com/maps?daddr=19.4166%2C-99.1668",
        "address": "Av. Yucatan #10, Col.Roma Norte.  06100, Roma"
    },
    "description": "Foro Rock Bizarro es un lugar con esencia dark, ubicado en la colonia Roma en el primer piso de la cafetería del mismo nombre. Este espacio está abierto al público e invita a las presentaciones de artistas de diferentes corrientes musicales.\n\nSe recomienda consultas sus redes sociales para conocer más sobre los eventos programados.",
    "external_urls": [
        "https://www.facebook.com/Foro-Bizarro-239047296441934/"
    ],
    "url": "http://cdmxtravel.com/es/lugares/foro-rock-bizarro.html",
    "destination": "Roma"
}