{
    "name": "Estatua de Miguel Hidalgo y Costilla",
    "labels": [
        "México monumental"
    ],
    "price": "",
    "categories": [
        "Monumentos"
    ],
    "schedule": [
        "00:01-23:59",
        "00:01-23:59",
        "00:01-23:59",
        "00:01-23:59",
        "00:01-23:59",
        "00:01-23:59",
        "00:01-23:59"
    ],
    "contact": null,
    "location": {
        "map_url": "http://maps.google.com/maps?daddr=19.481%2C-99.1864",
        "address": "Av. Azcapotzalco s/n, Col. Villa Azcapotzalco. 02000, Azcapotzalco"
    },
    "description": "Se encuentra ubicada en el Jardín Hidalgo, frente a la Parroquia de los Santos Apóstoles. Tras la estatua se localizan dos elegantes muros que lo cercan, además de un kiosco. Miguel Hidalgo es posiblemente el personaje más ilustre de la historia de México, fundamental para entender la cosmovisión actual. También conocido como el Padre de la Patria.",
    "external_urls": null,
    "url": "http://cdmxtravel.com/es/lugares/estatua-de-miguel-hidalgo-y-costilla.html",
    "destination": "Azcapotzalco"
}