{
    "name": "Casa de Diego de Ordaz",
    "labels": [
        "Museos",
        "México monumental",
        "Cultura todos los días",
        "MICE"
    ],
    "price": "Gratuito",
    "categories": [
        "Arte",
        "Casas históricas",
        "Casas de cultura",
        "Centros culturales",
        "Espacios de reunión"
    ],
    "schedule": [
        "00:01-23:59",
        "00:01-23:59",
        "00:01-23:59",
        "00:01-23:59",
        "00:01-23:59",
        "00:01-23:59",
        "00:01-23:59"
    ],
    "contact": null,
    "location": {
        "map_url": "http://maps.google.com/maps?daddr=19.3492%2C-99.1645",
        "address": "Francisco Sosa #2, Col. Villa Coyoacán, entre las calles de Tres Cruces y Centenario. 04000, Coyoacán"
    },
    "description": "Enfrente del Jardín Centenario, en la esquina de Francisco Sosa y Tres Cruces sobresale una casona pintada de color rojo. Fue construida en el siglo XVIII donde destacan los desagües en forma de cañón que tienen relieves hechos por indígenas. La fachada está decorada estilo mudéjar.\n\nDurante muchos años se creyó que había sido propiedad del conquistador Diego de Ordaz, pero eso no pudo ocurrir porque se construyó en el siglo XVIII.",
    "external_urls": [
        "https://www.facebook.com/centrodecoyoacan/videos/casa-de-diego-de-ordaz-en-coyoacán/1697358916991407/"
    ],
    "url": "http://cdmxtravel.com/es/lugares/casa-de-diego-de-ordaz.html",
    "destination": "Coyoacán"
}