{
    "name": "Esrawe",
    "labels": [
        "Shopping"
    ],
    "price": "",
    "categories": [
        "Mobiliario",
        "diseño e interiorismo"
    ],
    "schedule": [
        "09:00-19:00",
        "09:00-19:00",
        "09:00-19:00",
        "09:00-19:00",
        "09:00-19:00",
        "10:00-17:00",
        "Cerrado"
    ],
    "contact": "+52 (55) 5553 9611 ext. 102",
    "location": {
        "map_url": "http://maps.google.com/maps?daddr=19.4332%2C-99.1956",
        "address": "Alejandro Dumas #161, Col. Polanco. 11560, Polanco-Chapultepec"
    },
    "description": "Firma del Diseñador Industrial Héctor Esrawe. Desde 1992 no ha parado de trabajar tanto en su firma como en el Colectivo NEL, y de recibir premios nacionales e internacionales. Su equipo de trabajo está formado por un grupo de expertos diseñadores, arquitectos, ingenieros y un equipo de fabricación. Sus proyectos de interiorismo abarcan desde bares, restaurantes, oficinas, hoteles, espacios comerciales y casas.",
    "external_urls": [
        "https://www.facebook.com/esrawe.medios",
        "https://instagram.com/hesrawe/",
        "https://twitter.com/@hesrawe",
        "http://www.esrawe.com/es",
        "mailto:infoshowroom@esrawe.com"
    ],
    "url": "http://cdmxtravel.com/es/lugares/esrawe.html",
    "destination": "Polanco-Chapultepec"
}