{
    "name": "Centenario 107",
    "labels": [
        "Vive la noche"
    ],
    "price": "Desde $250 MXN",
    "categories": [
        "Cantina",
        "Bar"
    ],
    "schedule": [
        "13:00-00:00",
        "13:00-01:00",
        "13:00-01:00",
        "09:00-13:00",
        "09:00-13:00",
        "13:00-02:00",
        "09:00-13:15"
    ],
    "contact": "+52 (55) 4752 6369",
    "location": {
        "map_url": "http://maps.google.com/maps?daddr=19.3561%2C-99.1634",
        "address": "Av. Centenario #107, Col. Del Carmen. 04100, Coyoacán"
    },
    "description": "Pizza, champagne y vino en un sólo lugar: Centenario 107. Un espacio creado en conjunto con la naturaleza, fina madera y buena música, ideal para celebrar con los amigos o pareja. Ofrecen más de 140 etiquetas de cervezas además de una selección de alimentos de alta cocina, incluyendo las famosas Enchiladas Guiness.",
    "external_urls": [
        "https://www.facebook.com/Centenario107?fref=ts",
        "https://twitter.com/centenario107",
        "http://www.centenario107.com/",
        "mailto:centenario107@gmail.com"
    ],
    "url": "http://cdmxtravel.com/es/lugares/centenario-107.html",
    "destination": "Coyoacán"
}