{
    "name": "Bar Lepanto",
    "labels": [
        "Vive la noche"
    ],
    "price": "Desde $250 MXN",
    "categories": [
        "Bar"
    ],
    "schedule": [
        "13:30-00:00",
        "13:30-00:00",
        "13:30-00:00",
        "13:30-00:00",
        "13:30-00:00",
        "13:30-00:00",
        "13:30-00:00"
    ],
    "contact": "+52 (55) 5511 3780     5208 4333",
    "location": {
        "map_url": "http://maps.google.com/maps?daddr=19.4221%2C-99.1642",
        "address": "Av. Oaxaca #24, Col. Roma. 06700, Condesa"
    },
    "description": "Una típica cantina donde al pedir las bebidas, las botanas van incluidas. En este sitio la comida es tipo bufet, así que las personas pueden servirse cuanto deseen. También cuenta con paquetes para grupos y los viernes la bebida está al 2x1.",
    "external_urls": [
        "https://www.facebook.com/BAR-Lepanto-1437679363138725/",
        "http://www.barlepanto.com/"
    ],
    "url": "http://cdmxtravel.com/es/lugares/bar-lepanto.html",
    "destination": "Condesa"
}