{
    "name": "Parque Ecológico de Xochimilco",
    "labels": [
        "México monumental",
        "Al aire libre",
        "En familia",
        "Cultura todos los días"
    ],
    "price": "Desde $30 MXN",
    "categories": [
        "Patrimonio Mundial Cultural",
        "Parques",
        "Parques nacionales",
        "Lagos",
        "Centros de entretenimiento familiares",
        "Delegaciones"
    ],
    "schedule": [
        "09:00-18:00",
        "09:00-18:00",
        "09:00-18:00",
        "09:00-18:00",
        "09:00-18:00",
        "09:00-18:00",
        "09:00-18:00"
    ],
    "contact": "+52 (55) 5673 7890",
    "location": {
        "map_url": "http://maps.google.com/maps?daddr=19.2912%2C-99.0985",
        "address": "Periférico Oriente #1, Col. Ciénega Grande. 16070, Xochimilco"
    },
    "description": "El Parque Ecológico de Xochimilco es un parque declarado el 11 de noviembre de 1987 por la Unesco como Patrimonio de la Humanidad, se puede admirar la naturaleza mientras se convive sanamente en familia y se disfruta de actividades recreativas. Es un área de 180 hectáreas, de las cuales 50 son cuerpos de agua y ciénegas. Ahí se pueden apreciar aves como el zanate y perros de agua; comadrejas, sapos y axolotes, un anfibio endémico en peligro de extinción.\n\nEl Parque Ecológico Xochimilco rescata tanto valores ecológicos como culturales del lugar.Valores ecológicos por la recuperación de la flora y fauna del sitio, así como de los cuerpos de agua evitando su deterioro e incorporando medidas preventivas para la mejora de éstos; valores culturales por el rescate de las chinampas.\n\nLa vista es espectacular, pues se encuentra en una zona donde aún se puede apreciar a los árboles y alguno que otro cerro. Se realizan visitas guiadas, renta de trajineras y lancha de pedales, alquiler de bicicletas y cuadriciclos, viaje en tren y renta de espacios para celebrar cumpleaños u otros eventos sociales. Es un espacio ideal, con muchas actividades, para llevar a los niños.",
    "external_urls": [
        "https://www.facebook.com/Parque-Ecologico-de-Xochimilco-1388855208024750/",
        "https://www.tripadvisor.com.mx/Attraction_Review-g150800-d152518-Reviews-Parque_Ecologico_Xochimilco-Mexico_City_Central_Mexico_and_Gulf_Coast.html"
    ],
    "url": "http://cdmxtravel.com/es/lugares/parque-ecologico-de-xochimilco.html",
    "destination": "Xochimilco"
}