{
    "name": "Teatro El Granero Xavier Rojas",
    "labels": [
        "Sé un espectador"
    ],
    "price": "Gratuito",
    "categories": [
        "Teatros"
    ],
    "schedule": [
        "11:00-19:00",
        "11:00-19:00",
        "11:00-19:00",
        "11:00-19:00",
        "11:00-19:00",
        "11:00-19:00",
        "11:00-19:00"
    ],
    "contact": "+52 (55) 5280 8771 ext. 411",
    "location": {
        "map_url": "http://maps.google.com/maps?daddr=19.4234%2C-99.1949",
        "address": "Av. Paseo de la Reforma s/n, Col. Chapultepec Polanco. 11560, Polanco-Chapultepec"
    },
    "description": "Este foro se localiza en el Centro Cultural del Bosque, y se inauguró en 1956. Su escenario al centro de la sala se eleva diez centímetros sobre el nivel del piso. Las butacas lo rodean por tres de sus lados. Tal espacio permite la presentación de obras experimentales contemporáneas.\n\nForma parte del programa #YoVoyalteatro\n\nFacebook: yovoyalteatromx\nTwitter: yovoyalteatromx",
    "external_urls": [
        "https://www.facebook.com/pages/Centro-Cultural-del-Bosque-INBA/113500562082580",
        "https://www.youtube.com/user/ccbinba",
        "http://www.ccb.bellasartes.gob.mx/recintos/granero",
        "mailto:gentedeteatro@inba.mx"
    ],
    "url": "http://cdmxtravel.com/es/lugares/teatro-el-granero-xavier-rojas.html",
    "destination": "Polanco-Chapultepec"
}