{
    "name": "Pabellón Cuauhtémoc",
    "labels": [
        "En familia",
        "Tiempo libre",
        "MICE"
    ],
    "price": "",
    "categories": [
        "Centros de entretenimiento familiares",
        "Centros comerciales",
        "Espacios de reunión"
    ],
    "schedule": [
        "11:00-23:00",
        "11:00-23:00",
        "11:00-23:00",
        "11:00-23:00",
        "11:00-23:00",
        "11:00-23:00",
        "11:00-23:00"
    ],
    "contact": "+52 (55) 5264 3220",
    "location": {
        "map_url": "http://maps.google.com/maps?daddr=19.4113%2C-99.1555",
        "address": "Antonio M. Anza #20, Col. Roma. 06700, Roma"
    },
    "description": "Pabellón Cuauhtémoc es un centro comercial que se ubica en una de las zonas más céntricas de la ciudad. Sus instalaciones están distribuidas en dos pisos. Cuenta con un amplio estacionamiento, gran oferta de tiendas, cines, restaurantes, servicios bancarios y un puente que lo conecta con el Centro Médico Siglo XXI.",
    "external_urls": [
        "https://www.facebook.com/pabelloncuauhtemoccdmx/?fref=ts",
        "mailto:contacto@pabelloncuauhtemoc.com.mx"
    ],
    "url": "http://cdmxtravel.com/es/lugares/pabellon-cuauhtemoc.html",
    "destination": "Roma"
}