{
    "name": "Museo de la Luz",
    "labels": [
        "Museos",
        "México monumental",
        "Cultura todos los días",
        "En familia"
    ],
    "price": "Desde $35 MXN",
    "categories": [
        "Arte",
        "Ciencia e historia",
        "Museos interactivos",
        "Palacios",
        "Casas de cultura",
        "Centros culturales",
        "Centros de entretenimiento familiares"
    ],
    "schedule": [
        "Cerrado",
        "09:00-17:00",
        "09:00-17:00",
        "09:00-17:00",
        "09:00-17:00",
        "10:00-17:00",
        "10:00-17:00"
    ],
    "contact": "2616-2071 // 5702-3183",
    "location": {
        "map_url": "http://maps.google.com/maps?daddr=19.4361%2C-99.1302",
        "address": "San Ildefonso #43, Col. Centro. 06020, Centro Histórico"
    },
    "description": "En el Colegio Chico del Antiguo Colegio de San Ildefonso se encuentra el Museo de la Luz, espacio donde se exploran diferentes facetas del fenómeno de la luz.\n\nEstá dividido en las salas: Naturaleza de la Luz, La Luz de las estrellas, Un mundo de colores, La Luz en las artes, La Luz y la biosfera, La visión y Gabinete del optometrista. El espacio se encuentra a cargo de la Dirección General de Divulgación de la Ciencia de la UNAM y busca incentivar una cultura científica y tecnológica en la sociedad. También se llevan a cabo talleres, conferencias y cursos entorno a la luz para niños, para que al mismo tiempo que se acercan a las ciencia y aprenden sobre ciertos fenómenos físicos se diviertan, por ejemplo, en el taller \"Caldeidoscipio\" en el que crearán su propio caleidoscopio al mismo tiempo que responderán a preguntas como ¿por qué las imágenes son siempre simétricas y cambiantes?\n\nEs un museo temático, en el se exploran las diferentes facetas del fenómeno de la luz y su relación con otros campos de la ciencia.",
    "external_urls": [
        "https://www.facebook.com/MuseodelaLuz",
        "https://www.tripadvisor.com.mx/Attraction_Review-g150800-d4550990-Reviews-Museo_de_La_Luz-Mexico_City_Central_Mexico_and_Gulf_Coast.html",
        "https://twitter.com/MuseodelaLuz",
        "https://www.youtube.com/user/DGDCUNAM",
        "http://www.museodelaluz.unam.mx/",
        "mailto:museoluz@unam.mx"
    ],
    "url": "http://cdmxtravel.com/es/lugares/museo-de-la-luz.html",
    "destination": "Centro Histórico"
}