{
    "name": "Razones para visitar el nuevo Parque La Mexicana",
    "labels": [
        "Al aire libre",
        "En familia",
        "Diversión y adrenalina",
        "MICE"
    ],
    "price": "Gratuito",
    "categories": [
        "Parques",
        "Centros de entretenimiento familiares",
        "Skateparks",
        "Centros deportivos",
        "Ciclovías",
        "Espacios para correr",
        "Espacios de reunión"
    ],
    "schedule": [
        "05:00-22:00",
        "05:00-22:00",
        "05:00-22:00",
        "05:00-22:00",
        "05:00-22:00",
        "05:00-22:00",
        "05:00-22:00"
    ],
    "contact": null,
    "location": {
        "map_url": "http://maps.google.com/maps?daddr=19.358%2C-99.2692",
        "address": "Lomas de Santa Fe, Contadero. 01219, Santa Fe"
    },
    "description": "Hace alrededor de cinco años, se hallaba vacío un grande espacio de 30 hectáreas en Santa Fe. Naturalmente, se pensó en utilizar este enorme terreno para levantar edificios residenciales. Sin embargo, la asociación de colonos de esta zona argumentó que dicho plan causaría caos vial. Fue así como se optó por aprovechar el lugar y convertirlo en un grandioso parque.\n\nCon una inversión privada de 2 millones de pesos, se inauguró el pasado 24 de noviembre este increíble jardín, que lleva por nombre La Mexicana y constituye un nuevo pulmón verde al poniente de nuestra capital.\n\nCabe mencionar, que este proyecto está pensado para dos etapas. La primera es la que actualmente se desdobla por todo el paraje, e incluye una pista para correr, ciclovías, lagos artificiales y skate park.\n\nPara embellecer el paisaje, se plantaron más de 3 mil especies de árboles, se instalaron más de 180 mil metros cuadrados de jardines con pasto y otros 60 mil con áreas que albergan especies endémicas de la zona. Y es que el Parque La Mexicana se creó bajo criterios autosustentables, pues fue diseñado tomando en cuenta la topografía natural de la zona, así como su valor forestal.\n\nOtro ejemplo ecológico del parque son los lagos artificiales que yacen en el sitio. Se trabajó en su estructura eléctrica e hidráulica, con el objetivo de recolectar el agua de lluvia y utilizarla para riego. De igual manera, las luces que alumbran el parque funcionan con energía solar.\n\nSe tiene pensado que para la segunda etapa, lleguen cafeterías, restaurantes y tiendas para mascotas al parque, con el propósito de hacer de este lugar uno multidisciplinario. También se colocarán canchas para jugar futbol y básquetbol, pues en la zona también hay deportistas a los que les hace falta espacios para practicar sus actividades favoritas.\n\nLo cierto es que arquitectos y urbanistas que participaron en la iniciativa aseguran que este parque significa un aumento de plusvalía para Santa Fe, una oportunidad de apertura de nuevos negocios y un impacto en la calidad de vida de esta zona llena de rascacielos que tanto necesitaba un pulmón verde como La Mexicana.\n\n",
    "external_urls": [
        "https://es-la.facebook.com/elparquelamexicana/",
        "https://www.instagram.com/parquelamexicana/?hl=es-la",
        "https://www.tripadvisor.com.mx/Attraction_Review-g150800-d13276467-Reviews-Parque_La_Mexicana-Mexico_City_Central_Mexico_and_Gulf_Coast.html",
        "https://twitter.com/parquemexicana?lang=es"
    ],
    "url": "http://cdmxtravel.com/es/lugares/razones-para-visitar-el-nuevo-parque-la-mexicana.html",
    "destination": "Santa Fe"
}