{
    "name": "Edificio La Mexicana",
    "labels": [
        "México monumental"
    ],
    "price": "",
    "categories": [
        "Monumentos"
    ],
    "schedule": [
        "10:00-18:00",
        "10:00-18:00",
        "10:00-18:00",
        "10:00-18:00",
        "10:00-18:00",
        "10:00-18:00",
        "10:00-18:00"
    ],
    "contact": null,
    "location": {
        "map_url": "http://maps.google.com/maps?daddr=19.4335%2C-99.1362",
        "address": "Francisco I. Madero #53, Col. Centro. 06000, Centro Histórico"
    },
    "description": "Esta construcción marcó el inicio de las nuevas corrientes arquitectónicas en la ciudad de México. El edificio abrió sus puertas en 1906 y, con el tiempo, se convertiría en sede de la Compañía de Seguros La Mexicana. Actualmente alberga una sucursal de ropa para dama y caballero.",
    "external_urls": [
        "https://www.elcentrohistorico.com.mx/lugares-edificio-la-mexicana.html"
    ],
    "url": "http://cdmxtravel.com/es/lugares/edificio-la-mexicana.html",
    "destination": "Centro Histórico"
}