{
    "name": "La Bodeguita del Medio",
    "labels": [
        "Vive la noche"
    ],
    "price": "Desde $300 MXN",
    "categories": [
        "Bar"
    ],
    "schedule": [
        "13:30-02:00",
        "13:30-02:00",
        "13:30-02:00",
        "13:30-02:00",
        "13:30-02:00",
        "13:30-02:00",
        "13:30-02:00"
    ],
    "contact": "+52 (55) 5553 0246",
    "location": {
        "map_url": "http://maps.google.com/maps?daddr=19.4194%2C-99.1712",
        "address": "Cozumel #37, Col. Roma Norte. 06700, Condesa"
    },
    "description": "Es el restaurante cubano más famoso del mundo y que se afirma es el creador del auténtico mojito. Este restaurante ofrece música en vivo y platillos típicos. Fue fundado en 1942 por Ángel Martínez en La Habana.\n\nEn la Bodeguita del Medio el comensal podrá deleitarse con una pechuga grilled o una paella cubana, disfrutar de un habano original e incluso comprar algún souvenir en su tienda. Ofrece servicios extras, como clases de salsa y más.",
    "external_urls": [
        "https://www.facebook.com/labodeguitadelmediomx/info",
        "https://www.instagram.com/bodeguitadelmedio/",
        "https://twitter.com/LaBdelMMexico",
        "http://www.youtube.com/user/labodeguitamex",
        "http://labodeguitadelmedio.com.mx/",
        "mailto:labodeguitadelmedio@live.com.mx"
    ],
    "url": "http://cdmxtravel.com/es/lugares/la-bodeguita-del-medio.html",
    "destination": "Condesa"
}