{
    "name": "Nuevo Museo Nacional de Energía y Tecnología",
    "labels": [
        "Museos",
        "Por recinto"
    ],
    "price": "Gratuito",
    "categories": [
        "Singulares",
        "Museos interactivos",
        "Con eventos"
    ],
    "schedule": null,
    "contact": null,
    "location": {
        "map_url": "http://maps.google.com/maps?daddr=%2C",
        "address": "Av. Grande del Bosque No. 1 Circuito Principal, Segunda Sección del Bosque de Chapultepec. , Polanco-Chapultepec"
    },
    "description": "Es un hecho que los avances tecnológicos van cada vez más de prisa. Gracias a esto hemos podido comprender de mejor manera cómo funciona el mundo que nos rodea. Nos ha ampliado los horizontes de conocimiento y nos ha hecho más conscientes de la interconexión que tenemos con el resto del universo. Si bien cada descubrimiento lleva consigo un cambio de paradigma, de una u otra forma éstos nos llevan a una constante actualización de forma de vida.\n\nEl MUNET es una iniciativa que pretende acercar a los ciudadanos a las nuevas tecnologías que se están usando a nivel nacional para proveer de energía a los mexicanos.\n\nAlgunos de los aspectos más reconocibles del proyecto liderado por el Arq. Enrique Norten, es que se contempla una gran techumbre verde que dará más del doble de áreas verdes que el actual edificio. La implementación de este techo ayuda a que el edificio tenga excelentes cualidades térmicas en el interior que ayudan a bajar gastos energéticos para acondicionamiento de aire. Por otro lado, ayuda a disminuir las islas de calor que se dan en contextos urbanos y el uso de vegetación es excelente filtro natural de aire y agua. Otra característica del museo es que será un edificio bioclimático, es decir que generará su propia energía a tal grado que pueda operar de manera independiente.\n\nPodemos ver gran similitud con proyectos de otros arquitectos de talla internacional como Renzo Piano y Norman Foster, quienes tienen un amplio discurso en cuanto al papel que juega la arquitectura en el uso consciente de recursos. El museo tiene una aproximación de vanguardia, ya que no se contempla al museo como un espacio donde solo se observa de manera pasiva, sino que se integran factores intelectuales, sociales y culturales que hacen una dinámica espacial más compleja. La tecnología que se usa para dar energía al edificio queda expuesta y tiene una doble función tanto para proveer energía como para educar al visitante.\n\nSu apertura podría ser a finales de 2019\n\n",
    "external_urls": [
        "https://www.gob.mx/gobmx/articulos/conoce-como-sera-el-nuevo-museo-nacional-de-energia-y-tecnologia-munet"
    ],
    "url": "http://cdmxtravel.com/es/lugares/nuevo-museo-nacional-de-energia-y-tecnologia.html",
    "destination": "Polanco-Chapultepec"
}