{
    "name": "Papalote Museo del Niño",
    "labels": [
        "Museos",
        "Cultura todos los días",
        "En familia",
        "Sé un espectador",
        "MICE",
        "Por recinto"
    ],
    "price": "Desde $199 MXN",
    "categories": [
        "Ciencia e historia",
        "Singulares",
        "Museos interactivos",
        "Hemerotecas",
        "Centros de entretenimiento familiares",
        "Centros de espectáculos y salas de conciertos",
        "Espacios de reunión",
        "Con eventos"
    ],
    "schedule": [
        "09:00-18:00",
        "09:00-18:00",
        "09:00-18:00",
        "09:00-23:00",
        "09:00-18:00",
        "10:00-19:00",
        "10:00-19:00"
    ],
    "contact": "(55) 5237 1773",
    "location": {
        "map_url": "http://maps.google.com/maps?daddr=19.4116%2C-99.1947",
        "address": "Av. Constituyentes #268, Col. Daniel Garza.  11830, Polanco-Chapultepec"
    },
    "description": "El Papalote Museo del Niño abrió sus puertas en 1993, en la segunda sección del Bosque de Chapultepec. Bajo el lema “Toco, juego y aprendo” se ha convertido en uno de los favoritos de los niños mexicanos, con exhibiciones y actividades para niños de todas las edades, desde infantes hasta adolescentes.\n\nPapalote cuenta con más de 300 exhibiciones divididas en cinco emocionantes temas: Comunico, Soy, Pertenezco, Expreso y Comprendo. Es ya famoso el Árbol Ramón, un fascinante recorrido por los ecosistemas selváticos. De igual forma, se puede disfrutar de sorprendentes películas en la Megapantalla IMAX, que es la más grande de América Latina, y contemplar proyecciones en el Domodigital.\n\n",
    "external_urls": [
        "https://www.facebook.com/PapaloteMuseo",
        "https://www.instagram.com/papalote_museo/",
        "https://www.tripadvisor.com.mx/Attraction_Review-g150800-d155969-Reviews-Papalote_Museo_del_Nino-Mexico_City_Central_Mexico_and_Gulf_Coast.html",
        "https://twitter.com/papalote_museo",
        "http://papalote.org.mx/"
    ],
    "url": "http://cdmxtravel.com/es/lugares/papalote-museo-del-nino.html",
    "destination": "Polanco-Chapultepec"
}