{
    "name": "Deportivo Antonio Caso",
    "labels": [
        "Diversión y adrenalina"
    ],
    "price": "",
    "categories": [
        "Centros deportivos",
        "Espacios para correr"
    ],
    "schedule": [
        "08:00-20:00",
        "08:00-20:00",
        "08:00-20:00",
        "08:00-20:00",
        "08:00-20:00",
        "08:00-20:00",
        "Cerrado"
    ],
    "contact": "+52 (55) 4335 8178",
    "location": {
        "map_url": "http://maps.google.com/maps?daddr=19.4511%2C-99.134",
        "address": "Reforma Norte #680, Col. U.H. Tlatelolco. 06900, Norte"
    },
    "description": "Este centro deportivo se ubica a un costado de la sección Tlatelolco. Ofrece servicios para todos los habitantes de la zona. Las clases y talleres que ahí se imparten son judo, natación, tae kwon do, básquetbol y hawaiano.",
    "external_urls": null,
    "url": "http://cdmxtravel.com/es/lugares/deportivo-antonio-caso.html",
    "destination": "Norte"
}