{
    "name": "Mexicano",
    "labels": [
        "Vive la noche"
    ],
    "price": "Desde $250 MXN",
    "categories": [
        "Cantina",
        "Bar"
    ],
    "schedule": [
        "16:00-22:00",
        "12:00-22:30",
        "12:00-22:30",
        "12:00-22:30",
        "12:00-01:00",
        "12:00-01:00",
        "12:00-01:00"
    ],
    "contact": "+52 (55) 5709 2492",
    "location": {
        "map_url": "http://maps.google.com/maps?daddr=19.4274%2C-99.1338",
        "address": "Regina #27-A, Col. Centro. 06010, Centro Histórico"
    },
    "description": "El Mexicano apuesta por un concepto coctelero, donde el pulque y el mezcal son los ingredientes principales y los sabores exóticos saltan a la vista. Una excelente barra, el ambiente del corredor Regina y las mesas en el exterior lo hacen ideal para precopear o pasarla bien con la pareja.",
    "external_urls": [
        "https://www.facebook.com/mexicano.bar",
        "https://twitter.com/i/notifications"
    ],
    "url": "http://cdmxtravel.com/es/lugares/mexicano.html",
    "destination": "Centro Histórico"
}