{
    "name": "Casa del Conde de la Torre Cosío",
    "labels": [
        "México monumental"
    ],
    "price": "",
    "categories": [
        "Palacios",
        "Casas históricas"
    ],
    "schedule": [
        "00:01-23:59",
        "00:01-23:59",
        "00:01-23:59",
        "00:01-23:59",
        "00:01-23:59",
        "00:01-23:59",
        "00:01-23:59"
    ],
    "contact": null,
    "location": {
        "map_url": "http://maps.google.com/maps?daddr=19.4303%2C-99.1341",
        "address": "República de Uruguay #90, Col. Centro. 06000, Centro Histórico"
    },
    "description": "Esta casa barroca fue edificada en 1783. Es conocida por la leyenda “La calle de don Juan Manuel”, cuya historia cuenta que ahí habitó Juan Manuel Solórzano, quien por alguna razón fue encarcelado y se obsesionó con la supuesta infidelidad de su esposa. Tanto fue su pesar, que hizo un pacto con el demonio, que consistía en matar a la primera persona que apareciera frente a su puerta a las 11 de la noche. Un día amaneció colgado, pero no sin antes haber confesado todos sus crímenes.\n\n",
    "external_urls": null,
    "url": "http://cdmxtravel.com/es/lugares/casa-del-conde-de-la-torre-cosio.html",
    "destination": "Centro Histórico"
}