{
    "name": "Rococo",
    "labels": [
        "Shopping"
    ],
    "price": "",
    "categories": [
        "Mobiliario",
        "diseño e interiorismo"
    ],
    "schedule": [
        "10:00-14:00",
        "10:00-14:00",
        "10:00-14:00",
        "10:00-14:00",
        "10:00-14:00",
        "Cerrado",
        "Cerrado"
    ],
    "contact": "55 5207 5312",
    "location": {
        "map_url": "http://maps.google.com/maps?daddr=19.4207%2C-99.1749",
        "address": "Av. Chapultepec #540 piso 7, Col. Roma Norte. 06700, Roma"
    },
    "description": "Plataforma de diseño, desarrollo, producción y venta de mobiliario. Los artesanos locales crean piezas únicas, utilizando diferentes materiales como la madera y acero, así como el uso de diferentes textiles. Es imprescindible ir con cita previa.",
    "external_urls": [
        "https://www.facebook.com/rococomex",
        "https://instagram.com/rococomx/",
        "https://www.pinterest.com/rococomx/",
        "https://twitter.com/intent/follow?source=followbutton&variant=1.0&screen_name=ROCOCOMX",
        "http://rococo.mx/",
        "mailto:hola@rococo.mx"
    ],
    "url": "http://cdmxtravel.com/es/lugares/rococo.html",
    "destination": "Roma"
}