{
    "name": "Jardín de Adultos Mayores",
    "labels": [
        "Al aire libre",
        "MICE"
    ],
    "price": "",
    "categories": [
        "Jardines",
        "Espacios de reunión"
    ],
    "schedule": [
        "00:01-23:59",
        "00:01-23:59",
        "00:01-23:59",
        "00:01-23:59",
        "00:01-23:59",
        "00:01-23:59",
        "00:01-23:59"
    ],
    "contact": "(55) 5256 2633",
    "location": {
        "map_url": "http://maps.google.com/maps?daddr=19.4235%2C-99.1921",
        "address": "Calz. Chivatito s/n, Col. Polanco.  11560, Polanco-Chapultepec"
    },
    "description": "Este espacio ofrece una serie de actividades para los adultos mayores como danza, yoga o tai chi; pero sobre todo ofrece un espacio de relajación en donde el pasto, los árboles centenarios y el agua se funden con las esculturas y los pequeños puentes colocados por el hombre.\n\nFue creado en 1986, tiene una superficie de 36,500 metros cuadrados y destaca por su Pérgola, la Biblioteca Andrés Henestrosa y El Pabellón Coreano donado por ese país.",
    "external_urls": [
        "http://www.chapultepec.org.mx/web2013/jardin-de-adultos-mayores/"
    ],
    "url": "http://cdmxtravel.com/es/lugares/jardin-de-adultos-mayores.html",
    "destination": "Polanco-Chapultepec"
}