{
    "name": "Casa de Cultura del Valle Sur",
    "labels": [
        "Cultura todos los días",
        "MICE"
    ],
    "price": "",
    "categories": [
        "Casas de cultura",
        "Espacios de reunión"
    ],
    "schedule": [
        "08:00-21:00",
        "08:00-21:00",
        "08:00-21:00",
        "08:00-21:00",
        "08:00-21:00",
        "08:00-21:00",
        "08:00-21:00"
    ],
    "contact": "(55) 5559 2025",
    "location": {
        "map_url": "http://maps.google.com/maps?daddr=19.375%2C-99.171",
        "address": "Dr. Roberto Gayol s/n,Cda de Coyoacán, Col. del Valle Centro. 03100, San Ángel"
    },
    "description": "Un espacio comunitario donde se ofrecen clases de yoga y gimnasia terapéutica, además de otras actividades de esparcimiento y recreación.",
    "external_urls": null,
    "url": "http://cdmxtravel.com/es/lugares/casa-de-cultura-del-valle-sur.html",
    "destination": "San Ángel"
}