{
    "name": "Disfruta Xochimilco desde las alturas (DRONE)",
    "labels": [
        "Al aire libre"
    ],
    "price": "",
    "categories": [
        "Jardines",
        "Lagos",
        "Huertos"
    ],
    "schedule": null,
    "contact": null,
    "location": {
        "map_url": "http://maps.google.com/maps?daddr=19.2853%2C-99.102",
        "address": "Calle del Mercado S/N, Xaltocan,CDMX 16090, Xochimilco"
    },
    "description": "Un vistazo a la Los mil colores de México se dibujan en los canales Xochimilco... Si aún existe algún vestigio de lo que fue la vida de la ciudad lacustre de Tenochtitlan, son estos canales; vestidos además con el folclor resultado del mestizaje y los usos indígenas.\n\nLas trajineras, casi fluorescentes, y la oportunidad de conocer el ajolote, uno de los animales más extraños del mundo (capaz de autoregenerar su cuerpo cuando le es necesario), aunado a la música y la alegría del sitio, son un combo memorable.\n\nEstos canales se encuentran en un Área Natural Protegida recuperada por el Plan de Rescate Ecológico de Xochimilco en 1989. Son más de 215 hectáreas de agua, flora y fauna en un paisaje parecido al que contemplaban los aztecas hace 500 años.\n\nLa mejor manera quizá de conocer un Área Natural Protegida es desde las alturas, así es posible ver la magnitud, la totalidad y el estado de la zona. Los drones en este sentido son un arma poderosa, y en algún grado al alcance, para conocer la naturaleza desde otros ángulos.\n\n",
    "external_urls": null,
    "url": "http://cdmxtravel.com/es/lugares/disfruta-xochimilco-desde-las-alturas-drone.html",
    "destination": "Xochimilco"
}