{
    "name": "Pata Negra Condesa",
    "labels": [
        "Vive la noche"
    ],
    "price": "Desde $200 MXN",
    "categories": [
        "Bar",
        "Pub"
    ],
    "schedule": [
        "13:00-02:00",
        "13:00-02:00",
        "13:00-02:00",
        "13:00-02:00",
        "13:00-02:00",
        "13:00-02:00",
        "13:00-02:00"
    ],
    "contact": "+52 (55) 5211 5563",
    "location": {
        "map_url": "http://maps.google.com/maps?daddr=19.4133%2C-99.1722",
        "address": "Tamaulipas #30, Col. Condesa. 06170, Condesa"
    },
    "description": "Un salón de dos pisos en pleno corazón de la Condesa. En la planta baja, durante el día, se ofrecen menús diarios de comida española, actividades para niños y clases de baile; por las noches tocan grupos en vivo de jazz, funk, rock, dub, flamenco, salsa y muchos géneros musicales.",
    "external_urls": [
        "https://www.facebook.com/patanegraoficial/timeline",
        "https://www.instagram.com/patanegra_mx/",
        "https://twitter.com/patanegramx",
        "https://www.youtube.com/user/PataNegraVideos"
    ],
    "url": "http://cdmxtravel.com/es/lugares/pata-negra-condesa.html",
    "destination": "Condesa"
}