{
    "name": "Museo del Calzado",
    "labels": [
        "Museos",
        "Cultura todos los días",
        "Tiempo libre"
    ],
    "price": "Gratuito",
    "categories": [
        "Singulares",
        "Casas de cultura",
        "Diseño mexicano",
        "Museos de arte e historia"
    ],
    "schedule": [
        "10:00-18:00",
        "10:00-18:00",
        "10:00-18:00",
        "10:00-18:00",
        "10:00-18:00",
        "10:00-18:00",
        "Cerrado"
    ],
    "contact": "+52 (55) 5521 8380 ext. 110",
    "location": {
        "map_url": "http://maps.google.com/maps?daddr=19.4331%2C-99.1386",
        "address": "Bolívar #27, Col. Centro.\r\nPrimer piso 06000, Centro Histórico"
    },
    "description": "La historia de la humanidad se puede contar a través de los zapatos que usó. Los zapatos son una radiografía de la ideología, costumbres, economía, tradiciones y creencias de una sociedad. En el Museo del Calzado se muestran los zapatos de personas famosas, de personas de otros países, de personajes históricos, de escritores, pintores, deportistas... incluso de astronautas, e incluye una exposición de zapatos en miniaturas.",
    "external_urls": [
        "https://twitter.com/MuseodelCalzado",
        "http://www.elborcegui.com.mx/museo.htm",
        "mailto:museodelcalzadoborcegui@hotmail.com"
    ],
    "url": "http://cdmxtravel.com/es/lugares/museo-del-calzado.html",
    "destination": "Centro Histórico"
}