{
    "name": "Ciclovía Chapultepec",
    "labels": [
        "Diversión y adrenalina"
    ],
    "price": "",
    "categories": [
        "Ciclovías"
    ],
    "schedule": [
        "00:01-23:59",
        "00:01-23:59",
        "00:01-23:59",
        "00:01-23:59",
        "00:01-23:59",
        "00:01-23:59",
        "00:01-23:59"
    ],
    "contact": null,
    "location": {
        "map_url": "http://maps.google.com/maps?daddr=19.4166%2C-99.1704",
        "address": "Sonora s/n, Col. Roma Norte.  06700, Condesa"
    },
    "description": "De acuerdo con el sistema Ecobici, esta ruta se extiende de la calle Sonora a la calle 20 de Noviembre, en el centro de la Ciudad de México. El recorrido total es de 9.4 kilómetros. Cuenta con el espacio necesario, sin interrumpir el tránsito de los automóviles y acatando los señalamientos viales. Se recomienda el uso de chaleco o ropa que identifique al ciclista.",
    "external_urls": [
        "https://www.ecobici.df.gob.mx/sites/default/files/pdf/mapa_2014_cdmx_sedema_capsoc_0.pdf"
    ],
    "url": "http://cdmxtravel.com/es/lugares/ciclovia-chapultepec.html",
    "destination": "Condesa"
}