{
    "name": "Biblioteca Ing. Antonio M. Anza",
    "labels": [
        "Cultura todos los días"
    ],
    "price": "Gratuito",
    "categories": [
        "Bibliotecas"
    ],
    "schedule": [
        "09:00-19:00",
        "09:00-19:00",
        "09:00-19:00",
        "09:00-19:00",
        "09:00-18:00",
        "Cerrado",
        "Cerrado"
    ],
    "contact": "+52 (55) 5623 2992",
    "location": {
        "map_url": "http://maps.google.com/maps?daddr=19.4356%2C-99.1395",
        "address": "Tacuba #5, Col. Centro. 06000, Centro Histórico"
    },
    "description": "Se ubica en el Palacio de la Minería. Abrió sus puertas después de su restauración. Su decoración es de estilo palafoxiano de Puebla.\n\nTiene una impresionante estantería en muy buenas condiciones a pesar de que el edificio fue destinado a laboratorio de ensaye de materiales. Su acervo viene de finales de la época colonial.\n\nEn la actualidad cuenta con más de 184,000 volúmenes integrados en diferentes fondos, como el Fondo Antiguo con más de 12,000 volúmenes, el Fondo de la Asociación de Ingenieros y Arquitectos, el Fondo de la Biblioteca de la Sociedad Científica \"Antonio Alzate\", publicaciones periódicas tanto nacionales como extranjeras y una colección de tesis, algunas de 1891.",
    "external_urls": [
        "https://www.facebook.com/DivisionEducacionContinua.F.I?ref=hl",
        "https://www.instagram.com/palaciodemineria/",
        "https://twitter.com/MineriaUNAM",
        "https://www.youtube.com/user/DECDFI",
        "http://www.palaciomineria.unam.mx/servicios/biblioteca.php",
        "mailto:acervohistoricopalaciomineria@yahoo.com.mx"
    ],
    "url": "http://cdmxtravel.com/es/lugares/biblioteca-ing-antonio-m-anza.html",
    "destination": "Centro Histórico"
}