{
    "name": "Ectagono",
    "labels": [
        "Al aire libre",
        "En familia",
        "Diversión y adrenalina",
        "Puro sabor local"
    ],
    "price": "",
    "categories": [
        "Bosques",
        "Centros de entretenimiento familiares",
        "Huertos",
        "Espacios para correr",
        "Parkour",
        "Temazcales"
    ],
    "schedule": null,
    "contact": "+52 (55) 3455 2825",
    "location": {
        "map_url": "http://maps.google.com/maps?daddr=19.3565%2C-99.2229",
        "address": "Prol. 5 de Mayo #521, Col. las Águilas.  01750, San Ángel"
    },
    "description": "Ectagono es un nuevo paradigma para habitar la ciudad en donde se impulsa la vinculación de emprendedores, expertos y líderes en temas de medioambiente, bienestar, sociedad, cultura y tecnología.\n\nEn ectagono propone e impulsa soluciones creativas para personas, instituciones y empresas que buscan reconectar con la naturaleza y contribuir a la regeneración de la ciudad.\n\nActividades:\n\nAcroyogaDog parkBici de montañaAgricultura urbanaApiculturaArte y culturaBioconstrucciónCámara composteraDronesCalistenia y artes marcialesHula HoopParktourRescate de maíz criolloMariposarioLombriculturaCaptadores de agua pluvialTemazcal\n\nPara más información se recomienda consultar las redes sociales.",
    "external_urls": [
        "https://es-la.facebook.com/Ectagono/",
        "https://www.instagram.com/ectagono/",
        "https://twitter.com/Ectagono_",
        "http://ectagono.com/",
        "mailto:info@ectagono.com"
    ],
    "url": "http://cdmxtravel.com/es/lugares/ectagono.html",
    "destination": "San Ángel"
}