{
    "name": "Salas de Cine del Centro Cultural Universitario de la UNAM",
    "labels": [
        "Sé un espectador"
    ],
    "price": "Desde $40 MXN",
    "categories": [
        "Cines de arte"
    ],
    "schedule": [
        "12:00-20:00",
        "12:00-20:00",
        "12:00-20:00",
        "12:00-20:00",
        "12:00-20:00",
        "12:00-20:00",
        "12:00-20:00"
    ],
    "contact": "55 5622 7021",
    "location": {
        "map_url": "http://maps.google.com/maps?daddr=19.3139%2C-99.1849",
        "address": "Av. Insurgentes Sur #3000, Col. Ciudad Universitaria. 04510, Ciudad Universitaria"
    },
    "description": "Las tres salas de cine cuentan con una amplia gama de opciones en cuanto a la expresión cinematográfica en México y el mundo; además de modernos equipos de proyección y sonido. La sala Julio Bracho cuenta con 161 butacas; la sala José Revueltas con 60; y la sala Carlos Monsiváis con 54. Hay ciclos de cine, festivales, conferencias, estrenos y eventos especiales.",
    "external_urls": [
        "https://www.facebook.com/Cultura.UNAM.pagina",
        "https://twitter.com/culturaunam",
        "http://www.cultura.unam.mx/Eventos/consulta/0/0/0/0/4/0/0"
    ],
    "url": "http://cdmxtravel.com/es/lugares/salas-de-cine-del-centro-cultural-universitario-de-la-unam.html",
    "destination": "Ciudad Universitaria"
}