{
    "name": "Trajineras Xochiquetzalli",
    "labels": [
        "Puro sabor local",
        "Al aire libre",
        "En familia"
    ],
    "price": "Desde $350 MXN",
    "categories": [
        "Patrimonio Cultural Inmaterial",
        "Parques nacionales",
        "Centros de entretenimiento familiares"
    ],
    "schedule": [
        "09:00-18:00",
        "09:00-18:00",
        "09:00-18:00",
        "09:00-18:00",
        "09:00-18:00",
        "09:00-18:00",
        "09:00-18:00"
    ],
    "contact": "5653 3987",
    "location": {
        "map_url": "http://maps.google.com/maps?daddr=19.2603%2C-99.1035",
        "address": "Violeta, No. 72, Barrio Santa Crucita. 16070, Xochimilco"
    },
    "description": "Para disfrutar de recorridos en trajinera por los canales de Xochimilco, conjugando descanso y diversión, no puedes perderte la oportunidad de conocer los paseos que ofrece Trajineras Xochiquetzalli.\n\nEncontrarás atractivos que van desde los mercados tradicionales de plantas y flores, áreas verdes para recreación hasta construcciones del S. XVI.\n\nTurístico Básico: Paseo en trajinera observando chinampas e invernaderos (1 hr.)Canal Turístico: Paseo en trajinera que cuenta con una visita al Mercado de Artesanías, un invernadero o al serpentario. (2 hr.)  Ecológico: Paseo en trajinera por áreas verdes, conociendo el Museo del Ajolote, la Isla de las Muñecas, el Canal de Apatlaco, la Laguna de Tehuilo, Hortalizas de maíz o verduras y una chinampa en funcionamiento. (4 1/2 hrs.) Cultural: Paseo en trajinera pasando por el canal principal, conociendo invernaderos y con una visita guiada al Museo Arqueológico de Xochimilco. (4 hrs.) Amanecer:Recorrido especial por los canales de Xochimilco para disfrutar el amanecer.(Salidas entre las 4-5 am)Nocturno: Recorrido por los canales de Xochimilco al caer la noche, ideal para ocasiones especiales. (Salidas a partir de las 20 hrs.)\n\n\n\n*Cuenta con el servicio turístico de guías bilingües",
    "external_urls": [
        "https://www.facebook.com/trajinerasxochi",
        "https://www.instagram.com/trajinerasxochiquetzalli/",
        "https://twitter.com/trajinerasxochi?lang=es",
        "http://www.xochiquetzalli7.com.mx/",
        "mailto:www.xoxochiquetzalli@yahoo.com.mx"
    ],
    "url": "http://cdmxtravel.com/es/lugares/trajineras-xochiquetzalli.html",
    "destination": "Xochimilco"
}