{
    "name": "Centro Comercial Santa Fe",
    "labels": [
        "Tiempo libre",
        "Shopping"
    ],
    "price": "",
    "categories": [
        "Centros comerciales",
        "Boutiques únicas/originales",
        "Moda",
        "Accesorios",
        "Mobiliario",
        "diseño e interiorismo",
        "Joyería y relojería",
        "Gourmet"
    ],
    "schedule": [
        "11:00-20:00",
        "11:00-20:00",
        "11:00-20:00",
        "11:00-20:00",
        "11:00-20:00",
        "Cerrado",
        "11:00-20:00"
    ],
    "contact": "(55) 3003 4300",
    "location": {
        "map_url": "http://maps.google.com/maps?daddr=19.3641%2C-99.2712",
        "address": "Av. Vasco de Quiroga #3800, Col. Santa Fe. 05109, Santa Fe"
    },
    "description": "Es el centro comercial más grande y completo del país. Con 562,501.31 m2 de edificación y 128,367 m2 de locales comerciales, entre los que la oferta es de lo más variada, marcas internacionales, de diseño, deportes, decoración, ocio, entretenimiento, una pista de hielo, el único con un golf range.\n\nAdemás pone a su disposición más de 8 mil plazas de estacionamiento.",
    "external_urls": [
        "https://www.facebook.com/centrosantafe",
        "https://www.flickr.com/photos/125213593@N08/",
        "https://www.instagram.com/centrosantafe/",
        "https://www.tripadvisor.com.mx/Attraction_Review-g150800-d8517464-Reviews-Centro_Santa_Fe-Mexico_City_Central_Mexico_and_Gulf_Coast.html",
        "https://twitter.com/centrostafe",
        "https://www.youtube.com/user/centrostafe",
        "http://www.centrosantafe.com/",
        "mailto:webmaster@centrosantafe.com"
    ],
    "url": "http://cdmxtravel.com/es/lugares/centro-comercial-santa-fe.html",
    "destination": "Santa Fe"
}