{
    "name": "Centro Cultural de España (museo)",
    "labels": [
        "Cultura todos los días",
        "Museos"
    ],
    "price": "",
    "categories": [
        "Centros culturales",
        "Museos de arte e historia"
    ],
    "schedule": [
        "Cerrado",
        "10:00-21:00",
        "10:00-21:00",
        "10:00-21:00",
        "10:00-21:00",
        "10:00-21:00",
        "10:00-16:00"
    ],
    "contact": "+52 (55) 5521 1925",
    "location": {
        "map_url": "http://maps.google.com/maps?daddr=19.4353%2C-99.133",
        "address": "República de Guatemala #18, Col. Centro. 06010, Centro Histórico"
    },
    "description": "Forma parte de la Red de Centros Culturales de la Agencia Española de Cooperación Internacional para el Desarrollo (AECID), presente en 15 países. Todas sus actividades son gratuitas y se basan en ocho formatos: cine, música, formación (talleres y conferencias), artes en vivo, humanidades y literatura. También tiene actividades infantiles, de arte, ciencia, tecnología y sociedad; y exposiciones desde una mirada multidisciplinaria en torno al arte iberoamericano contemporáneo.\n\nEn su interior hay un museo de sitio donde se muestran restos del Calmécac, que era la escuela de los nobles mexicas y el área con exposiciones temporales. Además hay una mediateca con fondos bibliográficos y audiovisuales especializados en el arte y la cultura contemporánea; el Lab/Radio tv donde se hace producción audiovisual; una sala de lectura y la cafetería-restaurante en la terraza.",
    "external_urls": [
        "https://www.facebook.com/ccemx.org",
        "http://www.pinterest.com/ccemx/",
        "https://twitter.com/ccemx",
        "https://www.youtube.com/user/ccemx",
        "http://ccemx.org/",
        "mailto:info@ccemx.org"
    ],
    "url": "http://cdmxtravel.com/es/lugares/centro-cultural-de-espana-museo.html",
    "destination": "Centro Histórico"
}