{
    "name": "Sabrá Dios",
    "labels": [
        "Vive la noche"
    ],
    "price": "Desde $200 MXN",
    "categories": [
        "Bar",
        "Mezcalería"
    ],
    "schedule": [
        "13:00-22:00",
        "13:00-22:00",
        "13:00-22:00",
        "13:00-22:00",
        "13:00-22:00",
        "13:00-22:00",
        "Cerrado"
    ],
    "contact": "+52 (55) 5211 7623",
    "location": {
        "map_url": "http://maps.google.com/maps?daddr=19.4194%2C-99.1762",
        "address": "Av. Veracruz #15, Colonia Condesa, CDMX 06140, Condesa"
    },
    "description": "Con un nombre un tanto peculiar Sabrá Dios es un expendio de destilados con mezcales de Tamaulipas, Michoacán, Durango, Jalisco, Oaxaca, entre otros. Se pueden degustar los mezcales y comprar botellas, sería el regalo perfecto para el cumpleaños o una ocasión especial. Lo sabores son de pechuga, cenizo, espadín, tobalá, de gusano, reposado y añejo.",
    "external_urls": [
        "https://www.facebook.com/sabradiosmezcal/",
        "https://www.instagram.com/sabradiosmx/",
        "https://twitter.com/SabraDios1",
        "https://www.youtube.com/channel/UCJAszNAlsdyEIlrccBLHaDQ"
    ],
    "url": "http://cdmxtravel.com/es/lugares/sabra-dios.html",
    "destination": "Condesa"
}