{
    "name": "Dirección de Estudios Históricos INAH",
    "labels": [
        "Museos",
        "Cultura todos los días"
    ],
    "price": "",
    "categories": [
        "Ciencia e historia",
        "Bibliotecas",
        "Centros culturales"
    ],
    "schedule": [
        "09:00-20:00",
        "09:00-20:00",
        "09:00-20:00",
        "09:00-20:00",
        "09:00-20:00",
        "Cerrado",
        "Cerrado"
    ],
    "contact": "55 4040 5100",
    "location": {
        "map_url": "http://maps.google.com/maps?daddr=19.2911%2C-99.168",
        "address": "Allende #172, Col. Tlalpan Centro. 14000, Tlalpan"
    },
    "description": "En 1959 Wigberto Jiménez Moreno el Departamento de Investigaciones Históricas que, posteriormente, se convertiría en la Dirección.\n\nEn este recinto se imparten distintos seminarios, diplomados y cursos cuya temática se relaciona con temas de historia, arte y sociología mexicana.\n\nLos visitantes o asistentes pueden hacer uso del servicio bibliotecario de la institución para diferentes consultas o investigación.",
    "external_urls": [
        "https://www.facebook.com/INAHmx",
        "https://twitter.com/INAHmx",
        "https://www.youtube.com/user/INAHTV",
        "http://estudioshistoricos.inah.gob.mx/"
    ],
    "url": "http://cdmxtravel.com/es/lugares/direccion-de-estudios-historicos-inah.html",
    "destination": "Tlalpan"
}