{
    "name": "Teatro Ramiro Jiménez",
    "labels": [
        "Sé un espectador"
    ],
    "price": "",
    "categories": [
        "Teatros"
    ],
    "schedule": [
        "09:00-17:00",
        "09:00-17:00",
        "09:00-17:00",
        "09:00-17:00",
        "09:00-17:00",
        "09:00-17:00",
        "Cerrado"
    ],
    "contact": "+52 (55) 5688 5340",
    "location": {
        "map_url": "http://maps.google.com/maps?daddr=19.3562%2C-99.1531",
        "address": "Av. División del Norte #2545, Col. Del Carmen.  04100, Coyoacán"
    },
    "description": "Cuenta con 655 localidades y su escenario es tipo italiano. Aquí se presentan obras clásicas.",
    "external_urls": [
        "https://twitter.com/TeatroRamiroJ",
        "http://www.teatroramirojimenez.com/",
        "mailto:contacto@teatroramirojimenez.com"
    ],
    "url": "http://cdmxtravel.com/es/lugares/teatro-ramiro-jimenez.html",
    "destination": "Coyoacán"
}