{
    "name": "Galería Maren-Enrique Jiménez",
    "labels": [
        "Cultura todos los días"
    ],
    "price": "Gratuito",
    "categories": [
        "Galerías"
    ],
    "schedule": [
        "Cerrado",
        "Cerrado",
        "11:00-20:00",
        "11:00-20:00",
        "11:00-20:00",
        "11:00-20:00",
        "11:00-20:00"
    ],
    "contact": "+52 (55) 1997 9476",
    "location": {
        "map_url": "http://maps.google.com/maps?daddr=19.429%2C-99.1625",
        "address": "Paseo de la Reforma #234, Col. Juárez. 06600, Reforma-Zona Rosa"
    },
    "description": "Esta prestigiada galería, fundada por Enrique Jiménez en 1975, se ha preocupado por la difusión del arte mexicano contemporáneo, sirviendo como enlace entre coleccionistas e inversionistas que buscan garantía, calidad e innovación.\n\nSus dueños han montado diversas exposiciones en México y en el extranjero, donde han destacado obras de artistas tan importantes como Rufino Tamayo, Juan Soriano, Francisco Zúñiga, Francisco Toledo, entre otros.\n\nLa experiencia de esta galería es tal que cuenta con diversos servicios, desde la venta normal hasta un taller de fundición o la experiencia para valuar obras de terceros.",
    "external_urls": [
        "https://www.facebook.com/Galeria.Maren?fref=ts",
        "mailto:gal_maren@hotmail.com"
    ],
    "url": "http://cdmxtravel.com/es/lugares/galeria-maren-enrique-jimenez.html",
    "destination": "Reforma-Zona Rosa"
}