{
    "name": "El Colegio Nacional",
    "labels": [
        "Cultura todos los días"
    ],
    "price": "Gratuito",
    "categories": [
        "Bibliotecas",
        "Centros culturales"
    ],
    "schedule": [
        "09:00-17:00",
        "09:00-17:00",
        "09:00-17:00",
        "09:00-17:00",
        "09:00-17:00",
        "Cerrado",
        "Cerrado"
    ],
    "contact": "+52 (55) 5789 4330",
    "location": {
        "map_url": "http://maps.google.com/maps?daddr=19.4359%2C-99.132",
        "address": "Donceles #104, Col. Centro. 06020, Centro Histórico"
    },
    "description": "El Colegio Nacional es una institución pública dedicada a la divulgación de la cultura científica, artística y humanística, de forma gratuita, de libre acceso y sin ninguna restricción curricular o de registro.\n\nTiene su sede en Donceles 104, en el Centro Histórico de la Ciudad de México, aunque también realiza actividades en el interior del país y, en ocasiones, en el extranjero. Cada año se llevan a cabo cerca de 250 actividades académicas y culturales, y se reciben alrededor de 30 mil visitantes en sus instalaciones.",
    "external_urls": [
        "https://www.facebook.com/ColegioNacional.mx/",
        "https://www.instagram.com/elcolegionacional/",
        "https://twitter.com/ColegioNal_mx",
        "https://www.youtube.com/user/elcolegionacionalmx",
        "https://colnal.mx",
        "mailto:hola@colnal.mx"
    ],
    "url": "http://cdmxtravel.com/es/lugares/el-colegio-nacional.html",
    "destination": "Centro Histórico"
}