{
    "name": "Iglesia de San Juan de Dios",
    "labels": [
        "México monumental",
        "MICE",
        "Por recinto"
    ],
    "price": "",
    "categories": [
        "Recintos religiosos",
        "Espacios de reunión",
        "Con eventos"
    ],
    "schedule": [
        "11:00-19:00",
        "11:00-19:00",
        "11:00-14:00",
        "11:00-19:00",
        "Cerrado",
        "11:00-14:00",
        "11:00-14:00"
    ],
    "contact": "(55) 5512 8940",
    "location": {
        "map_url": "http://maps.google.com/maps?daddr=19.4369%2C-99.1435",
        "address": "Av. Hidalgo #45, Col. Centro. 06300, Alameda"
    },
    "description": "Se encuentra en la Plaza Santa Veracruz donde también está el Museo Franz Mayer, el Museo Nacional de la Estampa y la Iglesia de la Santa Veracruz. Fue construida a principios del siglo XVII para servir a los hermanos juaninos, una orden hospitalaria.\n\nLa fachada está decorada con relieves de sus fundadores. Es una iglesia en activo.",
    "external_urls": null,
    "url": "http://cdmxtravel.com/es/lugares/iglesia-de-san-juan-de-dios.html",
    "destination": "Alameda"
}