{
    "name": "Los Tours del Centro Histórico",
    "labels": [
        "Museos",
        "México monumental",
        "Puro sabor local",
        "Al aire libre",
        "En familia",
        "MICE",
        "Por recinto"
    ],
    "price": "Desde $300 MXN",
    "categories": [
        "Ciencia e historia",
        "Monumentos",
        "Palacios",
        "Casas históricas",
        "Recintos religiosos",
        "Patrimonio Mundial Cultural",
        "Patrimonio Cultural Inmaterial",
        "Plazas",
        "Mercados y bazares",
        "Centros de entretenimiento familiares",
        "Espacios de reunión",
        "Con eventos"
    ],
    "schedule": null,
    "contact": "5542 1088",
    "location": null,
    "description": "Pasea a pie en compañía de expertos del turismo de proximidad que viven y habitan en el Centro Histórico de la Ciudad de México.\n\nTurismo de proximidad (walking tours) en el Centro Histórico que comprende rutas llenas de historia, leyendas, tradición, arqueología, arquitectura y arte. Los paseos están diseñados para recorrer calles, iglesias, museos, bares, vecindades y mercados, e incluyen desde la clásica dulcería Celaya, la primera del país, hasta el lujoso Hotel Downtown, el bar La Ópera, o el Antiguo Palacio de la Inquisición. Los tours tienen distintos horarios que se publican semanalmente en sus redes sociales.\n\nRecorridos:\n\nTour especial: los secretos de la catedralTour de los palaciosRelajados y reprimidos: tour de solterosTour de cantinas VIPTour de las monjas, frailes, templos y conventosMitos, casonas, leyendas y fantasmasChocotour: la ruta del cacao y el chocolate en el Centro HistóricoTour de amor, pasión y lujuria: historias de arrebatos en el Centro Histórico",
    "external_urls": [
        "https://www.facebook.com/-LOS-TOURS-DEL-CENTRO-HISTORICO-DE-LA-CIUDAD-DE-M%C3%89XICO-123585247663425/?hc_ref=ARTXAMljsBMmm9HIy4AsbDVYRn5awhOr_ij-ifTebeYKe4HV87BB-ypXA1mvplPZ0K4&fref=nf",
        "https://www.instagram.com/lostoursdelcentrohistorico/",
        "https://www.tripadvisor.com.mx/Attraction_Review-g150800-d10295412-Reviews-Tours_CDMX-Mexico_City_Central_Mexico_and_Gulf_Coast.html",
        "https://twitter.com/search?q=%40ToursCentro&src=typd&lang=es",
        "http://www.lostoursdelcentrohistorico.com",
        "mailto:reservaciones@lostoursdelcentrohistorico.com"
    ],
    "url": "http://cdmxtravel.com/es/lugares/los-tours-del-centro-historico.html",
    "destination": "Centro Histórico"
}