{
    "name": "Mercado de San Juan",
    "labels": [
        "Puro sabor local",
        "Tiempo libre",
        "MICE",
        "Shopping"
    ],
    "price": "",
    "categories": [
        "Mercados y bazares",
        "Diseño mexicano",
        "Espacios de reunión",
        "Gourmet",
        "Comercios centenarios"
    ],
    "schedule": [
        "07:00-17:00",
        "07:00-17:00",
        "07:00-17:00",
        "07:00-17:00",
        "07:00-17:00",
        "07:00-17:00",
        "07:00-17:00"
    ],
    "contact": null,
    "location": {
        "map_url": "http://maps.google.com/maps?daddr=19.4299%2C-99.1448",
        "address": "Ernesto Pugibet #21, Col. Centro. 06000, Alameda"
    },
    "description": "Oficialmente se llama mercado Ernesto Pugibet, pero es más conocido como mercado de San Juan. Tiene más de 150 años de antigüedad y empezó como un pequeño y sencillo tianguis para convertirse en la actualidad en uno de los mercados más famosos, grandes y, tal vez, el más gourmet de la ciudad.\n\nEs la gran meca para los amantes de la cocina. Se pueden encontrar todo tipo de productos provenientes de otros estados, de Europa, Asia y América. Hay carnes exóticas de cocodrilo y avestruz. Puestos de frutas y verduras con una gran puesta en escena llenos de texturas y colores. Sin lugar a dudas es un espacio para visitar y encontrar productos sorprendentes.",
    "external_urls": [
        "https://www.facebook.com/MercadoDeSanJuan77/timeline",
        "https://www.flickr.com/photos/65916365@N07/albums/72157627587816250/",
        "https://www.instagram.com/enelsanjuan/?hl=es-la",
        "https://www.tripadvisor.com.mx/Attraction_Review-g150800-d2292645-Reviews-Mercado_de_San_Juan-Mexico_City_Central_Mexico_and_Gulf_Coast.html",
        "http://mercadosanjuan.galeon.com/"
    ],
    "url": "http://cdmxtravel.com/es/lugares/mercado-de-san-juan.html",
    "destination": "Alameda"
}