{
    "name": "Centro Universitario Cultural",
    "labels": [
        "Cultura todos los días"
    ],
    "price": "",
    "categories": [
        "Centros culturales"
    ],
    "schedule": [
        "09:00-21:00",
        "09:00-21:00",
        "09:00-21:00",
        "09:00-21:00",
        "09:00-21:00",
        "09:00-21:00",
        "09:00-21:00"
    ],
    "contact": "+52 (55) 5659 6797",
    "location": {
        "map_url": "http://maps.google.com/maps?daddr=19.3358%2C-99.1821",
        "address": "Odontología #35, Col. Copilco Universidad. 04360, Ciudad Universitaria"
    },
    "description": "Entre las décadas de los 50 y 60, frailes dominicos tuvieron la iniciativa de crear un centro cultural para los estudiantes universitarios de la naciente Ciudad Universitaria donde aunado a las actividades artísticas y deportivas se quería que los jóvenes interesados en la religión tuvieran un espacio. A la cabeza del proyecto se encontraba fray Alberto de Ezcurdia, catedrático de la Universidad Nacional.\n\nActualmente se dan clases de inglés y francés, así como exposiciones, muestras fílmicas y ciclos de conferencias. Además cuenta con una parroquia universitaria.",
    "external_urls": [
        "https://www.facebook.com/CENTROUNIVERSITARIOCULTURALCUC",
        "http://www.cuc.org.mx/",
        "mailto:contactacuc@cuc.org.mx"
    ],
    "url": "http://cdmxtravel.com/es/lugares/centro-universitario-cultural.html",
    "destination": "Ciudad Universitaria"
}