{
    "name": "Go Running tours",
    "labels": [],
    "price": "Desde $600 MXN",
    "categories": null,
    "schedule": null,
    "contact": "044 55 12 99 28 27",
    "location": {
        "map_url": "http://maps.google.com/maps?daddr=19.4191%2C-99.1891",
        "address": "Bosque de Chapultepec I Secc, 11100 Ciudad de México, CDMX 11100, Polanco-Chapultepec"
    },
    "description": "Disfruta un paseo único mientras corres por los puntos clave de esta gran ciudad.\n\nGo Running tours es una organización a nivel mundial con representación en la Ciudad de México, que organiza tours para correr en diferentes lugares. Ofrece recorridos privados de 5, 7, 10 Y 15 km para correr por distintas zonas, mientras un guía especializado traza la ruta y realiza paradas en sitios de interés para explicar su historia. Los recorridos tienen un nivel de dificultad sencillo y moderado, e incluyen fotografías digitales, agua purificada, barras energéticas y camiseta. Las reservaciones pueden realizarse a través de la página web.\n\nRecorridos:\n\nAmazing Mexico City Private Tour – 15 KmChapultepec ́s Private Tour – 7 kmCoyoacán – A Magical Neighborhood Private Tour – 5 KmHistorical Downtown Private Tour – 10 KmHistorical Downton Private Tour – 5 km",
    "external_urls": [
        "https://www.strava.com/clubs/go-running-tours-guests-and-guides-492052",
        "https://www.facebook.com/GoRunningTours/",
        "https://www.instagram.com/gorunningtours/",
        "https://twitter.com/GoRunMexicoCity?lang=es",
        "https://www.youtube.com/channel/UCYg3v1lm7BN5jrp5sTv9iQQ?view_as=subscriber",
        "HTTP://www.gorunningtours.com/index.php/city-mexico-city",
        "mailto:contact@gorunningtours.com"
    ],
    "url": "http://cdmxtravel.com/es/lugares/go-running-tours.html",
    "destination": "Polanco-Chapultepec"
}