{
    "name": "Capilla de San Antonio Molotla",
    "labels": [
        "México monumental"
    ],
    "price": "Gratuito",
    "categories": [
        "Recintos religiosos"
    ],
    "schedule": [
        "17:00-20:00",
        "17:00-20:00",
        "17:00-20:00",
        "17:00-20:00",
        "17:00-20:00",
        "17:00-20:00",
        "17:00-20:00"
    ],
    "contact": null,
    "location": {
        "map_url": "http://maps.google.com/maps?daddr=19.2635%2C-99.1067",
        "address": "Matamoros s/n, Col. Barrio San Antonio. 16000, Xochimilco"
    },
    "description": "Al entrar se puede apreciar el altar principal, dedicado a San Antonio. Su nombre significa \"Lugar donde abundan los gorriones\" y la construcción es de una sola nave, enmarcada por dos columnas de cantera tallada. El santo al que se le venera es famoso por ser el el patrón de las 'mujeres enamoradas'.",
    "external_urls": [
        "https://m.facebook.com/ComunidadLGBTTTIXochimilco/posts/884047331646167",
        "http://xochimilcoturismorecorridos.blogspot.com/2010/01/capilla-de-san-antonio-molotla.html?m=1"
    ],
    "url": "http://cdmxtravel.com/es/lugares/capilla-de-san-antonio-molotla.html",
    "destination": "Xochimilco"
}