{
    "name": "Complejo Cultural Los Pinos",
    "labels": [
        "México monumental",
        "Cultura todos los días",
        "Por recinto",
        "Museos"
    ],
    "price": "Gratuito",
    "categories": [
        "Casas históricas",
        "Galerías",
        "Centros culturales",
        "Con eventos",
        "Museos de arte e historia"
    ],
    "schedule": [
        "Cerrado",
        "10:00-17:00",
        "10:00-17:00",
        "10:00-17:00",
        "10:00-17:00",
        "10:00-17:00",
        "10:00-17:00"
    ],
    "contact": "+52 (55) 4155 0200",
    "location": {
        "map_url": "http://maps.google.com/maps?daddr=19.4156%2C-99.1912",
        "address": "Parque Lira s/n, I Sección del Bosque de Chapultepec. 11850, Polanco-Chapultepec"
    },
    "description": "Su historia se remonta a 1853 cuando el doctor José Pablo Martínez compró terrenos en la zona conocida como Molino del Rey para construir su rancho, al que llamó La Hormiga.\n\nCon la toma de posesión del presidente Lázaro Cárdenas, se anunció que él no viviría en el Castillo de Chapultepec, que en ese entonces era la residencia oficial, sino en ese rancho, pero le cambió el nombre a Los Pinos en recuerdo a la huerta donde se enamoró de su esposa, Amalia Solórzano, en Tacámbaro, Michoacán. Fue habitada por él en marzo de 1935. Al siguiente sexenio Manuel Ávila Camacho también vivió ahí con su familia, convirtiéndola en la casa oficial de los mandatarios sucesores.\n\nA partir del 1 de diciembre de 2018 la residencia oficial cambia a ser el Complejo Cultural Los Pinos. Recinto que antiguamente fuera ocupado por 14 mandatarios abre sus puertas a todo público, convirtiendo este espacio abierto para el disfrute de todos los habitantes del país.\n\nEl Complejo Cultural Los Pinos (CCLP) actualmente cuenta con actividades gratuitas enfocadas a las diferentes disciplinas artísticas.\n\n",
    "external_urls": [
        "https://www.facebook.com/ComplejoCulturalLosPinos/",
        "https://www.instagram.com/cc_lospinos/",
        "https://twitter.com/CC_LosPinos",
        "https://www.lospinos.cultura.gob.mx/",
        "mailto:contactolospinos@cultura.gob.mx"
    ],
    "url": "http://cdmxtravel.com/es/lugares/complejo-cultural-los-pinos.html",
    "destination": "Polanco-Chapultepec"
}