{
    "name": "Plaza Loreto",
    "labels": [
        "En familia",
        "Tiempo libre",
        "MICE",
        "Por recinto"
    ],
    "price": "",
    "categories": [
        "Centros de entretenimiento familiares",
        "Centros comerciales",
        "Espacios de reunión",
        "Con eventos"
    ],
    "schedule": [
        "11:00-20:00",
        "11:00-20:00",
        "11:00-20:00",
        "11:00-20:00",
        "11:00-20:00",
        "11:00-20:00",
        "11:00-20:00"
    ],
    "contact": "(55) 5616 3332",
    "location": {
        "map_url": "http://maps.google.com/maps?daddr=19.3396%2C-99.194",
        "address": "Altamirano #46, Col. Tizapán. 01090, San Ángel"
    },
    "description": "Además de centro comercial, esta plaza tiene un Museo de arte. En su foro cubierto se realizan diferentes eventos, conciertos de jazz, de música clásica, exposiciones de pintura, fotografía, se representan obras teatrales y todo tipo de espectáculos culturales siempre gratuitos.",
    "external_urls": [
        "https://www.facebook.com/PlazaLoreto/timeline?ref=page_internal",
        "https://www.tripadvisor.com.mx/Attraction_Review-g150800-d10771764-Reviews-Cinemania_Plaza_Loreto-Mexico_City_Central_Mexico_and_Gulf_Coast.html",
        "https://twitter.com/plaza_loreto",
        "http://www.centrocomercialloreto.com.mx/",
        "mailto:contacto.adminloreto@incarso.com"
    ],
    "url": "http://cdmxtravel.com/es/lugares/plaza-loreto.html",
    "destination": "San Ángel"
}