{
    "name": "Nonna",
    "labels": [
        "Vive la noche"
    ],
    "price": "Desde $300 MXN",
    "categories": [
        "Bar",
        "Lounge"
    ],
    "schedule": [
        "01:00-00:00",
        "01:00-00:00",
        "01:00-00:00",
        "01:00-01:00",
        "01:00-01:00",
        "01:00-01:00",
        "01:00-22:00"
    ],
    "contact": "+52 (55) 6394 9949",
    "location": {
        "map_url": "http://maps.google.com/maps?daddr=19.4302%2C-99.1985",
        "address": "Emilio Castelar #135, Col. Polanco. 11550, Polanco-Chapultepec"
    },
    "description": "Alta gastronomía italiana en un sótano que crea un ambiente íntimo a lado de vinos que harán el mejor maridaje con los alimentos. Cuentan con personal que sabrá recomendar la mejor opción para maridar. Ideal para ir a cenar, pues la media luz le da un toque único al lugar. Además, cuenta con una barra de bebidas.",
    "external_urls": null,
    "url": "http://cdmxtravel.com/es/lugares/nonna.html",
    "destination": "Polanco-Chapultepec"
}