{
    "name": "Biblioteca de México \"José Vasconcelos\" (La Ciudadela)",
    "labels": [
        "Cultura todos los días",
        "MICE"
    ],
    "price": "Gratuito",
    "categories": [
        "Bibliotecas",
        "Hemerotecas",
        "Espacios de reunión"
    ],
    "schedule": [
        "08:30-19:30",
        "08:30-19:30",
        "08:30-19:30",
        "08:30-19:30",
        "08:30-19:30",
        "08:30-19:30",
        "08:30-19:30"
    ],
    "contact": "+52 (55) 4155 0830",
    "location": {
        "map_url": "http://maps.google.com/maps?daddr=19.4287%2C-99.1496",
        "address": "Plaza de la Ciudadela #4, Col. Centro. 06400, Alameda"
    },
    "description": "Fue fundada en 1946 por gestiones de José Vasconcelos, quien la dirigió hasta su muerte en 1959.\nLa Biblioteca está ubicada en un inmueble de finales del siglo XVIII, dentro del Centro Histórico de la Ciudad de México, que ha sido escenario de importantes episodios políticos de la vida nacional; sirvió de prisión al caudillo de la Independencia, Don José María Morelos, y en su interior se refugió parte de las fuerzas militares que llevaron al derrocamiento del Presidente Madero en 1913.\n\nInaugurada en 2006, el edificio es una magnífica obra de arquitectura contemporánea. Construida en acero, mármol, granito, vidrio y madera. El jardín que rodea al edificio tiene más de 60 mil ejemplares de 168 especies arbóreas.\n\nLa biblioteca pone a disposición de todos los lectores un acervo de más de 580 mil libros, colecciones de material multimedia, libros infantiles, en sistema Braille y música. Todo distribuido en más de 40,000 metros lineales de estantería de acero colgante.\n\nCuenta con servicio de préstamo de materiales en sala y a domicilio. Sus instalaciones cuentan con sala multimedia, sala de música, sala infantil con libros especializados y material lúdico, salas de usos múltiples y estupendas terrazas panorámicas donde se disfruta de la lectura con diversas vistas de la ciudad.\n\nTambién se realizan exposiciones culturales y artísticas, conferencias, obras de teatro, conciertos, talleres, presentaciones de libros, narraciones y mucho más.",
    "external_urls": [
        "https://www.facebook.com/bibliotecademexico.ciudadela/timeline?ref=page_internal",
        "https://www.tripadvisor.com.mx/Attraction_Review-g150800-d10602749-Reviews-Biblioteca_Mexico-Mexico_City_Central_Mexico_and_Gulf_Coast.html",
        "https://twitter.com/BiblioMexCddela",
        "http://www.bibliotecademexico.gob.mx/",
        "mailto:bmdg@correo.conaculta.gob.mx"
    ],
    "url": "http://cdmxtravel.com/es/lugares/biblioteca-de-mexico-jose-vasconcelos-la-ciudadela.html",
    "destination": "Alameda"
}