{
    "name": "La Bipo Roma Norte",
    "labels": [
        "Vive la noche"
    ],
    "price": "Desde $300 MXN",
    "categories": [
        "Cantina",
        "Bar",
        "Mezcalería"
    ],
    "schedule": [
        "13:00-01:00",
        "13:00-01:00",
        "13:00-01:00",
        "13:00-01:00",
        "13:00-01:00",
        "13:00-01:00",
        "13:00-01:00"
    ],
    "contact": "+52 (55) 5525 4087",
    "location": {
        "map_url": "http://maps.google.com/maps?daddr=19.4171%2C-99.1668",
        "address": "Álvaro Obregón #237, Col. Roma Norte. 06700, Condesa"
    },
    "description": "Un restaurante que también es cantina. De lunes a viernes se ofrece comida corrida a un precio muy accesible. Por las noches los dj amenizan con todo tipo de música: hip hop, cumbia, rock, norteñas. Los miércoles y jueves tienen la oferta \"chela y mezcal\". Cuentan con área de fumar.",
    "external_urls": [
        "https://www.facebook.com/LaBipoRoma",
        "https://twitter.com/LaBipoRoma",
        "https://www.yelp.com.mx/biz/la-bipo-m%C3%A9xico"
    ],
    "url": "http://cdmxtravel.com/es/lugares/la-bipo-roma-norte.html",
    "destination": "Condesa"
}