{
    "name": "Biblioteca Eduardo García Máynez",
    "labels": [
        "Cultura todos los días"
    ],
    "price": "",
    "categories": [
        "Bibliotecas"
    ],
    "schedule": [
        "08:30-20:00",
        "08:30-20:00",
        "08:30-20:00",
        "08:30-20:00",
        "08:30-20:00",
        "Cerrado",
        "Cerrado"
    ],
    "contact": "+52 (55) 5622 7425",
    "location": {
        "map_url": "http://maps.google.com/maps?daddr=19.3148%2C-99.1808",
        "address": "Circuito Mario de la Cueva s/n, Col. Ciudad Universitaria. 04510, Ciudad Universitaria"
    },
    "description": "Las actividades en la biblioteca comienzan en 1940 cuando se funda el Centro de Estudios Filosóficos como parte de la Facultad de Filosofía y Letras, dentro del edificio Mascarones. Posteriormente se trasladó al cuarto piso de la Torre de Humanidades.\n\nEn 1967 toma su nombre actual de Instituto y en 1988 se crea un espacio ex profeso para la biblioteca.\n\nSu acervo no ha parado de crecer y en la actualidad contiene obras imprescindibles de la filosofía y colecciones especializadas en diferentes áreas de investigación, como lógica, epistemología, filosofía de la ciencia, de la mente, del lenguaje, filosofía en México, entre otras. También registra 34 mil títulos y más de 43 mil volúmenes; además resguarda la colección de revistas especializadas en filosofía más importante del mundo de habla hispana con 347 títulos vigentes.\n\nLa biblioteca participa muy activamente en la extensión de la cultura.",
    "external_urls": [
        "https://www.facebook.com/Biblioteca.EGM/timeline?ref=page_internal",
        "http://www.filosoficas.unam.mx/~bib/index.html",
        "mailto:bib@filosoficas.unam.mx"
    ],
    "url": "http://cdmxtravel.com/es/lugares/biblioteca-eduardo-garcia-maynez.html",
    "destination": "Ciudad Universitaria"
}