{
    "name": "Museo de Sitio de la Universidad del Claustro de Sor Juana",
    "labels": [
        "Museos"
    ],
    "price": "Gratuito",
    "categories": [
        "Ciencia e historia"
    ],
    "schedule": [
        "10:00-17:00",
        "10:00-17:00",
        "10:00-17:00",
        "10:00-17:00",
        "10:00-17:00",
        "10:00-14:00",
        "Cerrado"
    ],
    "contact": "52 57094066 ext. 116",
    "location": {
        "map_url": "http://maps.google.com/maps?daddr=19.4267%2C-99.1361",
        "address": "José María Izazaga #92, Col. Centro. 06080, Centro Histórico"
    },
    "description": "La Universidad del Claustro de Sor Juana se encuentra en el que fue el exconvento de San Jerónimo, un espacio que Sor Juana Inés de la Cruz, destacada poetisa mexicana, habitó durante 27 años. El edificio es de estilo barroco herreriano y fue inaugurado en 1623. Fue restaurado entre 1976 y 1982.\n\nLa universidad ofrece espacios de expresión artística como la Celda Contemporánea que contiene restos arqueológicos del siglo XVII. A partir de 2012, la curadora Berta Kolteniuk propuso un ciclo de exposiciones en formato tres, que consiste en mostrar la obra de tres artistas que coincidan en tema o hilo conductor.\n\nEl Claustro tiene el Foro R-38 que exhibe y promociona arte, un grupo llamado Pequeña Cantoría para motivar a los niños a sumergirse en el mundo de la música, el Ensamble de Solistas que apoya a jóvenes con aptitudes musicales, la Compañía de ópera barroca, el Coro Virreinal Rita Guerrero, Auditorio Divino Narciso, el Festival de Música Antigua y el proyecto Música en Espiral que promueve la enseñanza, apreciación, sensibilización y difusión de la música.",
    "external_urls": [
        "https://www.tripadvisor.com.mx/Attraction_Review-g150800-d186069-Reviews-Museo_de_Sitio_del_Claustro_de_Sor_Juana-Mexico_City_Central_Mexico_and_Gulf_Coast.html",
        "https://twitter.com/ClaustroSJuana",
        "http://www.ucsj.edu.mx/",
        "mailto:promocion@elclaustro.edu.mx"
    ],
    "url": "http://cdmxtravel.com/es/lugares/museo-de-sitio-de-la-universidad-del-claustro-de-sor-juana.html",
    "destination": "Centro Histórico"
}