{
    "name": "Un llamado a preservar Cuicuilco",
    "labels": [
        "México monumental"
    ],
    "price": "Gratuito",
    "categories": [
        "Arqueología",
        "Recintos religiosos",
        "Patrimonio Mundial Cultural"
    ],
    "schedule": [
        "Cerrado",
        "08:00-17:00",
        "08:00-17:00",
        "08:00-17:00",
        "08:00-17:00",
        "08:00-17:00",
        "08:00-17:00"
    ],
    "contact": null,
    "location": {
        "map_url": "http://maps.google.com/maps?daddr=19.301%2C-99.1853",
        "address": "Anillo Perif. Blvd. Adolfo López Mateos 507, esq. Insurgentes Cuicuilco.  14060, Xochimilco"
    },
    "description": "La zona arqueológica de Cuicuilco es una joya de nuestro patrimonio histórico.\n\nExisten pocos tesoros tan inmensamente valiosos en nuestra capital como sus sitios arqueológicos. Uno de los más bellos, hogar de una pirámide profundamente especial en términos de forma y arquitectura, es la zona de Cuicuilco, construida por algunos de los habitante más antiguos del Valle de México entre 600 y 800 d. C. Esta área fue rodeada paulatinamente por la mancha urbana durante el crecimiento de nuestra orbe, algo que pone en peligro su estética y conservación, algo a lo que debemos estar atentos.\n\nDurante años recientes, vecinos del área han hecho denuncias y puesto quejas ante las autoridades por la construcción de edificaciones o la colocación de anuncios espectaculares, por ejemplo, que afectan el paisaje que rodea la zona arqueológica de Cuicuilco. Estas acciones van en contra del documento conocido como Carta de Venecia, firmada en 1964 en la ciudad italiana durante el Congreso Internacional de Arquitectos y Técnicos de Monumentos Históricos, un acuerdo al que México pertenece desde entonces.\n\nEn años recientes, la construcción de gigantescos centros comerciales 3n las cercanías ha causado el enojo de vecinos, académicos, conservacionistas y figuras públicas, al grado que en el año 1997, hubo fuertes protestas en contra de lo que sería un edificio de 22 pisos de Grupo Carso. Como resultado, este edificio nunca se realizó, pero en cambio se construyó uno de ocho pisos que afecta visual y ecológicamente esa zona del Pedregal, al sur de nuestra ciudad. En el 2012, también hubo denuncias por un enorme anuncio espectacular que a la distancia daba la impresión de estar montado sobre la hermosa pirámide de Cuicuilco.\n\nEs profundamente relevante escuchar las voces y apoyar los movimientos que luchan por la conservación óptima de las zonas arqueológicasy los vestigios prehispánicos, trozos del pasado que cuentan la historia de nuestro país y de nuestros ancestros. También es apremiante buscar la manera de presionar a nuestras autoridades para que tomen medidas legales e institucionales que protejan estos sitios, pues no hacernos cargo de nuestro pasado implica olvidar nuestros orígenes y destruir aquello que, sin duda alguna, nos recuerda nuestra esencia como habitantes del Valle de México.\n\n",
    "external_urls": [
        "http://inah.gob.mx/es/zonas/119-zona-arqueologica-cuicuilco",
        "mailto:zacuicuilco_inah@inah.gob.mx"
    ],
    "url": "http://cdmxtravel.com/es/lugares/un-llamado-a-preservar-cuicuilco.html",
    "destination": "Xochimilco"
}