{
    "name": "Hobos",
    "labels": [
        "Vive la noche"
    ],
    "price": "Desde $200 MXN",
    "categories": [
        "Bar"
    ],
    "schedule": [
        "Cerrado",
        "Cerrado",
        "16:00-02:00",
        "16:00-02:00",
        "14:00-02:00",
        "14:00-02:00",
        "Cerrado"
    ],
    "contact": "55 7030 1563",
    "location": {
        "map_url": "http://maps.google.com/maps?daddr=19.3447%2C-99.1914",
        "address": "Plaza San Jacinto #23-A, Col. San Ángel. 01000, San Ángel"
    },
    "description": "El rock, jazz y blues son el alma de este lugar, cada fin de semana la presentación de bandas en vivo hacen de cada noche una experiencia diferente. Una de sus paredes evocará a Janis Joplin, Ray Charles, Elvis e incluso David Bowie.",
    "external_urls": [
        "https://www.facebook.com/HobosOficial/",
        "https://www.instagram.com/hobos_mx/?hl=es-la",
        "https://twitter.com/Hobos_Mx",
        "http://hobos.com.mx/"
    ],
    "url": "http://cdmxtravel.com/es/lugares/hobos.html",
    "destination": "San Ángel"
}