{
    "name": "Centro Cultural Elena Garro",
    "labels": [
        "Museos",
        "Cultura todos los días",
        "MICE",
        "Por recinto"
    ],
    "price": "Gratuito",
    "categories": [
        "Arte",
        "Bibliotecas",
        "Centros culturales",
        "Espacios de reunión",
        "Con eventos"
    ],
    "schedule": [
        "10:00-21:00",
        "10:00-21:00",
        "10:00-21:00",
        "10:00-21:00",
        "10:00-21:00",
        "10:00-21:00",
        "10:00-21:00"
    ],
    "contact": "+52 (55) 3003 4081",
    "location": {
        "map_url": "http://maps.google.com/maps?daddr=19.3485%2C-99.1587",
        "address": "Fernández Leal #43, Barrio De La Concepción. 04020, Coyoacán"
    },
    "description": "Un espacio que integra modernidad en el centro colonial de Coyoacán. El centro cultural cuenta con un fantástica librería Educal, construida sobre las bases de un edificio colonial, con una sección única para niños; así como un auditorio donde se organizan ciclos de cines, presentaciones editoriales y mucho más. Una pequeña barra ofrece café de altura y pastas para disfrutar en la agradable terraza.",
    "external_urls": [
        "https://www.facebook.com/ccElenaGarro/?fref=ts",
        "https://twitter.com/cc_elenagarro?lang=en",
        "https://www.educal.com.mx/elenagarro/",
        "mailto:informes.elenagarro@educal.com.mx"
    ],
    "url": "http://cdmxtravel.com/es/lugares/centro-cultural-elena-garro.html",
    "destination": "Coyoacán"
}