{
    "name": "The Shops at Downtown",
    "labels": [
        "Puro sabor local",
        "Tiempo libre"
    ],
    "price": "",
    "categories": [
        "Artesanías",
        "Diseño mexicano"
    ],
    "schedule": [
        "09:00-22:00",
        "09:00-22:00",
        "09:00-22:00",
        "09:00-22:00",
        "09:00-22:00",
        "09:00-22:00",
        "09:00-22:00"
    ],
    "contact": "+52 (55) 5521 2098",
    "location": {
        "map_url": "http://maps.google.com/maps?daddr=19.4328%2C-99.1361",
        "address": "Isabel la Católica #30, Col. Centro. 06000, Centro Histórico"
    },
    "description": "El edificio está en el primer cuadro de la ciudad y es de los primeros palacios de la Ciudad de México, conocido como el Palacio de los Condes de Miravalle. Actualmente es un hotel boutique, un hostal y tiene atractivas tiendas de artesanías y diseño mexicano en sus interiores. Las tiendas están divididas en Arte y diseño con las marcas Mongo, Ocelotl, Pineda Covalín y Párakata; en moda y estilo está la tienda Oro de Monte Albán, Fábrica social con coloridos y elegantes vestidos hechos a mano por mujeres artesanas, la tienda de productos orgánicos Ecobutik y más; también hay tienda gourmet, restaurantes y cafeterías.",
    "external_urls": [
        "https://www.facebook.com/TheShopsDT?fref=ts",
        "https://www.instagram.com/theshopsdt/",
        "https://twitter.com/TheShopsDT",
        "https://theshops.mx/",
        "mailto:theshops@wulf.mx"
    ],
    "url": "http://cdmxtravel.com/es/lugares/the-shops-at-downtown.html",
    "destination": "Centro Histórico"
}