{
    "name": "Museo de Anatomopatología",
    "labels": [
        "Museos"
    ],
    "price": "Gratuito",
    "categories": [
        "Ciencia e historia"
    ],
    "schedule": [
        "10:00-18:00",
        "10:00-18:00",
        "10:00-18:00",
        "10:00-18:00",
        "10:00-18:00",
        "Cerrado",
        "Cerrado"
    ],
    "contact": null,
    "location": {
        "map_url": "http://maps.google.com/maps?daddr=19.3299%2C-99.1773",
        "address": "Circuito Exterior s/n, Col. Ciudad Universitaria. 04510, Ciudad Universitaria"
    },
    "description": "Este museo es único en su tipo y uno de los más completos del continente americano. Fue creado por el Dr. Manuel H. Sarvide y ampliado por la Dra. Aline Schunemann en 1971. En sus inicios la exhibición era sólo una pequeña muestra; sin embargo, se iniciaron montajes de piezas en envases de material acrílico y a partir de ahí su crecimiento no paró. En 1991, con nuevas instalaciones, se inició la preservación formal de las piezas mediante la plastinación.\n\nActualmente este museo es visitado por miles de personas cada año; en él se exhiben órganos de diversos especímenes que presentan alguna enfermedad, por lo que se pueden observar cortes de órganos animales y mucho más.",
    "external_urls": [
        "https://web.facebook.com/FMVZ.UNAM.Oficial/",
        "https://www.instagram.com/fmvz_unam/",
        "https://twitter.com/FMVZUNAM",
        "http://www.fmvz.unam.mx/fmvz/departamentos/patologia/museo.html"
    ],
    "url": "http://cdmxtravel.com/es/lugares/museo-de-anatomopatologia.html",
    "destination": "Ciudad Universitaria"
}