{
    "name": "Centro Cultural Teatro I y II",
    "labels": [
        "Museos",
        "Sé un espectador",
        "Por recinto"
    ],
    "price": "",
    "categories": [
        "Arte",
        "Centros de espectáculos y salas de conciertos",
        "Teatros",
        "Con eventos"
    ],
    "schedule": [
        "10:00-18:00",
        "10:00-18:00",
        "10:00-18:00",
        "10:00-18:00",
        "10:00-18:00",
        "10:00-18:00",
        "10:00-18:00"
    ],
    "contact": "+52 (55) 5208 4345",
    "location": {
        "map_url": "http://maps.google.com/maps?daddr=19.4252%2C-99.1544",
        "address": "Av. Cuauhtémoc #119, Col. Roma Norte. 06700, Roma"
    },
    "description": "Este centro cultural, que antes se denominaba Telmex, abre sus puertas para que sus visitantes puedan apreciar obras de teatro, conciertos y recitales. Está perfectamente comunicado con el metrobús y el metro de la Ciudad de México.\n\nConsulta la cartelera de eventos",
    "external_urls": [
        "https://es-la.facebook.com/centroculturalteatro1/"
    ],
    "url": "http://cdmxtravel.com/es/lugares/centro-cultural-teatro-i-y-ii.html",
    "destination": "Roma"
}