{
    "name": "Living Room Bar",
    "labels": [
        "Vive la noche"
    ],
    "price": "Desde $300 MXN",
    "categories": [
        "Antro",
        "Bar"
    ],
    "schedule": [
        "19:00-02:00",
        "19:00-02:00",
        "19:00-02:00",
        "19:00-02:00",
        "19:00-02:00",
        "19:00-02:00",
        "Cerrado"
    ],
    "contact": "(55) 9138 1800",
    "location": {
        "map_url": "http://maps.google.com/maps?daddr=19.4276%2C-99.195",
        "address": "Campos Elíseos #260, Col. Polanco. 11550, Polanco-Chapultepec"
    },
    "description": "Un auténtico lujo que se ubica dentro del hotel W, en una de las calles más hermosas de la Ciudad de México. El ambiente es sofisticado y a la vez casual, los colores juegan con el ambiente y las bebidas son una experiencia diferente que combina sabores y aromas. La música varía y crea un entorno único.",
    "external_urls": null,
    "url": "http://cdmxtravel.com/es/lugares/living-room-bar.html",
    "destination": "Polanco-Chapultepec"
}