{
    "name": "Teatro Carpa Geodésica",
    "labels": [
        "Sé un espectador"
    ],
    "price": "",
    "categories": [
        "Teatros"
    ],
    "schedule": [
        "17:00-22:00",
        "Cerrado",
        "17:00-22:00",
        "17:00-22:00",
        "17:00-22:00",
        "10:00-22:00",
        "10:00-22:00"
    ],
    "contact": "+52 (55) 5616 0866",
    "location": {
        "map_url": "http://maps.google.com/maps?daddr=19.3456%2C-99.1886",
        "address": "Av. Insurgentes Sur #2135, Col. San Ángel. 01000, San Ángel"
    },
    "description": "Es un multiforo cultural donde se puede ver desde una presentación de danza, una obra de teatro, hasta un concierto. Sus fundadores se preocuparon porque el teatro rescatara el género mexicano de revista política, un tipo de comedia que tiene origen centenario. También lleva ese nombre por la forma esférica de la cúpula que está formada por domos en forma de triángulos, hexágonos y pentágonos.",
    "external_urls": [
        "https://m.facebook.com/CarpaGeodesicaTeatro/",
        "https://mobile.twitter.com/carpageodesica",
        "http://www.carpageodesica.com/",
        "mailto:teatrocarpageodesica@hotmail.com"
    ],
    "url": "http://cdmxtravel.com/es/lugares/teatro-carpa-geodesica.html",
    "destination": "San Ángel"
}