{
    "name": "El Botellón",
    "labels": [
        "Vive la noche"
    ],
    "price": "Desde $250 MXN",
    "categories": [
        "Bar"
    ],
    "schedule": [
        "12:00-00:00",
        "12:00-00:00",
        "12:00-00:00",
        "12:00-00:00",
        "12:00-00:00",
        "12:00-00:00",
        "12:00-00:00"
    ],
    "contact": "+52 (55) 5829 6223",
    "location": {
        "map_url": "http://maps.google.com/maps?daddr=19.4311%2C-99.1977",
        "address": "Av. Tamaulipas 106, Hipódromo Condesa 06170, Condesa"
    },
    "description": "Un lugar para degustar comida gallega y precopear. El decorado estilo europeo fue cuidadosamente seleccionado. La planta baja consta de mesas y sillas para convivir; el primer piso es un área tipo lounge con sillones para una plática más privada; el segundo es el área lúdica donde hay dardos, mesas de beer pong y futbolín, y el último piso es una hermosa terraza con un huerto vertical y plantaciones que simulan un viñedo.",
    "external_urls": [
        "https://www.facebook.com/ElBotellonmx/timeline",
        "https://www.tripadvisor.com.mx/Restaurant_Review-g150800-d6368326-Reviews-El_Botellon-Mexico_City_Central_Mexico_and_Gulf_Coast.html",
        "https://twitter.com/elbotellon_mx",
        "http://www.elbotellon.com.mx/",
        "mailto:info@elbotellon.com.mx"
    ],
    "url": "http://cdmxtravel.com/es/lugares/el-botellon.html",
    "destination": "Condesa"
}