{
    "name": "Marc Jacobs Antara",
    "labels": [
        "Shopping"
    ],
    "price": "",
    "categories": [
        "Moda"
    ],
    "schedule": [
        "11:00-20:00",
        "11:00-20:00",
        "11:00-20:00",
        "11:00-20:00",
        "11:00-21:00",
        "11:00-21:00",
        "11:00-20:00"
    ],
    "contact": "+52 (55) 5281 6639",
    "location": {
        "map_url": "http://maps.google.com/maps?daddr=19.4395%2C-99.2025",
        "address": "Ejército Nacional #843-B, Col. Granada. 11520, Polanco-Chapultepec"
    },
    "description": "Considerado uno de los diseñadores más productivos y más destacados en la actualidad. Prendas y complementos cuidados al máximo detalle. Marc Jacobs imprime especial atención en los textiles y materiales que utiliza, sedas, pieles y colores brillantes dan vida a piezas elegantes y exclusivas.",
    "external_urls": [
        "https://www.facebook.com/marcjacobsintl?_rdr=p",
        "https://www.instagram.com/marcjacobs/",
        "https://www.pinterest.com.mx/marcjacobs/",
        "https://twitter.com/marcjacobs",
        "https://www.youtube.com/user/MarcJacobs",
        "https://www.marcjacobs.com/"
    ],
    "url": "http://cdmxtravel.com/es/lugares/marc-jacobs-antara.html",
    "destination": "Polanco-Chapultepec"
}