{
    "name": "Tepitour",
    "labels": [
        "México monumental",
        "Puro sabor local",
        "Shopping"
    ],
    "price": "Gratuito",
    "categories": [
        "Casas históricas",
        "Mercados y bazares",
        "Comercios centenarios"
    ],
    "schedule": [
        "Cerrado",
        "14:00-16:00",
        "Cerrado",
        "Cerrado",
        "Cerrado",
        "Cerrado",
        "Cerrado"
    ],
    "contact": "2452 3325",
    "location": {
        "map_url": "http://maps.google.com/maps?daddr=19.4358%2C-99.1441",
        "address": "Av. Hidalgo s/n, Cuauhtémoc, Centro, 06010 Ciudad de México, CDMX 06010, Alameda"
    },
    "description": "Viaja en tranvía por una de las zonas más antiguas de la ciudad y empápate de la historia e identidad cultural de Tepito.\n\nRecorrido en tranvía por algunos de los lugares más emblemáticos del barrio de Tepito. El paseo incluye la casa de Jaime Nunó, la primera tienda de raya del país, la galería José María Velasco, los monumentos al Ratón Macías y al Santo, el Museo Indígena, el deportivo Morelos, el Templo de la Conchita y la Iglesia de Santa Ana, así como estudios de artistas de\nla zona. El recorrido se realiza los días martes a las 14:00 horas saliendo del Kisoco de la Alameda Central.",
    "external_urls": [
        "https://www.facebook.com/AlcCuauhtemocMx/?ref=bookmarks",
        "https://www.instagram.com/alccuauhtemocmx/",
        "https://twitter.com/AlcCuauhtemocMx",
        "https://alcaldiacuauhtemoc.mx/",
        "mailto:abcdetepito@hotmail.com"
    ],
    "url": "http://cdmxtravel.com/es/lugares/tepitour.html",
    "destination": "Alameda"
}