{
    "name": "Tenampa",
    "labels": [
        "Vive la noche"
    ],
    "price": "Desde $250 MXN",
    "categories": [
        "Cantina",
        "Bar"
    ],
    "schedule": [
        "13:00-01:00",
        "13:00-01:00",
        "13:00-01:00",
        "13:00-01:00",
        "13:00-02:00",
        "13:00-02:00",
        "13:00-01:00"
    ],
    "contact": "+52 (55) 5526 6176",
    "location": {
        "map_url": "http://maps.google.com/maps?daddr=19.441%2C-99.1389",
        "address": "Plaza Garibaldi #12, Col. Centro. 06010, Norte"
    },
    "description": "El salón Tenampa es uno de los bares y cantinas de mayor tradición en Garibaldi. A éste han asistido personalidades como José Alfredo Jiménez, Chavela Vargas, Pedro Infante, Luis Miguel y Cantinflas. Fue fundado en 1925 y desde entonces ha sido sede de momentos inolvidables.",
    "external_urls": [
        "https://www.facebook.com/SalonTenampaOficial/",
        "https://www.instagram.com/salontenampa/",
        "https://twitter.com/Tenampaa",
        "http://www.salontenampa.com/",
        "mailto:contacto@salontenampa.com"
    ],
    "url": "http://cdmxtravel.com/es/lugares/tenampa.html",
    "destination": "Norte"
}