{
    "name": "\"La trinchera\" de José Clemente Orozco",
    "labels": [
        "Museos",
        "México monumental",
        "Cultura todos los días",
        "En familia"
    ],
    "price": "Desde $50 MXN",
    "categories": [
        "Arte",
        "Murales",
        "Galerías",
        "Centros de entretenimiento familiares",
        "Museos de arte e historia"
    ],
    "schedule": [
        "Cerrado",
        "10:00-20:00",
        "10:00-18:00",
        "10:00-18:00",
        "10:00-18:00",
        "10:00-18:00",
        "10:00-18:00"
    ],
    "contact": "+52 (55) 5702 2991",
    "location": {
        "map_url": "http://maps.google.com/maps?daddr=19.4363%2C-99.1309",
        "address": "Justo Sierra #16, Col. Centro.  06020, Centro Histórico"
    },
    "description": "De 1922 a 1926, Orozco realizó murales en los tres pisos del patio grande del Colegio de San Ildefonso, al norte. Uno de ellos es La trinchera, que a través de tres figuras resalta la tragedia revolucionaria, en cuestión de violencia y muertes.\n\nEsta obra mural, realizada al fresco, se ubica en el muro norte del Patio Grande del Antiguo Colegio de San Ildefonso, en el Centro Histórico de la Ciudad de México. Durante esta década pos-revolucionaria en que fue realizada, el tema de la revuelta mexicana fue ampliamente representado por Orozco en sus obras de caballete, y en esta obra mural el tema es aún más trágico. En el mural aparecen tres figuras de hombres al centro cuyos rostros no es posible observar. El primero, del lado izquierdo, porta un par de cananas y aparece cayendo sobre el segundo, que nos muestra su torso desnudo hacia al frente y que cae con sus brazos extendidos en forma de cruz sobre un gran bloque de piedra. Un tercer hombre aparece arrodillado y cubre con su brazo izquierdo su rostro, lo que se puede interpretar como su involuntad por presenciar el dolor y la muerte que emana de la lucha revolucionaria.\n\nPareciera como si el mural representara una yuxtaposición de estos hombre vista desde arriba, sobre la superficie de la piedra, y a su vez vista de frente, como corresponde la vista de perfil del hombre arrodillado.\n\nEn el mural se aprecia el uso de rojos y claroscuros que sugieren la sangre y el fuego de las armas. Como dato curioso, La Trinchera estuvo impresa en el billete de 100 pesos en los años 70.",
    "external_urls": [
        "https://www.facebook.com/AntiguoColegiodeSanIldefonso?ref=ts",
        "http://instagram.com/sanildefonsomx",
        "https://www.tripadvisor.com.br/LocationPhotoDirectLink-g150800-d152765-i163197133-Antiguo_Colegio_de_San_Ildefonso-Mexico_City_Central_Mexico_and_Gulf_Coas.html",
        "https://twitter.com/SanIldefonsoMX",
        "http://www.sanildefonso.org.mx/mural_trinchera.php?-",
        "mailto:servicios@sanildefonso.org.mx"
    ],
    "url": "http://cdmxtravel.com/es/lugares/la-trinchera-de-jose-clemente-orozco.html",
    "destination": "Centro Histórico"
}