{
    "name": "La Graciela: Taller de cerveza",
    "labels": [
        "Vive la noche"
    ],
    "price": "Desde $300 MXN",
    "categories": [
        "Bar",
        "Cervecería"
    ],
    "schedule": [
        "11:00-23:00",
        "11:00-23:00",
        "11:00-23:00",
        "11:00-01:00",
        "12:00-02:00",
        "12:00-02:00",
        "14:00-22:00"
    ],
    "contact": "+52 (55) 5584 2728",
    "location": {
        "map_url": "http://maps.google.com/maps?daddr=19.4148%2C-99.159",
        "address": "Orizaba #161, Col. Roma Norte. 06700, Roma"
    },
    "description": "El fuerte son las cervezas hechas artesanalmente ahí mismo en La Graciela, de hecho también se dan clases para aprender a preparar la bebida espumosa. Este lugar cuenta con restaurante.",
    "external_urls": [
        "https://www.facebook.com/LaGracielaTC",
        "https://www.instagram.com/ciudadfantastica/?hl=es-la",
        "https://www.tripadvisor.com.mx/ShowUserReviews-g150800-d4724121-r383515749-La_Graciela-Mexico_City_Central_Mexico_and_Gulf_Coast.html",
        "https://twitter.com/search?q=%40LaGracielaTC&src=typd&lang=es",
        "https://www.timeoutmexico.mx/ciudad-de-mexico/bares-y-cantinas/la-graciela-taller-de-cerveza"
    ],
    "url": "http://cdmxtravel.com/es/lugares/la-graciela-taller-de-cerveza.html",
    "destination": "Roma"
}