{
    "name": "Centro Cultural Carlos Montemayor (El Arbolillo)",
    "labels": [
        "Museos",
        "Cultura todos los días",
        "Por recinto"
    ],
    "price": "",
    "categories": [
        "Arte",
        "Centros culturales",
        "Con eventos"
    ],
    "schedule": [
        "10:00-18:00",
        "10:00-18:00",
        "10:00-18:00",
        "10:00-18:00",
        "10:00-18:00",
        "Cerrado",
        "Cerrado"
    ],
    "contact": "+52 (1) 55 1365 4658",
    "location": {
        "map_url": "http://maps.google.com/maps?daddr=19.539%2C-99.1423",
        "address": "Cda. Gabriel Guerra s/n, Col. Zona Escolar Oriente. 07239, Villa de Guadalupe"
    },
    "description": "Este centro cuenta con un amplio foro donde se realizan conciertos y obras de teatro de diversas compañías, todo con el fin de enriquecer el acervo cultural de los niños, jóvenes y adultos de la zona. Se ubica al norte de ciudad y también ofrece talleres de computación, inglés y mucho más.",
    "external_urls": null,
    "url": "http://cdmxtravel.com/es/lugares/centro-cultural-carlos-montemayor-el-arbolillo.html",
    "destination": "Villa de Guadalupe"
}