{
    "name": "Tour de Jardinería Orgánica Cultiva Ciudad",
    "labels": [
        "Al aire libre",
        "Por recinto"
    ],
    "price": "Gratuito",
    "categories": [
        "Huertos",
        "Con eventos"
    ],
    "schedule": [
        "Cerrado",
        "09:00-18:00",
        "09:00-18:00",
        "09:00-18:00",
        "09:00-18:00",
        "10:00-14:00",
        "Cerrado"
    ],
    "contact": "71585307",
    "location": {
        "map_url": "http://maps.google.com/maps?daddr=19.414%2C-99.1794",
        "address": "Zamora 169,  interior 4. Col. Condesa. 06140, Condesa"
    },
    "description": "Cultiva Ciudad es una asociación civil dedicada a la difusión de la agricultura urbana basada en un concepto comunitario.\n\nSu objetivo es utilizar la agricultura urbana como un medio educativo, productivo y terapéutico para transformar la relación de los habitantes con sus alimentos y regenerar el medio ambiente.\n\nCuenta con un huerto ubicado en el terreno de 1,650 m2 donde se erguía el desaparecido Edificio Oaxaca en Tlatelolco (en la esquina de Paseo de la Reforma y Manuel González).\n\nEl huerto ofrece a personas y comunidades circundantes capacitaciones sobre agricultura urbana, que les permitan\naprender a cosechar su propio alimento. Cuentan con una diversidad de talleres y actividades relacionadas con el huerto y la gastronomía.\n\nA lo largo de estos 5 años se han impartido 21 ciclos de talleres comunitarios, impactando y compartiendo conocimientos con mas de 330 participantes.\n\nSe han realizado 40 visitas escolares desde guarderías a universidades, involucrando a un aproximado de 1300 estudiantes\n\nContamos con 180m2 de camas de cultivo y 500m2 de bosque comestible, contando con una producción anual de aproximadamente 680kg de cosecha\n\nNos importa mucho el cierre de ciclos de los nutrientes. Contamos con métodos de compostaje como baño seco, composta por capas, lombricomposta, boccashi\n\n\n\n\n\nEste año celebramos la 3ra edición del Festival por la Tierra con una serie de eventos orientados a impulsar el consumo de comida sana, orgánica y local.\n\nEn esta ocasión además pláticas, talleres, siembra, intercambio de semillas y actividades para niños, tendremos un mercado de productores y organizaciones.",
    "external_urls": [
        "https://www.facebook.com/Huerto-Tlatelolco-1154731687887464/",
        "https://www.instagram.com/cultivaciudad/?hl=es-la",
        "https://twitter.com/search?f=tweets&q=%40cultivaciudadMX&src=typd",
        "https://www.youtube.com/channel/UCs4uR1_E_dL5HTVid16-PNg",
        "http://www.culticiudad.org/",
        "mailto:huertotlatelolco@cultivaciudad.com"
    ],
    "url": "http://cdmxtravel.com/es/lugares/tour-de-jardineria-organica-cultiva-ciudad.html",
    "destination": "Condesa"
}