{
    "name": "Tiffany & Co Masaryk",
    "labels": [
        "Shopping"
    ],
    "price": "",
    "categories": [
        "Joyería y relojería"
    ],
    "schedule": [
        "11:00-19:00",
        "11:00-19:00",
        "11:00-19:00",
        "11:00-19:00",
        "11:00-19:00",
        "11:00-18:00",
        "12:00-17:30"
    ],
    "contact": "+52 (55) 5281 5222",
    "location": {
        "map_url": "http://maps.google.com/maps?daddr=19.4318%2C-99.2009",
        "address": "Av. Presidente Masaryk #450, Col Polanco. 11560, Polanco-Chapultepec"
    },
    "description": "Famosa joyería estadounidense, fundada en 1837. Desde entonces y hasta la actualidad tienen tiendas por todo el mundo siendo la más conocida la ubicada en la esquina de la Quinta Avenida de Nueva York. Su especialidad son los diamantes los cuales podrás encontrar en sus preciosos anillos de compromiso.",
    "external_urls": [
        "https://www.facebook.com/Tiffany",
        "https://instagram.com/tiffanyandco/",
        "https://www.pinterest.com.mx/TiffanyAndCo/",
        "https://twitter.com/TiffanyAndCo",
        "https://www.youtube.com/user/OfficialTiffanyAndCo",
        "http://www.tiffany.es/"
    ],
    "url": "http://cdmxtravel.com/es/lugares/tiffany-co-masaryk.html",
    "destination": "Polanco-Chapultepec"
}