{
    "name": "La Clandestina",
    "labels": [
        "Vive la noche"
    ],
    "price": "Desde $250 MXN",
    "categories": [
        "Bar",
        "Mezcalería"
    ],
    "schedule": [
        "18:00-00:00",
        "18:00-01:00",
        "18:00-01:00",
        "18:00-02:00",
        "18:00-02:00",
        "18:00-02:00",
        "Cerrado"
    ],
    "contact": "+52 (55) 5525 1100",
    "location": {
        "map_url": "http://maps.google.com/maps?daddr=19.4135%2C-99.1713",
        "address": "Av. Álvaro Obregón #298, Col. Hipódromo.  06100, Condesa"
    },
    "description": "Una mezcalería con un estilo muy particular. Las luces rojas le dan un tono lúgubre que contrasta con el decorado donde se simula una antigua tienda de las que ya no hay en México y que llamaban estanquillos.\n\nEn la barra se surte el mezcal con unos garrafones instalados sobre unas repisas en las paredes, lo cual le da un toque muy original.",
    "external_urls": [
        "https://www.facebook.com/pg/La-Clandestina-268418056648173/about/?ref=page_internal",
        "https://www.tripadvisor.com.mx/Restaurant_Review-g150800-d3821040-Reviews-La_Clandestina-Mexico_City_Central_Mexico_and_Gulf_Coast.html",
        "http://www.milagrito.com/mezcales-milagrito#el-proceso"
    ],
    "url": "http://cdmxtravel.com/es/lugares/la-clandestina.html",
    "destination": "Condesa"
}