{
    "name": "KidZania Santa Fe",
    "labels": [
        "En familia",
        "Por recinto"
    ],
    "price": "",
    "categories": [
        "Centros de entretenimiento familiares",
        "Con eventos",
        "Parques de diversión"
    ],
    "schedule": [
        "Cerrado",
        "09:00-19:00",
        "09:00-19:00",
        "09:00-19:00",
        "09:00-20:00",
        "10:00-20:00",
        "10:00-20:00"
    ],
    "contact": "(55) 9177 4700 ext. 2000",
    "location": {
        "map_url": "http://maps.google.com/maps?daddr=19.3599%2C-99.2748",
        "address": "Av. Vasco de Quiroga #3800, Col. Santa Fe. 05109, Santa Fe"
    },
    "description": "También es conocida como \"La ciudad de los niños\". Es un concepto de edu-entretenimiento donde los niños de seis a doce años se enfrentan a algunas situaciones típicas de los adultos, como ir al banco o trabajar en una pizzería. Diversión garantizada hecha en un mundo a la medida.\n\nLos precios varían dependiendo la edad del niño.",
    "external_urls": [
        "https://www.facebook.com/KidZaniaMexico",
        "https://www.instagram.com/kidzaniamexico/",
        "https://www.tripadvisor.com.mx/Attraction_Review-g150800-d2587943-Reviews-KidZania_Santa_Fe-Mexico_City_Central_Mexico_and_Gulf_Coast.html",
        "https://twitter.com/KidZaniaMexico",
        "https://www.youtube.com/user/kidzania",
        "https://santafe.kidzania.com/es-mx",
        "mailto:info.santafe@kidzania.com"
    ],
    "url": "http://cdmxtravel.com/es/lugares/kidzania-santa-fe.html",
    "destination": "Santa Fe"
}