{
    "name": "Teatro Telcel",
    "labels": [
        "Sé un espectador"
    ],
    "price": "",
    "categories": [
        "Teatros"
    ],
    "schedule": [
        "10:00-20:00",
        "10:00-20:00",
        "10:00-20:00",
        "10:00-20:00",
        "10:00-20:00",
        "10:00-20:00",
        "10:00-18:00"
    ],
    "contact": "55 4976 0505",
    "location": {
        "map_url": "http://maps.google.com/maps?daddr=19.441%2C-99.2038",
        "address": "Lago Zúrich #245, Col. Ampliación Granada. 11529, Polanco-Chapultepec"
    },
    "description": "Fue inaugurado recientemente para dar un espacio a los mayores eventos teatrales. Es un espacio versátil, con mil 400 localidades ubicadas estratégicamente para dar la sensación de cercanía con el escenario. Sus cómodas instalaciones cuentan con la más alta tecnología en América Latina y fueron diseñadas para funcionar de una manera sustentable.",
    "external_urls": [
        "https://twitter.com/Teatro_Telcel",
        "http://www.ticketmaster.com.mx/Teatro-Telcel-boletos-Mexico/venue/165155"
    ],
    "url": "http://cdmxtravel.com/es/lugares/teatro-telcel.html",
    "destination": "Polanco-Chapultepec"
}