{
    "name": "Lago de Xochimilco (Embarcadero de Cuemanco)",
    "labels": [
        "México monumental",
        "Al aire libre",
        "En familia",
        "Por recinto"
    ],
    "price": "Desde $500 MXN",
    "categories": [
        "Patrimonio Mundial Cultural",
        "Bosques",
        "Lagos",
        "Centros de entretenimiento familiares",
        "Con eventos"
    ],
    "schedule": [
        "08:00-22:00",
        "08:00-22:00",
        "08:00-22:00",
        "08:00-22:00",
        "08:00-22:00",
        "08:00-22:00",
        "08:00-22:00"
    ],
    "contact": null,
    "location": {
        "map_url": "http://maps.google.com/maps?daddr=19.2869%2C-99.1022",
        "address": "Blvd Adolfo Ruíz Cortinez, Periférico Sur N/A, Col. Barrio 18. 16034, Xochimilco"
    },
    "description": "Las trajineras son embarcaciones de madera desde la cuales se hacen paseos por la red de canales que conectan a Xochimilco, fueron inauguradas el 5 de junio de 1993 y es considerado un embarcadero ecológico.\n\nDesde este sitio se solicita al remero que lleve a la zona núcleo del lago de Xochimilco, que es la parte más conservada de todos los canales. En el camino se pueden ver aves, las chinampas, que es el sistema de agricultura prehispánico, escuchar mariachis, tríos, marimba y degustar platillos.\n\nEn esta área se lleva a cabo la siembra de diversos productos agrícolas en las chinampas, venta de comida y antojitos mexicanos y renta de trajineras para dar un paseo entre las chinampas. El embarcadero Cuemanco es la sede en la que se lleva a cabo el espectáculo de luz y sonido 'La Cihuacóatl, Leyenda de la Llorona', que tiene como fin difundir la riqueza cultural de Xochimilco.\n\nEl precio de la trajinera puede variar según la temporada y se trata con el conductor de ésta.",
    "external_urls": [
        "https://www.facebook.com/pg/CuemancoEmbarcadero/about/",
        "https://www.instagram.com/embarcadero_cuemanco_oficial/?fbclid=IwAR3MqLHJdznYqBe7OJus1YFcH3YkrjNAtYGY5bWojT9ynuf_1_4XSNJvDDs"
    ],
    "url": "http://cdmxtravel.com/es/lugares/lago-de-xochimilco-embarcadero-de-cuemanco.html",
    "destination": "Xochimilco"
}