{
    "name": "Milo's Bistrot Bar",
    "labels": [
        "Vive la noche",
        "MICE"
    ],
    "price": "Desde $250 MXN",
    "categories": [
        "Bar",
        "Espacios de reunión"
    ],
    "schedule": [
        "08:00-23:00",
        "08:00-23:00",
        "08:00-23:00",
        "08:00-00:00",
        "08:00-00:00",
        "08:00-00:00",
        "09:00-20:00"
    ],
    "contact": "(55) 5564 8712",
    "location": {
        "map_url": "http://maps.google.com/maps?daddr=19.414%2C-99.1666",
        "address": "Amsterdam #308, Col. Hipódromo de la Condesa. 06170, Condesa"
    },
    "description": "En Milo's Bistro Bar se disfruta de una deliciosa noche con vistas a avenida Ámsterdam y su ajetreada y bohemia vida.\n\nLa comida mediterránea que ofrecen va de la sopa de cebolla, al mix de ensalada de atún, canelones de berenjena o chuletón de cerdo acompañado de una botella de vino o un coctel.",
    "external_urls": [
        "https://m.facebook.com/Milosbistrot/",
        "https://www.tripadvisor.com.mx/Restaurant_Review-g150800-d2297923-Reviews-Milo_s_Bistro-Mexico_City_Central_Mexico_and_Gulf_Coast.html",
        "https://twitter.com/miloscondesa"
    ],
    "url": "http://cdmxtravel.com/es/lugares/milos-bistrot-bar.html",
    "destination": "Condesa"
}