{
    "name": "Museo del Pulque y las Pulquerías",
    "labels": [
        "Vive la noche",
        "Museos"
    ],
    "price": "Desde $20 MXN",
    "categories": [
        "Pulquería",
        "Museos de arte e historia"
    ],
    "schedule": [
        "11:00-18:00",
        "Cerrado",
        "11:00-18:00",
        "11:00-18:00",
        "11:00-18:00",
        "11:00-18:00",
        "11:00-18:00"
    ],
    "contact": null,
    "location": {
        "map_url": "http://maps.google.com/maps?daddr=19.4377%2C-99.1469",
        "address": "Av. Hidalgo #109, Col. Centro.  06300, Centro Histórico"
    },
    "description": "En el corazón del Centro Histórico de la ciudad se encuentra el Museo del Pulque y las Pulquerías (MUPyP), espacio abierto a todo el público en general, que muestra los secretos de la bebida emblemática de la cultura mexicana y hace homenaje a lo que se conoce como \"pulcata\".\n\nEl museo cuenta con su propia pulquería \"La Pulquería Panana\", donde se puede probar esta bebida prehispánica proveniente de diferentes partes del país como Estado de México, Tlaxcala e Hidalgo, así como variedad de curados. Además cuenta con menú de cocina típica pulquera.\n\nPara más información consultar la página oficial del museo.",
    "external_urls": [
        "https://www.facebook.com/mupyp/",
        "https://www.instagram.com/mupyp.mx/",
        "https://twitter.com/mupyp_mx",
        "https://www.mupyp.mx/es/"
    ],
    "url": "http://cdmxtravel.com/es/lugares/museo-del-pulque-y-las-pulquerias.html",
    "destination": "Centro Histórico"
}