{
    "name": "La 13",
    "labels": [
        "Vive la noche"
    ],
    "price": "Desde $150 MXN",
    "categories": [
        "Centros nocturnos"
    ],
    "schedule": [
        "Cerrado",
        "Cerrado",
        "Cerrado",
        "21:00-00:30",
        "21:00-00:30",
        "21:00-00:30",
        "Cerrado"
    ],
    "contact": "+52 (55) 3462 4076",
    "location": {
        "map_url": "http://maps.google.com/maps?daddr=19.4207%2C-99.1738",
        "address": "Av. Sonora #13, Col. Roma Norte. 06700, Condesa"
    },
    "description": "Un club de baile de tangueros que se reúne exclusivamente para bailar y fomentar la cultura en torno a este género musical. Para asistir hay que confirmar por Facebook y vestir acorde. Se encuentra en un salón del Seguro Social y es dirigido por Pablo Portugués.",
    "external_urls": [
        "https://www.facebook.com/LA13.Milonga",
        "mailto:pablo.portugues@me.com"
    ],
    "url": "http://cdmxtravel.com/es/lugares/la-13.html",
    "destination": "Condesa"
}