{
    "name": "Galería Arte Lourdes Sosa",
    "labels": [
        "Cultura todos los días"
    ],
    "price": "",
    "categories": [
        "Galerías"
    ],
    "schedule": [
        "10:00-16:00",
        "10:00-16:00",
        "10:00-16:00",
        "10:00-16:00",
        "10:00-16:00",
        "Cerrado",
        "Cerrado"
    ],
    "contact": "5280 6857 | 5282 2452",
    "location": {
        "map_url": "http://maps.google.com/maps?daddr=19.4305%2C-99.2017",
        "address": "Ibsen #33 int. A, Col. Polanco. 11560, Polanco-Chapultepec"
    },
    "description": "Lourdes Sosa Galería está presente desde el 2000, como resultado de la dedicación y la integración del arte y la promoción cultural del arte moderno y contemporáneo. Desde principios de siglo las obras de Rufino Tamayo, José Luis Cuevas, Juan Soriano, Manuel Felguérez, Francisco Toledo, entre otros, se han expuesto en este espacio ubicado en el corazón de Polanco. Es una oportunidad para conocer el hoy y el ahora del arte.",
    "external_urls": [
        "https://www.facebook.com/galerialourdessosa/",
        "https://www.instagram.com/ls.galeria/",
        "https://twitter.com/lsgaleria",
        "https://lsgaleria.com/",
        "mailto:info@lsgaleria.com"
    ],
    "url": "http://cdmxtravel.com/es/lugares/galeria-arte-lourdes-sosa.html",
    "destination": "Polanco-Chapultepec"
}