{
    "name": "El Bar Hotel Four Seasons",
    "labels": [
        "Vive la noche"
    ],
    "price": "Desde $300 MXN",
    "categories": [
        "Bar"
    ],
    "schedule": [
        "07:00-00:00",
        "07:00-00:00",
        "07:00-00:00",
        "07:00-00:00",
        "07:00-00:00",
        "Cerrado",
        "07:00-13:00"
    ],
    "contact": "+52 (55) 5230 1818",
    "location": {
        "map_url": "http://maps.google.com/maps?daddr=19.4232%2C-99.1744",
        "address": "Paseo de la Reforma #500, Col. Juárez. 06600, Reforma-Zona Rosa"
    },
    "description": "Ideal para degustar la enorme variedad de cocteles, tequilas y mezcales de la barra. Se encuentra en los pasillos que dan hacia el jardín del Hotel Four Seasons. Cuenta con cómodas sillas y sofás que transportan a una biblioteca inglesa del siglo XIX. Por las mañanas se sirven desayunos americanos tipo bufet, almuerzos ejecutivos y comida mexicana ligera.",
    "external_urls": [
        "https://www.facebook.com/FourSeasonsHotelMexico",
        "https://www.instagram.com/fourseasons/",
        "https://twitter.com/FSMexico",
        "https://www.youtube.com/user/fourseasons",
        "http://www.fourseasons.com/es/mexico/dining/lounges/el_bar/"
    ],
    "url": "http://cdmxtravel.com/es/lugares/el-bar-hotel-four-seasons.html",
    "destination": "Reforma-Zona Rosa"
}