{
    "name": "Leo Fabio Masaryk",
    "labels": [
        "Shopping"
    ],
    "price": "",
    "categories": [
        "Moda"
    ],
    "schedule": [
        "11:00-20:00",
        "11:00-20:00",
        "11:00-20:00",
        "11:00-20:00",
        "11:00-20:00",
        "11:00-18:00",
        "Cerrado"
    ],
    "contact": "+52 (55) 5282 1653",
    "location": {
        "map_url": "http://maps.google.com/maps?daddr=19.4314%2C-99.1932",
        "address": "Av. Presidente Masaryk #433, Col. Polanco. 11560, Polanco-Chapultepec"
    },
    "description": "Los detalles, los cortes y las telas son elegidos para personalizar los trajes de caballero que Leo Fabio hace únicos para sus clientes. Más de 50 años de experiencia garantizan la excelencia y la más alta calidad en sus prendas.",
    "external_urls": [
        "https://www.instagram.com/leofabiosartoria/?hl=es-la",
        "http://www.leofabio.com/",
        "mailto:sfm@leofabio.com"
    ],
    "url": "http://cdmxtravel.com/es/lugares/leo-fabio-masaryk.html",
    "destination": "Polanco-Chapultepec"
}