{
    "name": "Mojito Room Condesa",
    "labels": [
        "Vive la noche"
    ],
    "price": "Desde $300 MXN",
    "categories": [
        "Antro",
        "Bar",
        "Centros nocturnos"
    ],
    "schedule": [
        "Cerrado",
        "Cerrado",
        "Cerrado",
        "20:00-03:30",
        "21:00-03:30",
        "21:00-03:30",
        "Cerrado"
    ],
    "contact": "(55) 3269 5347",
    "location": {
        "map_url": "http://maps.google.com/maps?daddr=19.4125%2C-99.1721",
        "address": "Nuevo León #81, Col. Hipódromo Condesa. 06170, Condesa"
    },
    "description": "Mojito Room rinde un homenaje a la música cubana y otros sonidos latinos. Ahí se escuchan guaguancós, guarachas, salsa y más. Ideal para bailar y disfrutar de espectáculos en vivo.\n\nLos imperdibles son los mojitos, además de tomar clases de salsa y probar la cocina cubana.",
    "external_urls": [
        "https://es-la.facebook.com/pages/Mojito-Room-Condesa/162109457220481",
        "https://www.tripadvisor.com.mx/Attraction_Review-g150800-d6539265-Reviews-Mojito_Room-Mexico_City_Central_Mexico_and_Gulf_Coast.html",
        "mailto:jorge.arizmendi@lacerveceria.com.m"
    ],
    "url": "http://cdmxtravel.com/es/lugares/mojito-room-condesa.html",
    "destination": "Condesa"
}