{
    "name": "Centro de Cultura Digital",
    "labels": [
        "Sé un espectador",
        "Cultura todos los días"
    ],
    "price": "Gratuito",
    "categories": [
        "Filmotecas",
        "Galerías",
        "Centros culturales"
    ],
    "schedule": [
        "Cerrado",
        "11:00-19:00",
        "11:00-19:00",
        "11:00-19:00",
        "11:00-19:00",
        "11:00-19:00",
        "11:00-19:00"
    ],
    "contact": "+52 (55) 1000 2637",
    "location": {
        "map_url": "http://maps.google.com/maps?daddr=19.4231%2C-99.1758",
        "address": "Paseo de la Reforma s/n, Col. Juárez. 06000, Reforma-Zona Rosa"
    },
    "description": "Este centro subterráneo, construido bajo el monumento de la celebración del Bicentenario de la Independencia de México, es uno de los lugares indispensables para imaginar y crear el México actual. Su objetivo es el fomento, creación, investigación y difusión de expresiones digitales; la explanada es sede de espectáculos de artes escénicas y muchos eventos más. También cuenta con la sala Nelly Campobello, donde se realizan proyecciones cinematográficas en 3D.\n\nEl programa del CCD está dirigido principalmente a los jóvenes que se relacionan y se expresan mediante herramientas tecnológicas alrededor de la escena cultural.\n\n\n\n\n\n",
    "external_urls": [
        "https://www.facebook.com/CentroCulturaDigital",
        "https://www.instagram.com/p/B4gIQk7DqjZ/",
        "https://www.tripadvisor.com.mx/ShowUserReviews-g150800-d2618919-r457910998-Trail_of_Light-Mexico_City_Central_Mexico_and_Gulf_Coast.html",
        "https://twitter.com/ccdmx",
        "http://www.centroculturadigital.mx/"
    ],
    "url": "http://cdmxtravel.com/es/lugares/centro-de-cultura-digital.html",
    "destination": "Reforma-Zona Rosa"
}