{
    "name": "Foro A Poco No",
    "labels": [
        "Sé un espectador"
    ],
    "price": "Desde $100 MXN",
    "categories": [
        "Teatros"
    ],
    "schedule": [
        "Cerrado",
        "10:00-22:00",
        "10:00-22:00",
        "10:00-22:00",
        "10:00-22:00",
        "10:00-22:00",
        "10:00-22:00"
    ],
    "contact": "+52 (55) 5130 5740 ext. 2006",
    "location": {
        "map_url": "http://maps.google.com/maps?daddr=19.4372%2C-99.1371",
        "address": "República de Cuba #49, Col. Centro. 06000, Centro Histórico"
    },
    "description": "En este espacio se presentan obras de carácter alternativo, espectáculos de cabaret y propuestas al público que requieren de cercanía con el público para que la esencia de la representación funcione.\n\n\n\nForma parte del programa #YoVoyalteatro\n\nFacebook: yovoyalteatromx\nTwitter: yovoyalteatromx",
    "external_urls": [
        "https://www.facebook.com/foro.apocono",
        "http://www.mexicoescultura.com/recinto/53812",
        "mailto:prensaydifusion.sdt1@gmail.com"
    ],
    "url": "http://cdmxtravel.com/es/lugares/foro-a-poco-no.html",
    "destination": "Centro Histórico"
}