{
    "name": "Meet in Polanco",
    "labels": [
        "Vive la noche",
        "MICE"
    ],
    "price": "",
    "categories": [
        "Pub",
        "Espacios de reunión"
    ],
    "schedule": [
        "10:00-20:00",
        "10:00-20:00",
        "10:00-20:00",
        "10:00-20:00",
        "10:00-20:00",
        "10:00-20:00",
        "10:00-20:00"
    ],
    "contact": "+52 (55) 5531 8390",
    "location": {
        "map_url": "http://maps.google.com/maps?daddr=19.4359%2C-99.1945",
        "address": "Homero #823, Col. Polanco. 11550, Polanco-Chapultepec"
    },
    "description": "Se encuentra en una de las zonas más exclusivas de la ciudad. Sus instalaciones están diseñadas para llevar a cabo distintos eventos, como juntas de negocios, exposiciones empresariales, recepciones, y más. Cuenta con 11 salones, una sala de espera, una terraza y servicios.",
    "external_urls": [
        "https://www.facebook.com/MeetInPolancoOficial",
        "http://www.meetinpolanco.com.mx/",
        "mailto:contacto@meetinpolanco.com.mx"
    ],
    "url": "http://cdmxtravel.com/es/lugares/meet-in-polanco.html",
    "destination": "Polanco-Chapultepec"
}