{
    "name": "Casa Gargollo: una residencia estilo porfiriano que se erige en Reforma",
    "labels": [
        "México monumental",
        "Cultura todos los días",
        "Tiempo libre",
        "Por recinto"
    ],
    "price": "Gratuito",
    "categories": [
        "Monumentos",
        "Casas históricas",
        "Casas de cultura",
        "Diseño mexicano",
        "Con eventos"
    ],
    "schedule": null,
    "contact": null,
    "location": {
        "map_url": "http://maps.google.com/maps?daddr=%2C",
        "address": "Paseo de la Reforma 150, Juárez, 06600 Ciudad de México, CDMX 06600, Reforma-Zona Rosa"
    },
    "description": "Un recinto que además de historia, guarda un legado arquitectónico importante de la época del porfiriato.\n\n\n\nLos inicios de la singular colonia Juárez fueron resultado natural de la cimentación del Paseo de la Reforma durante el Segundo Imperio Mexicano. Durante ese tiempo, un cuantioso grupo de aristócratas construyeron en el sitio una serie de palacetes monumentales que usaban como casa de campo los fines de semana. Así, y debido a la influencia porfiriana surgieron en el lugar cinco colonias llenas de ese tipo de mansiones.\n\nDichos inmuebles no se parecían en nada a los otros que había en la ciudad a principios del siglo XX.  Todos ellos contaban con una serie de características arquitectónicas que los hacían especiales como la entrada, la cual no empezaba en la puerta sino en un jardín frontal que estaba delimitado por una reja. Desafortunadamente varias de las construcciones derivadas de esta corriente fueron desapareciendo debido al crecimiento urbano de nuestra metrópoli.\n\nPero hay una que aún sigue en pie dentro de la ciudad, la Casa Gargollo: una suntuosa casa porfiriana, perfectamente conservada. Fue ergida por José Luis Cuevas en 1903, y fue el mismo arquitecto que años más tarde se encargó de confeccionar la Colonia Condesa. El primer dueño de este predio fue Don José Gargollo, un acaudalado comerciante que además de inspeccionar personalmente cada detalle de la fachada decidió adornarla con materiales importados de Europa.\n\nCabe mencionar que el legado arquitectónico y representativo estilo no son lo único que caracterizan a esta residencia porfiriana. Sino que, por ella ha pasado la historia de México y prueba de ello son algunos objetos que viven en el sitio. Ahí está el piano que se usaba para musicalizar las fiestas de Porfirio Díaz, la mesa de billar que usó Maximiliano como cama, un globo terráqueo de antaño en el que está trazado el territorio original de México y un túnel secreto que sirvió para esconder curas durante la Guerra Cristera.\n\nActualmente, la hermosa mansión es sede del University Club que se instaló ahí en 1930, luego de que don Gargollo quedara en la quiebra. Desde entonces, el palacete ha sido el segundo hogar de un selecto grupo de extranjeros universitarios que han decidido pasar una temporada en nuestro país y necesitan hacerse de espacios para socializar, hablar de filosofía o sólo tomarse un trago en un lugar en el que el tiempo parece detenido.\n\n\n\nFotos de MXCity\n\n",
    "external_urls": null,
    "url": "http://cdmxtravel.com/es/lugares/casa-gargollo-una-residencia-estilo-porfiriano-que-se-erige-en-reforma.html",
    "destination": "Reforma-Zona Rosa"
}