{
    "name": "Or Tiferet",
    "labels": [
        "Tiempo libre"
    ],
    "price": "",
    "categories": [
        "Spas"
    ],
    "schedule": [
        "09:00-20:00",
        "09:00-20:00",
        "09:00-20:00",
        "09:00-20:00",
        "09:00-20:00",
        "09:00-20:00",
        "09:00-20:00"
    ],
    "contact": "(55) 6386 2275",
    "location": {
        "map_url": "http://maps.google.com/maps?daddr=19.4149%2C-99.1556",
        "address": "San Luis Potosí #199 Piso 1, Col. Roma.\r\n 06700, Roma"
    },
    "description": "Centro especializado en la atención de medicina estética, cirugía plástica y obesidad, con experiencia en productos y tecnología de calidad.",
    "external_urls": [
        "https://www.facebook.com/Ortiferet",
        "https://twitter.com/ORTIFERETMEXICO",
        "https://www.youtube.com/channel/UCPVT5nMHYUActYy1MPnzqKQ",
        "http://www.ortiferet.net/QuienesSomos/tabid/36/language/es-ES/Default.aspx",
        "mailto:infomexico@ortiferet.net"
    ],
    "url": "http://cdmxtravel.com/es/lugares/or-tiferet.html",
    "destination": "Roma"
}