{
    "name": "Emotion Casino Hamburgo",
    "labels": [
        "Tiempo libre"
    ],
    "price": "",
    "categories": [
        "Casinos",
        "bingos y salas de juegos"
    ],
    "schedule": [
        "11:00-04:00",
        "11:00-04:00",
        "11:00-04:00",
        "11:00-05:00",
        "11:00-05:00",
        "11:00-05:00",
        "11:00-04:00"
    ],
    "contact": "+52 (55) 4143 1598",
    "location": {
        "map_url": "http://maps.google.com/maps?daddr=19.4257%2C-99.166",
        "address": "Hamburgo #151, Col. Cuauhtémoc. 06600, Reforma-Zona Rosa"
    },
    "description": "Emotion es una empresa enfocada a la creación, fabricación, comercialización y gestión de centros de entretenimiento así como de productos relativos al mundo del juego y apuestas.",
    "external_urls": [
        "https://www.facebook.com/pages/Emotion-Casino-Oficial/214258225258850?sk=info",
        "https://twitter.com/emotion_mx",
        "https://www.youtube.com/user/emotioncasinomx",
        "http://www.emotioncasino.com.mx/"
    ],
    "url": "http://cdmxtravel.com/es/lugares/emotion-casino-hamburgo.html",
    "destination": "Reforma-Zona Rosa"
}