{
    "name": "Romelia",
    "labels": [
        "Vive la noche"
    ],
    "price": "Desde $200 MXN",
    "categories": [
        "Bar",
        "Mezcalería"
    ],
    "schedule": [
        "18:00-12:00",
        "18:00-01:00",
        "18:00-01:00",
        "18:00-02:00",
        "18:00-02:00",
        "18:00-02:00",
        "Cerrado"
    ],
    "contact": "55 5207 6398",
    "location": {
        "map_url": "http://maps.google.com/maps?daddr=19.4198%2C-99.1573",
        "address": "Tabasco #99-B, Col. Roma. 06700, Roma"
    },
    "description": "Un lugar de tapas y vino. Los fines de semana un dj le da vida a la noche y pone a bailar a todos con sonidos electro. Hay cata de mezcales con una módica cuota de recuperación.",
    "external_urls": [
        "https://www.facebook.com/romeliabarrestaurant",
        "https://www.timeoutmexico.mx/ciudad-de-mexico/antros-bares/romelia"
    ],
    "url": "http://cdmxtravel.com/es/lugares/romelia.html",
    "destination": "Roma"
}