{
    "name": "Biblioteca Centro Universitario de Investigaciones Bibliotecológicas",
    "labels": [
        "Cultura todos los días"
    ],
    "price": "",
    "categories": [
        "Bibliotecas"
    ],
    "schedule": [
        "08:00-20:00",
        "08:00-20:00",
        "08:00-20:00",
        "08:00-20:00",
        "08:00-20:00",
        "Cerrado",
        "Cerrado"
    ],
    "contact": "55 5623 0330",
    "location": {
        "map_url": "http://maps.google.com/maps?daddr=19.3329%2C-99.1831",
        "address": "Torre II de Humanidades 11o Piso, Col. Ciudad Universitaria. 04510, Ciudad Universitaria"
    },
    "description": "La biblioteca forma parte del Centro Universitario de Investigaciones Bibliotecológicas que tiene su origen en la Coordinación Académica de la Dirección General de Bibliotecas. Su misión consiste en realizar investigaciones teóricas y aplicadas sobre los fenómenos relacionados con el libro y la información registrada en impresos y otros medios.\n\nLa biblioteca posee diferentes colecciones de libros, revistas, tesis, de INFOBILA, de fondo Latinoamericano entre otras.",
    "external_urls": [
        "https://www.facebook.com/IIBI.UNAM.MX?fref=ts",
        "https://twitter.com/IIBI_UNAM_MX",
        "https://www.youtube.com/user/CUIB100",
        "http://cuib.unam.mx/servicios.html",
        "mailto:biblioteca@iibi.unam.mx"
    ],
    "url": "http://cdmxtravel.com/es/lugares/biblioteca-centro-universitario-de-investigaciones-bibliotecologicas.html",
    "destination": "Ciudad Universitaria"
}