{
    "name": "Iglesia de San Francisco de Asís",
    "labels": [
        "México monumental"
    ],
    "price": "",
    "categories": [
        "Recintos religiosos"
    ],
    "schedule": [
        "07:30-19:00",
        "07:30-19:00",
        "07:30-19:00",
        "07:30-19:00",
        "07:30-19:00",
        "07:30-19:00",
        "07:30-19:00"
    ],
    "contact": "55 5521 7331",
    "location": {
        "map_url": "http://maps.google.com/maps?daddr=19.4335%2C-99.1402",
        "address": "Av. Francisco I. Madero #7, Col. Centro. 06010, Centro Histórico"
    },
    "description": "Fue el primer y más grande templo franciscano en la Ciudad de México que llegó a ocupar más de 32 mil metros cuadrados, pero con el paso del tiempo se fue fragmentando. Se construyó por iniciativa de Hernán Cortés en 1524, pero su fachada actual obedece a una reedificación realizada en 1716. Destacan la fachada estilo churrigueresco y el retablo del altar mayor, obra de Jerónimo Antonio Gil.",
    "external_urls": null,
    "url": "http://cdmxtravel.com/es/lugares/iglesia-de-san-francisco-de-asis.html",
    "destination": "Centro Histórico"
}