{
    "name": "La fabulosa Biblioteca de la Ciudadela",
    "labels": [
        "Cultura todos los días"
    ],
    "price": "Gratuito",
    "categories": [
        "Bibliotecas"
    ],
    "schedule": [
        "08:30-19:30",
        "08:30-19:30",
        "08:30-19:30",
        "08:30-19:30",
        "08:30-19:30",
        "08:30-19:30",
        "08:30-19:30"
    ],
    "contact": "55 4155 0830",
    "location": {
        "map_url": "http://maps.google.com/maps?daddr=%2C",
        "address": "Tolsá 4, Centro.  06040, Alameda"
    },
    "description": "Leer para curar el alma...\n\nUna biblioteca es hogar de ideas e historias, y por lo tanto debiese ser cuidadosamente planeada. La posibilidad de sumergir la mente en cientos de realidades posibles es una experiencia de gran trascendencia. Aquí se busca la suficiente privacidad para adentrarse en los mundos que ofrece su acervo, pero sin olvidar que es un espacio público, compartido. Es decir, en una biblioteca coexisten la intimidad, la imaginación y la colectividad.\n\n¿Y si una biblioteca, además de inyectarte los estímulos necesarios para imaginar o aprender, también te detonara una experiencia artística paralela a la lectura? Precisamente esto sucede en la renovada Biblioteca José Vasconcelos, ubicada dentro de la Ciudadela, en la Ciudad de México.\n\nEl espectacular recinto situado al interior de una antigua fábrica de tabaco fue diseñado por el reconocido arquitecto Abraham Zabludovsky, quien acopló con su particular talante mexicano-modernista este singular edificio.\n\nPosteriormente, hace un par de años el Taller 6A estuvo a cargo de su vistosa remodelación. Las adaptaciones generaron una magnética combinación entre una casona colonial y una estética futurista, consumando así una comunión entre la búsqueda de conocimiento y la experiencia psicovisual.\n\nSi no conoces aún este espacio o no lo has visitado desde que fue remodelado, te aseguramos que disfrutarás reconocer este mágico y discreto rincón.\n\n\n\nImágenes: MXCity.\n\n",
    "external_urls": [
        "https://www.facebook.com/bibliotecademexico.ciudadela/",
        "https://www.instagram.com/explore/locations/889300169/mexico/mexico-city-mexico/biblioteca-de-mexico-la-ciudadela/",
        "https://twitter.com/bibliomexcddela?lang=es",
        "http://www.bibliotecademexico.gob.mx/",
        "mailto:contactomexico@cultura.gob.mx"
    ],
    "url": "http://cdmxtravel.com/es/lugares/la-fabulosa-biblioteca-de-la-ciudadela.html",
    "destination": "Alameda"
}