{
    "name": "Terraza Fortuna",
    "labels": [
        "Vive la noche"
    ],
    "price": "",
    "categories": [
        "Bar",
        "Lounge"
    ],
    "schedule": [
        "13:00-00:00",
        "13:00-00:00",
        "13:00-00:00",
        "13:00-01:00",
        "13:00-01:00",
        "13:00-01:00",
        "13:00-21:00"
    ],
    "contact": null,
    "location": {
        "map_url": "http://maps.google.com/maps?daddr=19.4302%2C-99.1958",
        "address": "Alejandro Dumas #71, Col. Polanco.  11550, Polanco-Chapultepec"
    },
    "description": "Terraza Fortuna es el espacio ideal para degustar una buena comida y deleitar el oído con excelente música. El menú corre a cargo del chef Jorge Mujica, cuenta con variedad de platillos del mar y tierra aunque también hay opción de comida vegetariana. La coctelería de autor es algo imperdible en este lugar.\n\nAdemás cuenta con un speakesy llamado Felicha, bar de concepto gitano y música jazz.",
    "external_urls": [
        "https://www.facebook.com/fortuna.terraza/",
        "https://www.tripadvisor.com.mx/Restaurant_Review-g309226-d12594417-Reviews-La_Terraza_Sports_Bar_Restaurant-La_Fortuna_de_San_Carlos_Arenal_Volcano_Nationa.html",
        "mailto:contacto@terrazafortuna.mx"
    ],
    "url": "http://cdmxtravel.com/es/lugares/terraza-fortuna.html",
    "destination": "Polanco-Chapultepec"
}