{
    "name": "Medusa Buceo",
    "labels": [
        "Diversión y adrenalina"
    ],
    "price": "Desde $2,800 MXN",
    "categories": [
        "Centros de buceo"
    ],
    "schedule": [
        "10:00-18:00",
        "10:00-18:00",
        "10:00-18:00",
        "10:00-18:00",
        "10:00-18:00",
        "10:00-18:00",
        "Cerrado"
    ],
    "contact": "(55) 5665 4057",
    "location": {
        "map_url": "http://maps.google.com/maps?daddr=19.295%2C-99.1783",
        "address": "San Fernando #514 loc. 201, Col. Tlalpan Centro. 14000, Tlalpan"
    },
    "description": "Clases de buceo de diferentes niveles. Hay cursos básicos, introducción a especialidades, buzo avanzado, buceo deportivo que incluye buceo en altitud, con computadora, nitrox con computadora, profundo, a la deriva, ecosistemas marinos, nocturno y visibilidad limitada, búsqueda y recuperación, buceo en la playa y navegación submarina.",
    "external_urls": [
        "http://medusabuceo.blogspot.mx/",
        "https://www.facebook.com/medusabuceo/",
        "https://twitter.com/BuceoMedusa",
        "http://www.buceomedusa.com/",
        "mailto:contacto@buceomedusa.com"
    ],
    "url": "http://cdmxtravel.com/es/lugares/medusa-buceo.html",
    "destination": "Tlalpan"
}