{
    "name": "Pista de Hielo Santa Fe",
    "labels": [
        "Diversión y adrenalina"
    ],
    "price": "",
    "categories": [
        "Pistas de patinaje"
    ],
    "schedule": [
        "11:00-20:00",
        "11:00-20:00",
        "11:00-20:00",
        "11:00-20:00",
        "11:00-20:00",
        "11:00-20:00",
        "11:00-20:00"
    ],
    "contact": "+52 (55) 3003 4343",
    "location": {
        "map_url": "http://maps.google.com/maps?daddr=19.3614%2C-99.2737",
        "address": "Av. Vasco de Quiroga #3800, Col. Antigua Mina La Totolapa. 05109, Santa Fe"
    },
    "description": "Esta pista de hielo se encuentra dentro de la plaza Centro Santa Fe. Cuentan con instructores que ayudarán a los pequeños a patinar con mucha seguridad para que pasen un momento de pura diversión. Los niños pueden entrar a la pista de hielo a partir de los tres años de edad.\n\nEl costo depende del tiempo que se quiera patinar.",
    "external_urls": [
        "https://www.facebook.com/centrosantafe",
        "http://www.centrosantafe.com.mx/index.cfm?pagina=tienda_detalle&submenu_id=21&tienda_id=3153",
        "mailto:administracionpista@centrosantafe.com"
    ],
    "url": "http://cdmxtravel.com/es/lugares/pista-de-hielo-santa-fe.html",
    "destination": "Santa Fe"
}