{
    "name": "Carrillón (Campanario y reloj de la Basílica de Guadalupe)",
    "labels": [
        "México monumental"
    ],
    "price": "Gratuito",
    "categories": [
        "Monumentos"
    ],
    "schedule": [
        "10:00-16:00",
        "10:00-16:00",
        "10:00-16:00",
        "10:00-16:00",
        "10:00-16:00",
        "10:00-16:00",
        "10:00-16:00"
    ],
    "contact": "01(55)5118 0500",
    "location": {
        "map_url": "http://maps.google.com/maps?daddr=19.485%2C-99.1157",
        "address": "Esquina 5 de febrero Mina s/n, Col. Gustavo A. Madero. 07050, Villa de Guadalupe"
    },
    "description": "Una construcción de estructura moderna cuya atractivo principal son las campanadas cada hora.",
    "external_urls": [
        "https://www.facebook.com/INBGuadalupe",
        "https://www.instagram.com/INBGuadalupe/",
        "https://twitter.com/INBGuadalupe",
        "https://www.youtube.com/user/BasilicadeGuadalupe",
        "https://virgendeguadalupe.org.mx/"
    ],
    "url": "http://cdmxtravel.com/es/lugares/carrillon-campanario-y-reloj-de-la-basilica-de-guadalupe.html",
    "destination": "Villa de Guadalupe"
}