{
    "name": "Laboratorio Arte Alameda (Pinacoteca Virreinal, Exconvento de San Diego)",
    "labels": [
        "Museos",
        "México monumental",
        "Cultura todos los días"
    ],
    "price": "Desde $30 MXN",
    "categories": [
        "Arte",
        "Casas históricas",
        "Centros culturales",
        "Pinacotecas"
    ],
    "schedule": [
        "Cerrado",
        "09:00-17:00",
        "09:00-17:00",
        "09:00-17:00",
        "09:00-17:00",
        "10:00-14:00",
        "09:00-17:00"
    ],
    "contact": "8647 5660",
    "location": {
        "map_url": "http://maps.google.com/maps?daddr=19.4364%2C-99.1461",
        "address": "Doctor Mora #7, Col. Centro. 06000, Alameda"
    },
    "description": "El Laboratorio se encuentra en el antiguo Convento de San Diego, una construcción que data de 1591. Es un espacio que exhibe la relación arte-tecnología en las prácticas artísticas contemporáneas. Tiene entre sus objetivos la producción, documentación e investigación del tema. Consta de seis áreas destinadas al arte: el atrio, la nave principal, la capilla de Dolores, el claustro bajo, el coro y una sala anexa construida recientemente. En su interior también se ofrece cine experimental y video, conciertos, talleres para niños y adultos, cursos, conferencias y visitas guiadas.\n\nVideo proporcionado por Instituto Nacional de Bellas Artes (INBA)",
    "external_urls": [
        "https://www.facebook.com/artealameda",
        "https://twitter.com/ArteAlameda",
        "http://www.youtube.com/user/museoLAA?blend=21&ob=5",
        "http://www.artealameda.bellasartes.gob.mx/",
        "mailto:info.artealameda@gmail.com"
    ],
    "url": "http://cdmxtravel.com/es/lugares/laboratorio-arte-alameda-pinacoteca-virreinal-exconvento-de-san-diego.html",
    "destination": "Alameda"
}