{
    "name": "Deportivo Cinco de Mayo",
    "labels": [
        "Diversión y adrenalina"
    ],
    "price": "",
    "categories": [
        "Centros deportivos",
        "Espacios para correr"
    ],
    "schedule": [
        "10:00-16:00",
        "10:00-16:00",
        "10:00-16:00",
        "10:00-16:00",
        "10:00-16:00",
        "Cerrado",
        "Cerrado"
    ],
    "contact": "(55) 4335 8201",
    "location": {
        "map_url": "http://maps.google.com/maps?daddr=19.4542%2C-99.1427",
        "address": "Manuel González #286, Col. Nonoalco Tlatelolco. 06900, Norte"
    },
    "description": "Este centro deportivo se ubica al interior de la unidad habitacional Tlatelolco. Ahí se reúnen los vecinos del lugar con el objetivo de divertirse y ejercitarse a través del deporte amateur. En un ambiente de convivencia sana se imparten talleres de básquetbol, hawaiano, gimnasia, yoga y mucho más.",
    "external_urls": [
        "https://www.facebook.com/pages/Deportivo-Cinco-De-Mayo/1033710883319160",
        "https://alcaldiacuauhtemoc.mx/descubre/cinco-de-mayo/"
    ],
    "url": "http://cdmxtravel.com/es/lugares/deportivo-cinco-de-mayo.html",
    "destination": "Norte"
}