{
    "name": "Decoupage Polanco",
    "labels": [
        "Shopping"
    ],
    "price": "",
    "categories": [
        "Mobiliario",
        "diseño e interiorismo"
    ],
    "schedule": [
        "11:00-20:00",
        "11:00-20:00",
        "11:00-20:00",
        "11:00-20:00",
        "11:00-20:00",
        "11:00-20:00",
        "11:00-20:00"
    ],
    "contact": "(55) 5280 8194",
    "location": {
        "map_url": "http://maps.google.com/maps?daddr=19.4275%2C-99.1971",
        "address": "Julio Verne #9, Col. Polanco. 11550, Polanco-Chapultepec"
    },
    "description": "Crea ambientes con piezas únicas, recuperadas, de diferentes materiales y época, consiguiendo espacios confortables y novedosos. También diseñan muebles a medida según las necesidades de sus clientes. La calidad, la fabricación de todos los procesos y el servicio que prestan son excelentes.",
    "external_urls": [
        "http://decoupageblogmx.com/",
        "https://www.facebook.com/DecoupageMx/timeline",
        "https://www.instagram.com/decoupage_mx/",
        "https://www.pinterest.es/DecoupageMx/",
        "http://www.decoupage.mx/"
    ],
    "url": "http://cdmxtravel.com/es/lugares/decoupage-polanco.html",
    "destination": "Polanco-Chapultepec"
}