{
    "name": "Estatua de George Washington",
    "labels": [
        "México monumental"
    ],
    "price": "",
    "categories": [
        "Monumentos"
    ],
    "schedule": [
        "00:00-23:59",
        "00:00-23:59",
        "00:00-23:59",
        "00:00-23:59",
        "00:00-23:59",
        "00:00-23:59",
        "00:00-23:59"
    ],
    "contact": null,
    "location": {
        "map_url": "http://maps.google.com/maps?daddr=19.4198%2C-99.2015",
        "address": "Kiosko s/n, Col. Bosque de Chapultepec 2a Sección. 11000, Polanco-Chapultepec"
    },
    "description": "La estatua fue un regalo del gobierno estadounidense en 1916 con motivo del centenario de la Independencia de México. Antes se encontraba en el cruce de las calles de Londres y Dinamarca, pero fue trasladada en la década de 1970 a su actual ubicación.",
    "external_urls": null,
    "url": "http://cdmxtravel.com/es/lugares/estatua-de-george-washington.html",
    "destination": "Polanco-Chapultepec"
}