{
    "name": "Casa de la Malinche",
    "labels": [
        "Museos",
        "México monumental",
        "MICE"
    ],
    "price": "Gratuito",
    "categories": [
        "Arte",
        "Monumentos",
        "Casas históricas",
        "Espacios de reunión",
        "Museos de arte e historia"
    ],
    "schedule": [
        "00:01-23:59",
        "00:01-23:59",
        "00:01-23:59",
        "00:01-23:59",
        "00:01-23:59",
        "00:01-23:59",
        "00:01-23:59"
    ],
    "contact": null,
    "location": {
        "map_url": "http://maps.google.com/maps?daddr=19.4369%2C-99.1342",
        "address": "República de Cuba #95, Col. Centro. 06000, Centro Histórico"
    },
    "description": "A un costado de la Plaza de Santo Domingo se encuentra la casa de la Malinche, una mujer indígena que fue bautizada por los españoles como Marina. Su papel en la historia de la Conquista es medular pues fue intérprete y traductora de Hernán Cortés y su séquito durante la Conquista Española. El conquistador, luego de haber engendrado un hijo con ella al que llamó Martín Cortés, la casó con el capitán español Juan Jaramillo, con quien tuvo a su segunda hija. Cuenta la leyenda que la Malinche iba a declarar en el juicio en contra de Hernán Cortés, acusado de corrupción; sin embargo, no pudo llegar al lugar pues fue asesinada a puñaladas antes de presentarse. La casa hoy en día es una escuela primaria llamada Lic. Miguel Serrano.",
    "external_urls": [
        "https://www.tripadvisor.com.mx/Attraction_Review-g150800-d183981-Reviews-Casa_de_la_Malinche-Mexico_City_Central_Mexico_and_Gulf_Coast.html"
    ],
    "url": "http://cdmxtravel.com/es/lugares/casa-de-la-malinche.html",
    "destination": "Centro Histórico"
}