{
    "name": "Garden Santa Fe",
    "labels": [
        "Tiempo libre"
    ],
    "price": "",
    "categories": [
        "Centros comerciales"
    ],
    "schedule": [
        "00:01-23:59",
        "00:01-23:59",
        "00:01-23:59",
        "00:01-23:59",
        "00:01-23:59",
        "00:01-23:59",
        "00:01-23:59"
    ],
    "contact": "+52 55 5292 1731",
    "location": {
        "map_url": "http://maps.google.com/maps?daddr=19.3655%2C-99.2645",
        "address": "Guillermo González Camarena #1205, Col. Santa Fe.  01210, Santa Fe"
    },
    "description": "Garden Santa Fe es mucho más que un centro comercial, es una alternativa para la vida sustentable y sana, por lo que el circuito mantiene árboles, espejos de agua, jardines y paseos. Un espacio ganador de premios de arquitectura con una gran selección de firmas y marcas internacionales.",
    "external_urls": [
        "https://www.facebook.com/GardenSantaFe",
        "https://www.instagram.com/gardensantafe/",
        "https://twitter.com/gardensantafe",
        "http://www.gardensantafe.com.mx/"
    ],
    "url": "http://cdmxtravel.com/es/lugares/garden-santa-fe.html",
    "destination": "Santa Fe"
}