{
    "name": "Jardín del Arte (Sullivan)",
    "labels": [
        "Al aire libre",
        "Puro sabor local",
        "En familia",
        "MICE",
        "Por recinto"
    ],
    "price": "",
    "categories": [
        "Parques",
        "Mercados y bazares",
        "Artesanías",
        "Centros de entretenimiento familiares",
        "Espacios de reunión",
        "Con eventos"
    ],
    "schedule": [
        "Cerrado",
        "Cerrado",
        "Cerrado",
        "Cerrado",
        "Cerrado",
        "Cerrado",
        "10:00-16:00"
    ],
    "contact": null,
    "location": {
        "map_url": "http://maps.google.com/maps?daddr=19.4329%2C-99.1621",
        "address": "James Sullivan s/n, Col. Cuauhtémoc.  06500, Reforma-Zona Rosa"
    },
    "description": "En el Jardín del Arte, en Sullivan, cada domingo exponen algunos de los mejores artistas de la ciudad: pintores, escultores, grabadores, fotógrafos... Un lugar perfecto para comprar arte de hoy directamente del artista. También se ubican aquí los fabricantes de marcos y molduras.\n\nCruzando la calle, un tianguis con puestos de productos frescos y comida: tacos, carnitas, tortas, quesadillas y más.\n\n",
    "external_urls": [
        "https://www.tripadvisor.com.mx/ShowUserReviews-g150800-d152579-r156339364-Garden_of_Art_Jardin_del_Arte-Mexico_City_Central_Mexico_and_Gulf_Coast.html",
        "http://www.jardindelarte.mx/"
    ],
    "url": "http://cdmxtravel.com/es/lugares/jardin-del-arte-sullivan.html",
    "destination": "Reforma-Zona Rosa"
}