{
    "name": "Teatro Hidalgo Ignacio Retes (IMSS)",
    "labels": [
        "Sé un espectador"
    ],
    "price": "",
    "categories": [
        "Teatros"
    ],
    "schedule": [
        "10:00-18:00",
        "10:00-18:00",
        "10:00-18:00",
        "10:00-18:00",
        "10:00-18:00",
        "10:00-18:00",
        "10:00-18:00"
    ],
    "contact": "(55) 5326 5445 ext. 27090",
    "location": {
        "map_url": "http://maps.google.com/maps?daddr=19.4366%2C-99.1416",
        "address": "Av. Hidalgo #23, Col. Guerrero. 06900, Alameda"
    },
    "description": "Teatro del Instituto Mexicano del Seguro Social con 794 localidades. Se llevan a cabo funciones de teatro, música, danza, espectáculos infantiles, festivales, conferencias y asambleas para todo público.",
    "external_urls": null,
    "url": "http://cdmxtravel.com/es/lugares/teatro-hidalgo-ignacio-retes-imss.html",
    "destination": "Alameda"
}