{
    "name": "Teatro López Tarso del Centro Cultural San Ángel",
    "labels": [
        "Cultura todos los días",
        "Sé un espectador"
    ],
    "price": "",
    "categories": [
        "Centros culturales",
        "Teatros"
    ],
    "schedule": [
        "Cerrado",
        "Cerrado",
        "Cerrado",
        "20:00-23:00",
        "20:00-23:00",
        "20:00-23:00",
        "20:00-23:00"
    ],
    "contact": "55 5616 1254",
    "location": {
        "map_url": "http://maps.google.com/maps?daddr=19.3452%2C-99.1903",
        "address": "Av. Revolución #1733, Col. San Ángel. 01000, San Ángel"
    },
    "description": "El edificio fue construido en 1887 para ser el Palacio Municipal. En 1952 fue remodelado para ser la sede de la delegación Álvaro Obregón y fue hasta 1988 que se convirtió en centro cultural. En su interior está el teatro López Tarso, cuya inauguración se llevó a cabo en 1988. Ahí se han presentado obras de gran éxito taquillero como Defendiendo al cavernícola y Éxito a cualquier precio.\n\nForma parte del programa #YoVoyalteatro\n\nFacebook: yovoyalteatromx\nTwitter: yovoyalteatromx",
    "external_urls": [
        "https://www.facebook.com/teatroignaciolopeztarso/?rf=194737183877552",
        "https://twitter.com/teatrolopeztars?lang=es",
        "mailto:ccsatalleres@gmail.com"
    ],
    "url": "http://cdmxtravel.com/es/lugares/teatro-lopez-tarso-del-centro-cultural-san-angel.html",
    "destination": "San Ángel"
}