{
    "name": "Supra Roma",
    "labels": [
        "Vive la noche"
    ],
    "price": "",
    "categories": [
        "Lounge"
    ],
    "schedule": [
        "Cerrado",
        "Cerrado",
        "18:00-02:00",
        "18:00-02:00",
        "15:00-02:00",
        "15:00-02:00",
        "15:00-21:00"
    ],
    "contact": null,
    "location": {
        "map_url": "http://maps.google.com/maps?daddr=19.4181%2C-99.1639",
        "address": "Álvaro Obregón #151, Col. Roma Norte.  06700, Roma"
    },
    "description": "Supra Roma es la excelente opción para desgustar deliciosos platillos de la cocina de México y Medio Oriente. Cuenta con una codiciada terraza, la decoración en colores tierra resaltan en conjunto con los cojines bordados y sillas estilo Acapulco. Ofrece menú exclusivo de la chef Josefina Santacruz, además de la variedad en bebidas y coctelería.\n\nEn este lugar se realizan diferentes eventos holísticos y musicales. Se recomienda reservar antes de llegar al lugar.",
    "external_urls": [
        "https://www.facebook.com/supraromamx/"
    ],
    "url": "http://cdmxtravel.com/es/lugares/supra-roma.html",
    "destination": "Roma"
}