{
    "name": "El callejón del aguacate y su tenebrosa historia",
    "labels": [
        "Al aire libre",
        "En familia"
    ],
    "price": "Gratuito",
    "categories": [
        "Jardines",
        "Centros de entretenimiento familiares"
    ],
    "schedule": [
        "00:01-23:59",
        "00:01-23:59",
        "00:01-23:59",
        "00:01-23:59",
        "00:01-23:59",
        "00:01-23:59",
        "00:01-23:59"
    ],
    "contact": null,
    "location": {
        "map_url": "http://maps.google.com/maps?daddr=19.3485%2C-99.1706",
        "address": "Aguacate S/N\r\nCol. Santa Catarina. 04010, Coyoacán"
    },
    "description": "Una calle estrecha llena de casas coloniales y tétricos mitos urbanos...\n\n\n\nEn el corazón de Coyoacán, en el Barrio de Santa Catarina, se encuentra el famoso Callejón del aguacate. Una calle empedrada que no tiene más de cuatro metros de ancho. Sus inmuebles viejos y de estilo colonial hacen que esta arteria sea a la vez preciosa y aterradora, una combinación mortal que desde hace cien años la han convertido en el refugio de muchas escabrosas leyendas que todavía hoy resuenan  en el tiempo.\n\nDe entre todos los mitos que hay acerca de este misterioso callejón, hay uno que se remonta a los años treinta, cuando llegó a vivir ahí un militar cuya cabeza estaba atrofiada debido a sus terribles experiencias bélicas que había vivido. Para aliviar sus ansiedades del pasado, todos los días este ex soldado salía con su uniforme a tomar el aire y le daba largas vueltas al barrio.\n\nSegún la leyenda, en estas largas caminatas se le aparecía un niño fascinado con las medallas que el soldado portaba en su camisa, y con mucha ingenuidad se le acercaba y le pedía que jugaran. Esta petición enervaba los ánimos del militar, tanto que un mal día decidió terminar violentamente con la vida del pequeño, dejando como testigos de esto a un frondoso árbol de aguacate que está en la mitad de la arteria y a un misterioso monje que, desde las ventanas de su claustro, vio la escena.\n\nTras el incidente, el atormentado hombre se arrepintió de haber cometido su horrible asesinato, y con el objetivo de sanar sus demonios internos, mandó poner en la esquina del callejón el altar de una virgen, para que cada persona que pasara por ahí expiara sus pecados con un Padre Nuestro.\n\nDesde esa época hasta ahora, hay quienes aseguran que cuando uno se acerca al antiquísimo árbol de aguacate, que todavía yace en el centro del callejón, se pueden escuchar los gemidos del niño. Incluso hay personas que afirman haber sentido la presencia del infante y hasta han visto su rostro incrustado en la corteza del árbol.\n\nSe crea o no se crea en fantasmas, vale la pena visitar el emblemático Callejón del Aguacate en Coyoacán, un lugar que huele a pasado y en el que el tiempo parece haberse detenido.\n\n",
    "external_urls": [
        "https://www.tripadvisor.com.mx/Attraction_Review-g150800-d10493617-Reviews-Callejon_del_Aguacate-Mexico_City_Central_Mexico_and_Gulf_Coast.html"
    ],
    "url": "http://cdmxtravel.com/es/lugares/el-callejon-del-aguacate-y-su-tenebrosa-historia.html",
    "destination": "Coyoacán"
}