{
    "name": "Templo de la Concepción de Jesús de Nazareno",
    "labels": [
        "México monumental"
    ],
    "price": "",
    "categories": [
        "Recintos religiosos"
    ],
    "schedule": [
        "08:00-20:00",
        "08:00-20:00",
        "08:00-20:00",
        "08:00-20:00",
        "08:00-20:00",
        "08:00-20:00",
        "08:00-20:00"
    ],
    "contact": null,
    "location": {
        "map_url": "http://maps.google.com/maps?daddr=19.4289%2C-99.1328",
        "address": "Pino Suárez #35, Col. Centro. 06010, Centro Histórico"
    },
    "description": "El templo formó parte del Hospital de Nazareno fundado en 1524 por Hernán Cortés. Tiene una fachada barroca y neoclásica. El hospital aún existe pero ahora se llama Hospital de Jesús y justo en la esquina con República del Salvador se encuentra la iglesia. Está construida con material de tezontle y cantera. Su diseño corrió a cargo de Claudio de Arciniega, pero su muerte anticipada provocó que la obra fuera acabada por Alonso Perea de Castañeda.\n\nEn el siglo XVIII los restos del conquistador Hernán Cortés fueron trasladados a ese templo. Manuel Tolsá le construyó un mausoleo y un busto; sin embargo, en los agitados años de la Independencia, bajo la amenaza de profanar sus restos, estos fueron retirados y devueltos hasta 1836. En el sitio se colocó una placa conmemorativa.",
    "external_urls": null,
    "url": "http://cdmxtravel.com/es/lugares/templo-de-la-concepcion-de-jesus-de-nazareno.html",
    "destination": "Centro Histórico"
}