{
    "name": "Centro Cultural del México Contemporáneo",
    "labels": [
        "Cultura todos los días",
        "En familia",
        "MICE"
    ],
    "price": "",
    "categories": [
        "Centros culturales",
        "Centros de entretenimiento familiares",
        "Espacios de reunión"
    ],
    "schedule": [
        "10:00-18:00",
        "10:00-18:00",
        "10:00-18:00",
        "10:00-18:00",
        "10:00-18:00",
        "10:00-18:00",
        "10:00-18:00"
    ],
    "contact": "(55) 5529 1567",
    "location": {
        "map_url": "http://maps.google.com/maps?daddr=19.4389%2C-99.1339",
        "address": "Leandro Valle #20, Col. Centro Histórico. 06010, Centro Histórico"
    },
    "description": "El Centro Cultural del México Contemporáneo es una institución que se ha dedicado, por más de 14 años, a la formación de músicos integrales, otorgando las herramientas necesarias para abrirse camino en el mundo de la música nacional e internacional. \nSe imparten talleres y diplomados, así como muchas actividades para enriquecer el acervo cultural de la comunidad.\n\nMás información en Fideicomiso del Centro Histórico.",
    "external_urls": [
        "https://www.facebook.com/fundacionccmc",
        "https://www.instagram.com/fundacionccmc/",
        "https://www.tripadvisor.com.mx/Attraction_Review-g150800-d14005193-Reviews-Centro_Cultural_del_Mexico_Contemporaneo-Mexico_City_Central_Mexico_and_Gulf_Coa.html",
        "https://twitter.com/Fundacionccmc",
        "http://www.ccmc.org.mx/",
        "mailto:mexico_contemporaneo@live.com.mx"
    ],
    "url": "http://cdmxtravel.com/es/lugares/centro-cultural-del-mexico-contemporaneo.html",
    "destination": "Centro Histórico"
}