{
    "name": "Templo de Corpus Christi",
    "labels": [
        "México monumental"
    ],
    "price": "",
    "categories": [
        "Recintos religiosos"
    ],
    "schedule": [
        "09:00-14:30",
        "09:00-14:30",
        "09:00-14:30",
        "09:00-14:30",
        "09:00-14:30",
        "09:00-14:30",
        "09:00-14:30"
    ],
    "contact": null,
    "location": {
        "map_url": "http://maps.google.com/maps?daddr=19.4344%2C-99.1441",
        "address": "Av. Juárez s/n, Col. Centro. 06000, Alameda"
    },
    "description": "El Templo de Corpus Christi perteneció a un convento que fue concebido para albergar a las hijas de caciques indígenas en la colonia. De estilo barroco, se comenzó a construir en 1720 y estuvo a cargo del arquitecto Pedro Arrieta. Es de destacar la custodia de cantera que simboliza a Corpus Christi. El espíritu del convento y templo que perteneció a la orden de Santa Clara fue la austeridad.\n\nEl lugar hoy en día conserva un rico acervo de 27 mil documentos históricos que datan del siglo XVI hasta el XX. Hay archivos personales de Benito Juárez, el testamento de la poeta Sor Juana Inés de la Cruz y un poder de Miguel Hidalgo y Costilla cuando fue rector de la Universidad de Valladolid.\n\nMás información en Fideicomiso del Centro Histórico.",
    "external_urls": null,
    "url": "http://cdmxtravel.com/es/lugares/templo-de-corpus-christi.html",
    "destination": "Alameda"
}