{
    "name": "Huertos Concretos",
    "labels": [
        "Al aire libre"
    ],
    "price": "",
    "categories": [
        "Jardines",
        "Huertos"
    ],
    "schedule": null,
    "contact": "55 4185 8203",
    "location": {
        "map_url": "http://maps.google.com/maps?daddr=19.4173%2C-99.1604",
        "address": "Chihuahua 139, Roma Norte. Delegación Cuauhtémoc 06700, Roma"
    },
    "description": "Huertos Concretos es un despacho de diseño de sistemas alimentarios, dedicado a optimizar espacios reducidos a través de la generación de huertos.\n\nSus talleres se basan en el principio de que todo el mundo es capaz de aprender, iniciar y sostener un huerto, por lo que son enfocados a distintos públicos: niños, adultos, equipos restauranteros, productores, comunidades de vecinos, etcétera, sin importar la experiencia previa.\n\nTalleres:\n\nPláticas Nocturnas: Combinamos una plática sobre agronomía, antropología y cocina con una pequeña degustación. - Primer jueves de cada mes.Fin Intensivo: Un día para iniciarte y un día para volverte experto. Puedes inscribirte para un día o para el fin completo. - 14 y 15 de junio (tentativamente).Del Huerto a la Mesa: Aprende a iniciar tu huerto y a cocinar de manera divertida lo que cosechas. - 17 de junio (tentativamente).",
    "external_urls": [
        "https://es-la.facebook.com/huertosconcretos/",
        "https://www.instagram.com/huertosconcretos/",
        "https://twitter.com/search?q=%40HConcretos&src=typd&lang=es",
        "https://www.youtube.com/channel/UCXwiiQ9-GP7vM8cXijmazDA",
        "http://www.huertosconcretos.com/",
        "mailto:lilyfoster@huertosconcretos.com"
    ],
    "url": "http://cdmxtravel.com/es/lugares/huertos-concretos.html",
    "destination": "Roma"
}