{
    "name": "Centro Cultural del Bosque",
    "labels": [
        "Cultura todos los días",
        "Sé un espectador",
        "Por recinto"
    ],
    "price": "",
    "categories": [
        "Centros culturales",
        "Centros de espectáculos y salas de conciertos",
        "Teatros",
        "Con eventos"
    ],
    "schedule": [
        "17:00-19:00",
        "17:00-19:00",
        "17:00-19:00",
        "17:00-19:00",
        "17:00-19:00",
        "17:00-18:00",
        "16:00-17:00"
    ],
    "contact": "+52 (55) 1000 5600 ext. 4408",
    "location": {
        "map_url": "http://maps.google.com/maps?daddr=19.4234%2C-99.195",
        "address": "Paseo de la Reforma s/n, Col. Chapultepec. 11560, Polanco-Chapultepec"
    },
    "description": "El Centro Cultural del Bosque (CCB) depende del Instituto Nacional de Bellas Artes. Es uno de los complejos culturales dedicados a las artes escénicas más importantes de México. En sus áreas hay seis teatros, una sala, una plaza y una librería. De igual forma cuenta con salones de ensayo y de usos múltiples para otro tipo de eventos, como la danza.\n\nCon más de cinco décadas de tradición en la enseñanza y disfrute de la cultura, el CCB se ha convertido en un espacio para la exhibición, promoción y desarrollo de las artes escénicas. Actualmente el CCB también aloja a la Compañía Nacional de Danza, la Escuela de Danza Folklórica, la Orquesta de Cámara de Bellas Artes y las oficinas de la Dirección General del INBA.\n\nDestaca la Plaza Ángel Salas que es un foro al aire libre con gradería para 200 personas para teatro, danza escolar, ciclos de cine, la feria del libro teatral y otros montajes. La sala Xavier Villaurrutia es un recinto donde se llevan a cabo obras de teatro, música, danza, espectáculos infantiles, festivales, cine y video así como conferencias.\n\nConsulta la cartelera de eventos.\n\nForma parte del programa #YoVoyalteatro\n\nFacebook: yovoyalteatromx\nTwitter: yovoyalteatromx",
    "external_urls": [
        "https://www.facebook.com/pages/Centro-Cultural-del-Bosque-INBA/113500562082580",
        "https://twitter.com/CCB_INBA",
        "https://www.youtube.com/user/ccbinba",
        "http://www.ccb.bellasartes.gob.mx/",
        "mailto:ccb@inba.gob.mx"
    ],
    "url": "http://cdmxtravel.com/es/lugares/centro-cultural-del-bosque.html",
    "destination": "Polanco-Chapultepec"
}