{
    "name": "La Casa de las Sirenas",
    "labels": [
        "Vive la noche"
    ],
    "price": "Desde $350 MXN",
    "categories": [
        "Bar"
    ],
    "schedule": [
        "11:00-23:00",
        "11:00-23:00",
        "11:00-23:00",
        "11:00-23:00",
        "11:00-23:00",
        "11:00-23:00",
        "11:00-19:00"
    ],
    "contact": "+52 (55) 5704 3345",
    "location": {
        "map_url": "http://maps.google.com/maps?daddr=19.435%2C-99.1323",
        "address": "República de Guatemala #32 Col. Centro. 06000, Centro Histórico"
    },
    "description": "La Casa de las Sirenas es un restaurante desde 1994 en pleno corazón del Centro Histórico de la ciudad. La construcción data del siglo XVI y está hecho a base de las piedras de las pirámides que existieron en los alrededores.\n\nOfrece deliciosos platillos mexicanos como Setas al chipotle o Ensalada Ecológica. Hay una extensa barra de tragos para consentir a sus visitantes, incluso con un Salón Tequila donde la degustación es un deleite. Su terraza es el lugar ideal para contemplar las tardes naranjas del Templo Mayor y el Palacio Nacional.",
    "external_urls": [
        "https://www.facebook.com/casalassirenas/",
        "https://www.tripadvisor.com.mx/Restaurant_Review-g150800-d1308960-Reviews-La_Casa_de_las_Sirenas-Mexico_City_Central_Mexico_and_Gulf_Coast.html",
        "https://twitter.com/casalassirenas/",
        "http://lacasadelassirenas.com.mx/",
        "mailto:lacasadelassirenas@prodigy.net.mx"
    ],
    "url": "http://cdmxtravel.com/es/lugares/la-casa-de-las-sirenas.html",
    "destination": "Centro Histórico"
}