{
    "name": "\"Las riquezas nacionales\" de José Clemente Orozco",
    "labels": [
        "México monumental"
    ],
    "price": "Gratuito",
    "categories": [
        "Murales"
    ],
    "schedule": [
        "09:00-17:00",
        "09:00-17:00",
        "09:00-17:00",
        "09:00-17:00",
        "09:00-16:00",
        "Cerrado",
        "Cerrado"
    ],
    "contact": "+52 (55) 4113 1100 ext. 5810",
    "location": {
        "map_url": "http://maps.google.com/maps?daddr=19.4313%2C-99.1319",
        "address": "José María Pino Suárez #2, Col. Centro. 06065, Centro Histórico"
    },
    "description": "Orozco quiso mostrar a través de este mural el lado nacionalista de los mexicanos, con los productos de la tierra bajo protección de la bandera mexicana y del jaguar, símbolos nacionales.\n\nEste mural se encuentra en el segundo piso de la Suprema Corte de Justicia de la Nación. En ese mismo lugar se localizan otras obras del mismo autor: La justicia, dividido entre los muros norte y sur, así como La lucha de los trabajadores.",
    "external_urls": [
        "https://www.facebook.com/SCJNMexico/",
        "https://twitter.com/scjn",
        "https://www.youtube.com/scjn",
        "https://www.scjn.gob.mx/Paginas/Inicio.aspx",
        "mailto:visitas@mail.scjn.gob.mx"
    ],
    "url": "http://cdmxtravel.com/es/lugares/las-riquezas-nacionales-de-jose-clemente-orozco.html",
    "destination": "Centro Histórico"
}