{
    "name": "Tinta Naranja Urban Gallery",
    "labels": [
        "Cultura todos los días"
    ],
    "price": "Gratuito",
    "categories": [
        "Galerías"
    ],
    "schedule": [
        "11:00-19:30",
        "11:00-19:30",
        "11:00-19:30",
        "11:00-19:30",
        "11:00-19:30",
        "11:00-19:30",
        "11:00-16:00"
    ],
    "contact": "+52 (55) 5564 3177",
    "location": {
        "map_url": "http://maps.google.com/maps?daddr=19.4114%2C-99.1679",
        "address": "Av. Amsterdam 254, Hipódromo Condesa 06100, Condesa"
    },
    "description": "Esta galería de arte urbano se ubica en el corazón de la colonia Condesa. Tiene como meta ser una plataforma permanente para artistas de manera que se promueva y comercialice su talento, así como acercar a la gente al arte.",
    "external_urls": [
        "https://www.facebook.com/latintanaranja/",
        "https://www.instagram.com/tintanaranja/?hl=es-la",
        "https://tintanaranja.com/",
        "mailto:mark@tintanaranja.com"
    ],
    "url": "http://cdmxtravel.com/es/lugares/tinta-naranja-urban-gallery.html",
    "destination": "Condesa"
}