{
    "name": "Deportivo Guelatao",
    "labels": [
        "En familia",
        "Sé un espectador",
        "Diversión y adrenalina"
    ],
    "price": "",
    "categories": [
        "Centros de entretenimiento familiares",
        "Estadios y arenas",
        "Centros de buceo",
        "Centros deportivos",
        "Espacios para correr"
    ],
    "schedule": [
        "Cerrado",
        "07:00-20:00",
        "07:00-20:00",
        "07:00-20:00",
        "07:00-20:00",
        "07:00-20:00",
        "07:00-20:00"
    ],
    "contact": "+52 (55) 4335 8091",
    "location": {
        "map_url": "http://maps.google.com/maps?daddr=19.4414%2C-99.1358",
        "address": "Honduras s/n, Col. Centro. 06000, Norte"
    },
    "description": "El Centro Guelatao tiene clases y talleres para niños, jóvenes y adultos. Hay actividades a elegir entre yoga, clavados, natación, físicoculturismo, box, gimnasia artística, entre otros. Se localiza a unos minutos del Metro Garibaldi.\n\nRecientemente fue renovado y reinaugurado. El Deportivo Guelatao, a través de un esfuerzo conjunto y la inversión de casi 17 millones de pesos entre la Delegación Cuauhtémoc y la Comisión Nacional de Cultura Física y Deporte (Conade).",
    "external_urls": [
        "https://www.facebook.com/pages/category/Gym-Physical-Fitness-Center/Deportivo-Guelatao-136439429766657/"
    ],
    "url": "http://cdmxtravel.com/es/lugares/deportivo-guelatao.html",
    "destination": "Norte"
}