{
    "name": "Instituto Mexicano de Cinematografía",
    "labels": [
        "Cultura todos los días"
    ],
    "price": "",
    "categories": [
        "Centros culturales"
    ],
    "schedule": [
        "09:00-18:00",
        "09:00-18:00",
        "09:00-18:00",
        "09:00-18:00",
        "09:00-16:00",
        "Cerrado",
        "Cerrado"
    ],
    "contact": "+52 (55) 5448 5300",
    "location": {
        "map_url": "http://maps.google.com/maps?daddr=19.3952%2C-99.1716",
        "address": "Atletas No. 2 edificio «Luis Buñuel»\r\ncolonia Country Club 04210, Coyoacán"
    },
    "description": "Creado en 1983 para apoyar, consolidar y acrecentar las producciones cinematográficas fuera y dentro de México. Con el fin de garantizar la continuidad artística y cultural del cine mexicano, se promueven festivales, muestras, ciclos y foros para todos los públicos.",
    "external_urls": [
        "https://www.facebook.com/IMCINE",
        "https://instagram.com/imcine",
        "https://www.youtube.com/user/IMCINEChannel",
        "http://www.imcine.gob.mx/",
        "mailto:informes@imcine.gob.mx"
    ],
    "url": "http://cdmxtravel.com/es/lugares/instituto-mexicano-de-cinematografia.html",
    "destination": "Coyoacán"
}