{
    "name": "Salvatore Ferragamo Masaryk",
    "labels": [
        "Shopping"
    ],
    "price": "",
    "categories": [
        "Moda",
        "Accesorios"
    ],
    "schedule": [
        "11:00-20:00",
        "11:00-20:00",
        "11:00-20:00",
        "11:00-20:00",
        "11:00-20:00",
        "12:00-18:00",
        "12:00-18:00"
    ],
    "contact": "+52 (55) 5281 4333",
    "location": {
        "map_url": "http://maps.google.com/maps?daddr=19.4317%2C-99.1997",
        "address": "Av. Presidente Masaryk #426, Col. Polanco. 11560, Polanco-Chapultepec"
    },
    "description": "Especialista en la elaboración del calzado para dama, caballero y niños. Destacan sus materiales de alta calidad y su elaboración realizada por especialistas italianos. En sus tiendas también puedes encontrar diferentes complementos, bolsos, cinturones, marroquinería y fragancias.",
    "external_urls": [
        "https://www.facebook.com/SalvatoreFerragamo",
        "https://instagram.com/ferragamo/",
        "https://www.pinterest.com/ferragamo/",
        "https://twitter.com/Ferragamo",
        "https://www.youtube.com/user/FerragamoOfficial",
        "http://www.ferragamo.com/shop/es/esp"
    ],
    "url": "http://cdmxtravel.com/es/lugares/salvatore-ferragamo-masaryk.html",
    "destination": "Polanco-Chapultepec"
}