{
    "name": "Mauro Ristorante & Bar",
    "labels": [
        "Vive la noche"
    ],
    "price": "Desde $300 MXN",
    "categories": [
        "Bar"
    ],
    "schedule": [
        "13:00-23:00",
        "13:00-23:00",
        "13:00-23:00",
        "13:00-23:00",
        "13:00-23:00",
        "13:00-23:00",
        "01:00-19:00"
    ],
    "contact": "55450033",
    "location": {
        "map_url": "http://maps.google.com/maps?daddr=19.4324%2C-99.1835",
        "address": "Torcuato Tasso #315, Col. Polanco. 11550, Polanco-Chapultepec"
    },
    "description": "Un ristorante italiano en Polanco, que presenta una forma especial de disfrutar la cocina del país del buon magiare. En un ambiente único, íntimo y sofisticado, MAURO es más un punto de reunión, donde podrás tener una increíble cena entre amigos, una exitosa comida de negocios, o empezar deliciosamente la noche con tu pareja.\n\nTe garantizamos que pasarás un momento inigualable, a la hora de la comida con nuestro menú diario de la especialidad del Chef y la cocina casera italiana. Y si vienes a cenar, solo a acompañado, deberás probar las más deliciosas pastas hechas en casa, o las pizzas en nuestro horno de piedra a la leña, cualquiera de ellas de gran tamaño, después de las 18:00 Hrs. Sólo te costarán $100.00, pero deberás comerlas en la mesa que más te guste ya que no aplica en alimentos para llevar.\n\nHay algo más en MAURO, los sábados y domingos a partir de las 13:00 Hrs. los niños, tus hijos, sobrinos, nietos, cualquier niño que venga acompañado de un mayor, podrá cocinar su propia pizza como guste, con los ingredientes que desee, siempre guiados por nuestro experto en pizzas...",
    "external_urls": [
        "https://www.facebook.com/mauroristorante/timeline",
        "https://twitter.com/mauroristorante",
        "http://www.mauro.com.mx/",
        "mailto:claudia@mauro.com.mx"
    ],
    "url": "http://cdmxtravel.com/es/lugares/mauro-ristorante-bar.html",
    "destination": "Polanco-Chapultepec"
}