{
    "name": "Mama Rumba Masaryk",
    "labels": [
        "Vive la noche"
    ],
    "price": "Desde $300 MXN",
    "categories": [
        "Bar"
    ],
    "schedule": [
        "Cerrado",
        "Cerrado",
        "21:00-03:00",
        "21:00-03:00",
        "21:00-03:00",
        "21:00-03:00",
        "Cerrado"
    ],
    "contact": "+52 (55) 5281 6575",
    "location": {
        "map_url": "http://maps.google.com/maps?daddr=19.432%2C-99.1982",
        "address": "Presidente Masaryk #393, Col. Polanco Chapultepec. 11550, Polanco-Chapultepec"
    },
    "description": "Un pedacito de Cuba en México para bailar, convivir y pasarla bien con los amigos o pareja. Ofrece promociones, clases de baile y por supuesto música en vivo. Mama Rumba es para revivir el sabor de La Habana. Casi obligatorio probar los mojitos.",
    "external_urls": [
        "https://www.facebook.com/mamarumba.rl",
        "https://twitter.com/MamaRumbaDF",
        "http://www.mamarumba.com.mx/"
    ],
    "url": "http://cdmxtravel.com/es/lugares/mama-rumba-masaryk.html",
    "destination": "Polanco-Chapultepec"
}