{
    "name": "Sala Nezahualcóyotl",
    "labels": [
        "Sé un espectador",
        "Por recinto"
    ],
    "price": "",
    "categories": [
        "Centros de espectáculos y salas de conciertos",
        "Teatros",
        "Con eventos"
    ],
    "schedule": [
        "Cerrado",
        "10:00-14:00",
        "16:30-20:30",
        "16:30-20:30",
        "16:30-20:30",
        "16:30-20:30",
        "10:00-13:30"
    ],
    "contact": "+52 (55) 5622 7125",
    "location": {
        "map_url": "http://maps.google.com/maps?daddr=19.3144%2C-99.1844",
        "address": "Insurgentes Sur #3000, Col. Ciudad Universitaria. 04510, Ciudad Universitaria"
    },
    "description": "La sala Nezahualcóyotl fue un proyecto impulsado por Eduardo Mata, con diseño del arquitecto Arcadio Artis y de Christopher Jaffe. Esta sala monumental de conciertos está diseñada específicamente para funciones de música sinfónica. Una cámara de resonancia bajo el escenario y superficies de acrílico a lo alto logran la mejor acústica. El público rodea el escenario del edificio poligonal y la música se escucha con la misma claridad desde cualquier butaca. El Centro Cultural Universitario es sede de la Orquesta Filarmónica de la UNAM. Tiene capacidad para dos mil 177 espectadores y figura entre las mejores salas de conciertos de Latinoamérica.\n\n\n\n",
    "external_urls": [
        "https://www.tripadvisor.com.mx/Attraction_Review-g150800-d6940216-Reviews-Sala_Nezahualcoyotl-Mexico_City_Central_Mexico_and_Gulf_Coast.html",
        "http://www.musica.unam.mx/index.php?option=com_content&view=article&id=8:sala-nezahualcoyotl&catid=8:salas&Itemid=170"
    ],
    "url": "http://cdmxtravel.com/es/lugares/sala-nezahualcoyotl.html",
    "destination": "Ciudad Universitaria"
}