{
    "name": "Museo de Arte Popular (MAP)",
    "labels": [
        "Museos",
        "Puro sabor local",
        "Por recinto"
    ],
    "price": "Desde $60 MXN",
    "categories": [
        "Arte",
        "Artesanías",
        "Con eventos",
        "Museos de arte e historia"
    ],
    "schedule": [
        "Cerrado",
        "10:00-18:00",
        "10:00-21:00",
        "10:00-18:00",
        "10:00-18:00",
        "10:00-18:00",
        "10:00-18:00"
    ],
    "contact": "+52 (55) 55102201",
    "location": {
        "map_url": "http://maps.google.com/maps?daddr=19.434%2C-99.1463",
        "address": "Revillagigedo #11, Col. Centro. 06050, Alameda"
    },
    "description": "Desde su apertura al público, en marzo de 2006, el MAP se ha propuesto ser un referente indiscutible del arte popular mexicano y dignificarlo en los ojos de los mexicanos y de los turistas extranjeros. Impulsándolo a través de sus exposiciones permanentes, temporales e itinerantes; así como talleres para niños, artesanos y público en general; concursos, seminarios y actividades extra muros.\n\nEste fascinante museo es un escaparate de las raíces, tradiciones y habilidades artísticas de los pueblos y las culturas mexicanas. Desde su apertura al público, en marzo de 2006 exhibe la enorme riqueza cultural que es una fusión entre la cosmovisión indígena y la española. Además de la estrecha relación entre los artesanos, cuya obra está inspirada en la exuberante biodiversidad de México.\n\nEl museo cuenta con más de 3 mil obras donadas, divididas en las salas permanentes: Alfarería, Alfeñique, Fibras vegetales, Cerería, Juguetes, Maque o Laca, Lapidaría, Madera, Máscaras, Metalistería, Miniaturas, Orfebrería, Papel y Cartón, Pintura popular, Talabartería, Textiles, Vidrio y Metales efímeros. Las exposiciones temporales dan voz a los artesanos del país. El museo ofrece actividades alternas como talleres de alebrijes, funciones de títeres, proyecciones, cuentacuentos, entre otras. Los talleres para niños tienen una duración de dos horas, los fines de semana.\n\nEl Museo de Artes Populares está ubicado en un interesante edificio art déco. El Museo tiene una fantástica tienda, con varias delegaciones en la ciudad, donde comprar auténticas artesanías mexicanas de primerísima calidad.",
    "external_urls": [
        "https://www.facebook.com/MuseoArtePopular",
        "https://www.instagram.com/map_mexico/",
        "https://es.pinterest.com/map_mexico/",
        "https://www.tripadvisor.com.mx/Attraction_Review-g150800-d1150578-Reviews-Museo_de_Arte_Popular-Mexico_City_Central_Mexico_and_Gulf_Coast.html",
        "https://twitter.com/map_mexico",
        "https://www.youtube.com/user/museodeartepopular",
        "http://www.map.cdmx.gob.mx/",
        "mailto:infomap@cdmx.gob.mx"
    ],
    "url": "http://cdmxtravel.com/es/lugares/museo-de-arte-popular-map.html",
    "destination": "Alameda"
}