{
    "name": "Palacio de Autonomía UNAM",
    "labels": [
        "Museos"
    ],
    "price": "Desde $50 MXN",
    "categories": [
        "Ciencia e historia"
    ],
    "schedule": [
        "Cerrado",
        "10:00-18:00",
        "10:00-18:00",
        "10:00-18:00",
        "10:00-18:00",
        "10:00-18:00",
        "10:00-18:00"
    ],
    "contact": "+52 (55) 5491 1112",
    "location": {
        "map_url": "http://maps.google.com/maps?daddr=19.4344%2C-99.1307",
        "address": "Lic. Primo de Verdad #2, Col. Centro. 06010, Centro Histórico"
    },
    "description": "En los siglos XVI y XVII fue el convento de Santa Teresa la Antigua, donde residía la orden de las Carmelitas Descalzas de San José; después fue vendido en 1859 y utilizado como vecindad, bodega y cuartel militar. El Palacio de la Autonomía fue la primera sede de la Rectoría de la Universidad Nacional, de hecho fue el lugar donde se llevó a cabo el movimiento estudiantil que le dio autonomía en 1929. Actualmente es museo, hay una Sala de la Odontología Mexicana, es la Fonoteca de Radio UNAM y sede externa del Centro de Enseñanza de Lenguas Extranjeras.\n\nTambién se presentan diversos eventos y exposiciones de índole internacional, por lo que el acceso puede variar en referencia a la actividad que se presente.",
    "external_urls": [
        "https://es-es.facebook.com/fundacion.unam.mx",
        "https://twitter.com/fundacion_unam",
        "https://www.youtube.com/user/FUNDUNAM?feature=watch",
        "http://www.fundacionunam.org.mx/palacio-de-autonomia/",
        "mailto:direccionautonomia@hotmail.com"
    ],
    "url": "http://cdmxtravel.com/es/lugares/palacio-de-autonomia-unam.html",
    "destination": "Centro Histórico"
}