{
    "name": "Centro de Creación Literaria Xavier Villaurrutia",
    "labels": [
        "Cultura todos los días"
    ],
    "price": "",
    "categories": [
        "Bibliotecas",
        "Centros culturales"
    ],
    "schedule": [
        "Cerrado",
        "11:00-21:00",
        "18:00-20:00",
        "11:00-21:00",
        "11:00-21:00",
        "09:00-15:30",
        "Cerrado"
    ],
    "contact": "+52 (55) 8647 5280",
    "location": {
        "map_url": "http://maps.google.com/maps?daddr=19.412%2C-99.1724",
        "address": "Nuevo León #91, Col. Hipódromo Condesa. 06140, Condesa"
    },
    "description": "Abrió sus puertas en 2010 con la finalidad de formar a creadores literarios a través de diplomados, seminarios, cursos y talleres donde se imparten los géneros literarios de poesía, narrativa y dramaturgia, así como cátedras y encuentros con escritores con una carrera consolidada. Estos cursos son de educación no formal aunque se da un certificado por parte del Instituto Nacional de Bellas Artes y sirve para proporcionarle a los alumnos herramientas teórico-conceptuales y estrategias para escribir. Hay ciclos como las Guías literarias y La hora del cuento; además cuenta con cinco salas de lectura aisladas del ruido y una biblioteca con un acervo de más de 3 mil 500 libros. Se recomienda consultar su página para conocer las actividades y precios.",
    "external_urls": [
        "https://www.facebook.com/CCLXV/",
        "https://twitter.com/CCLXV",
        "mailto:cclxv@inba.gob.mx"
    ],
    "url": "http://cdmxtravel.com/es/lugares/centro-de-creacion-literaria-xavier-villaurrutia.html",
    "destination": "Condesa"
}