{
    "name": "Casa de la Primera Imprenta de América",
    "labels": [
        "Museos",
        "Cultura todos los días"
    ],
    "price": "Gratuito",
    "categories": [
        "Ciencia e historia",
        "Centros culturales"
    ],
    "schedule": [
        "10:00-18:00",
        "10:00-18:00",
        "10:00-18:00",
        "10:00-18:00",
        "10:00-18:00",
        "11:00-14:00",
        "Cerrado"
    ],
    "contact": "+52 (55) 5522 1535     5522 1675",
    "location": {
        "map_url": "http://maps.google.com/maps?daddr=19.4336%2C-99.1308",
        "address": "Lic. Francisco Primo de Verdad #10, Col. Centro Histórico.  06060, Centro Histórico"
    },
    "description": "Desde 1994, la Universidad Autónoma Metropolitana tiene bajo su custodia este museo que fue el lugar al que llegó la primera imprenta del continente americano. La casona fue edificada por el conquistador Jerónimo de Aguilar en 1524 sobre el templo del dios Tezcatlipoca. Fue hasta 1539 que se estableció una sucursal del taller de imprenta del sevillano Johannes Cromberger por parte de Juan Pablos y bajo el virreinato de don Antonio de Mendoza. Durante ese lapso, y hasta 1989, la casona perteneció a varios dueños, hasta que se iniciaron los trabajos de rescate por parte del Gobierno Federal y la Universidad. En esos trabajos se hallaron 90 piezas prehispánicas que se exhiben en el museo que también es casa de cultura.",
    "external_urls": [
        "https://www.facebook.com/Casa-de-la-Primera-Imprenta-de-Am%C3%A9rica-144480592260073/",
        "mailto:igcarrion@correo.uam.mx"
    ],
    "url": "http://cdmxtravel.com/es/lugares/casa-de-la-primera-imprenta-de-america.html",
    "destination": "Centro Histórico"
}