{
    "name": "Dermal Day Spa Polanco",
    "labels": [
        "Tiempo libre"
    ],
    "price": "",
    "categories": [
        "Spas"
    ],
    "schedule": [
        "13:00-19:00",
        "10:00-19:00",
        "10:00-19:00",
        "10:00-19:00",
        "10:00-19:00",
        "10:00-19:00",
        "10:00-19:00"
    ],
    "contact": "55 5281 3828",
    "location": {
        "map_url": "http://maps.google.com/maps?daddr=19.4314%2C-99.2008",
        "address": "Goldsmith #56-C, Col. Polanco. 11560, Polanco-Chapultepec"
    },
    "description": "Centro especializado en el cuidado de la piel. Ofrece masajes y tratamientos faciales y corporales para hombres y mujeres.",
    "external_urls": [
        "https://es-la.facebook.com/pages/category/Massage-Service/Dermal-Day-Spa-Polanco-366674653543066/",
        "mailto:dermal@terra.com.mx"
    ],
    "url": "http://cdmxtravel.com/es/lugares/dermal-day-spa-polanco.html",
    "destination": "Polanco-Chapultepec"
}