{
    "name": "Casa de Cultura de la UAEMéx en Tlalpan",
    "labels": [
        "Museos",
        "Cultura todos los días"
    ],
    "price": "Gratuito",
    "categories": [
        "Ciencia e historia",
        "Casas de cultura"
    ],
    "schedule": [
        "10:00-19:00",
        "10:00-19:00",
        "10:00-19:00",
        "10:00-19:00",
        "10:00-19:00",
        "10:00-16:00",
        "Cerrado"
    ],
    "contact": "+52 (55) 5513 5802",
    "location": {
        "map_url": "http://maps.google.com/maps?daddr=19.2863%2C-99.1679",
        "address": "Triunfo de La Libertad 9, Col. Tlalpan Centro. 14000, Tlalpan"
    },
    "description": "En 1827 la Constitución política del Estado de México dispuso la creación de un instituto literario, lo cual se logró en los años siguientes, por decreto del gobernador Lorenzo Zavala.\n\nEste instituto después se movió a un inmueble que rescató el gobierno del Estado y lo cedió a la Universidad Autónoma del Estado de México en 1986 para que fuera una casa de cultura con actividades académico-cultural con creadores de la entidad, el país y el extranjero.",
    "external_urls": [
        "https://www.facebook.com/CCTUAEMex",
        "http://ri.uaemex.mx/handle/20.500.11799/41082",
        "mailto:tlalpan_cultura@uaemex.mx"
    ],
    "url": "http://cdmxtravel.com/es/lugares/casa-de-cultura-de-la-uaemex-en-tlalpan.html",
    "destination": "Tlalpan"
}