{
    "name": "Museo Nacional de las Culturas (Casa de Moneda)",
    "labels": [
        "Museos",
        "México monumental"
    ],
    "price": "Gratuito",
    "categories": [
        "Ciencia e historia",
        "Casas históricas",
        "Museos de arte e historia"
    ],
    "schedule": [
        "Cerrado",
        "10:00-17:00",
        "10:00-17:00",
        "10:00-17:00",
        "10:00-17:00",
        "10:00-17:00",
        "10:00-17:00"
    ],
    "contact": "+52 (55) 5542 1097",
    "location": {
        "map_url": "http://maps.google.com/maps?daddr=19.4325%2C-99.1311",
        "address": "Moneda #13, Col. Centro. 06010, Centro Histórico"
    },
    "description": "El Museo Nacional de las Culturas divulga las formas de vida, valores, costumbres y creencias de otras culturas a través de sus objetos. Ahí se pueden apreciar un sarcófago egipcio, bronces y esculturas chinas, una tablilla sumeria, un impermeable esquimal y una manta de Alaska. Las salas de exhibición están organizadas en Internacional, Pacífico y Mediterráneo: un mar de culturas y China.\n\nFue uno de los primeros museos en abrir en México en 1965 y es uno de los cinco museos nacionales a cargo del Instituto Nacional de Antropología e Historia. En sus interiores el mural Revolución forma parte de la estética del edificio, se trata de una obra del artista oaxaqueño Rufino Tamayo que data de 1938.\n\nAntes de ser museo fue la Real Casa de Moneda establecida el 11 de mayo de 1535 por el virrey Antonio de Mendoza. La casa funcionó durante dos siglos. Ahí se produjeron piezas como el real de a ocho. Por su buena calidad y trabajo fino, las monedas fueron inicialmente de plata, las primeras fueron conocidas como Carlos y Juana por el nombre de los monarcas, luego de oro y bronce. La casa traspasó fronteras, el material fue usado en Europa Occidental, Estados Unidos, Japón y China era conocido como \"Spanish dollar\". Después alojó a la Suprema Corte de Justicia de la Nación y fue centro de investigación.\n\nDurante las Noches de Museo se proyectan películas infantiles para que también los niños tengan su propio espacio dentro de este museo.",
    "external_urls": [
        "https://www.facebook.com/pages/Museo-Nacional-de-las-Culturas-INAH-Oficial/1387194361502183?fref=ts",
        "https://twitter.com/MuseoCulturas",
        "http://www.museodelasculturas.mx/",
        "mailto:monserrat_navarro@inah.gob.mx"
    ],
    "url": "http://cdmxtravel.com/es/lugares/museo-nacional-de-las-culturas-casa-de-moneda.html",
    "destination": "Centro Histórico"
}