{
    "name": "Centro Cultural Yo’o Za’a Macario Matus",
    "labels": [
        "Cultura todos los días"
    ],
    "price": "Gratuito",
    "categories": [
        "Centros culturales"
    ],
    "schedule": [
        "Cerrado",
        "Cerrado",
        "Cerrado",
        "19:00-00:00",
        "19:00-00:00",
        "19:00-00:00",
        "Cerrado"
    ],
    "contact": "(+52) 55 4831 8639",
    "location": {
        "map_url": "http://maps.google.com/maps?daddr=19.4499%2C-99.1375",
        "address": "Edificio Guanajuato loc. 2 PB, conjunto Habitacional Tlatelolco, Col. Guerrero. 06995, Norte"
    },
    "description": "Es un centro cultural de los zapotecas en honor al poeta Macario Matus, promotor de esa cultura y comunidad de Oaxaca. En el espacio se llevan a cabo exposiciones, presentaciones de libros y discos, recitales de poesía y talleres de fonología, morfología y conversaciones del zapoteco, así como un taller de creación literaria. En este lugar se trabaja con representantes de otras culturas como la maya, mixteca y nahua.",
    "external_urls": [
        "https://www.facebook.com/CentroCulturalMacarioMatus/?rf=242560442467303"
    ],
    "url": "http://cdmxtravel.com/es/lugares/centro-cultural-yo-o-za-a-macario-matus.html",
    "destination": "Norte"
}