{
    "name": "Celtics Pub Irlandés Condesa",
    "labels": [
        "Vive la noche"
    ],
    "price": "Desde $200 MXN",
    "categories": [
        "Bar",
        "Pub"
    ],
    "schedule": [
        "13:30-03:00",
        "13:30-03:00",
        "13:30-03:00",
        "13:30-03:00",
        "13:30-03:00",
        "13:30-03:00",
        "17:30-03:00"
    ],
    "contact": "+52 (55) 5211 9081",
    "location": {
        "map_url": "http://maps.google.com/maps?daddr=19.4129%2C-99.1724",
        "address": "Avenida Tamaulipas No. 36\r\nColonia Condesa, Cuauhtémoc 06140, Condesa"
    },
    "description": "Con un estilo de pub irlandés ofrece una gran variedad de bebidas, especialmente whiskey y cervezas, tanto nacionales como importadas. Cuentan con una carta con todo tipo de platillos, desde botanas como las alitas de pollo, ensalada de palmito con pollo, sopas y platos fuertes como el estofado de res con vegetales.",
    "external_urls": [
        "https://www.facebook.com/pages/CELTICS-PUB/87723672286?fref=ts",
        "https://twitter.com/celtics_pub",
        "http://www.celticspub.com/",
        "mailto:eventos@celticspub.com"
    ],
    "url": "http://cdmxtravel.com/es/lugares/celtics-pub-irlandes-condesa.html",
    "destination": "Condesa"
}