{
    "name": "Galería LTBART",
    "labels": [
        "Cultura todos los días"
    ],
    "price": "",
    "categories": [
        "Galerías"
    ],
    "schedule": [
        "10:00-17:00",
        "10:00-17:00",
        "10:00-17:00",
        "10:00-17:00",
        "10:00-17:00",
        "10:00-17:00",
        "Cerrado"
    ],
    "contact": "55 6587 8668",
    "location": {
        "map_url": "http://maps.google.com/maps?daddr=19.4316%2C-99.2016",
        "address": "Emilio Castelar #230, Col. Polanco. 11550, Polanco-Chapultepec"
    },
    "description": "Abrió en mayo de 2014 y es dirigida por Francisco Gutiérrez. La idea es posicionar al arte como un accesorio de lujo. Es un lugar donde lo más chic y fashion se fusiona con el arte, por lo que ha contado con el trabajo de Michel Comte, Gavin Bond, Russell Young y Hiro Ando.\n\nDestacan artistas como el fotógrafo británico Nick Veasey, quien trabaja con rayos X y Christy Lee Rogers, quien realiza fotos bajo el agua.",
    "external_urls": [
        "https://www.facebook.com/LTBART",
        "https://www.instagram.com/lettherebart/",
        "https://twitter.com/lettherebart",
        "http://www.ltbart.com/index.php",
        "mailto:info@ltbart.com"
    ],
    "url": "http://cdmxtravel.com/es/lugares/galeria-ltbart.html",
    "destination": "Polanco-Chapultepec"
}