{
    "name": "Mercado Melchor Múzquiz de San Ángel",
    "labels": [
        "Puro sabor local"
    ],
    "price": "",
    "categories": [
        "Mercados y bazares"
    ],
    "schedule": [
        "11:00-18:00",
        "11:00-18:00",
        "11:00-18:00",
        "11:00-18:00",
        "11:00-18:00",
        "11:00-18:00",
        "11:00-18:00"
    ],
    "contact": null,
    "location": {
        "map_url": "http://maps.google.com/maps?daddr=19.343%2C-99.1912",
        "address": "Av. Revolución s/n, Col. San Ángel. 01000, San Ángel"
    },
    "description": "Inaugurado el 12 de noviembre de 1958. Destaca un grandioso mural realizado por Ariosto Otero en 2008, año en el que se remodeló.\n\nEn el mural se relata la historia de actividades relacionadas con el comercio y con personajes populares del cine, la música y las artes plásticas.\n\nEs conocido popularmente como el mercado de las Flores de San Ángel por su gran variedad; tiene flores exóticas como girasoles, orquídeas y tulipanes; se hacen arreglos florales desde pequeños detalles hasta algunos grandes y muy elaborados. Además, venden artículos relacionados con la jardinería, frutas, verduras, carnes, pescados y también tiene pequeñas fondas con deliciosas comidas.",
    "external_urls": [
        "http://mercado-sanangel.blogspot.com.es/"
    ],
    "url": "http://cdmxtravel.com/es/lugares/mercado-melchor-muzquiz-de-san-angel.html",
    "destination": "San Ángel"
}