{
    "name": "Marrakech Salón",
    "labels": [
        "Vive la noche"
    ],
    "price": "Desde $150 MXN",
    "categories": [
        "Gay bar",
        "Centros nocturnos"
    ],
    "schedule": [
        "Cerrado",
        "Cerrado",
        "17:30-02:30",
        "18:00-02:30",
        "18:00-02:30",
        "18:00-02:30",
        "Cerrado"
    ],
    "contact": "222 362 2627",
    "location": {
        "map_url": "http://maps.google.com/maps?daddr=19.4373%2C-99.1367",
        "address": "República de Cuba #18, Col. Centro.  06000, Centro Histórico"
    },
    "description": "Es conocido por ser uno de los antros gay más concurridos de la ciudad. Y lo ha logrado por su gran ambiente y ubicación.\n\nLa calle de República de Cuba, en el Centro, se ha convertido en una especie de Corredor arcoiris de la capital con propuestas como La Perla, La Purísima y el Marrakech.",
    "external_urls": [
        "https://www.facebook.com/pages/Marrakech-Sal%C3%B3n/112884338747740",
        "https://twitter.com/marrakechsalon"
    ],
    "url": "http://cdmxtravel.com/es/lugares/marrakech-salon.html",
    "destination": "Centro Histórico"
}