{
    "name": "Museo de Sitio y de la Música Mexicana",
    "labels": [
        "Museos",
        "En familia",
        "Por recinto"
    ],
    "price": "Gratuito",
    "categories": [
        "Ciencia e historia",
        "Singulares",
        "Centros de entretenimiento familiares",
        "Con eventos"
    ],
    "schedule": [
        "15:30-20:00",
        "15:30-20:00",
        "15:30-20:00",
        "15:30-20:00",
        "15:30-20:00",
        "Cerrado",
        "Cerrado"
    ],
    "contact": "(55) 5772 2742",
    "location": {
        "map_url": "http://maps.google.com/maps?daddr=19.4462%2C-99.1347",
        "address": "Francisco González Bocanegra #73, Col. Morelos. 06200, Norte"
    },
    "description": "Este museo destaca todo sobre la música mexicana, su variedad y su formación a partir de sus raíces negras, europeas e indígenas; dentro de su colección destaca la de instrumentos musicales de diferentes regiones del país, construidos con diversos materiales y técnicas.\n\nTambién se exhiben reproducciones de instrumentos musicales de la época prehispánicos, así como vestigios y osamentas tlatelolcas. La división que ofrece el museo es a través de regiones, para que los visitantes descubran las diferencias entre zonas, así como las similitudes que componen la música de México.",
    "external_urls": [
        "https://www.facebook.com/CasamusmexSC/timeline",
        "https://www.tripadvisor.com.mx/Attraction_Review-g152773-d17754729-Reviews-Museo_De_La_Musica_Mexicana_Rafael_Tovar_De_Teresa-Puebla_Central_Mexico_and_Gul.html",
        "https://twitter.com/CasaMusMex",
        "https://casamusicamexicanaonline.com.mx/museo-de-sitio/",
        "mailto:informes@casamusmex.org"
    ],
    "url": "http://cdmxtravel.com/es/lugares/museo-de-sitio-y-de-la-musica-mexicana.html",
    "destination": "Norte"
}