{
    "name": "Bosque de Chapultepec",
    "labels": [
        "México monumental",
        "Puro sabor local",
        "Al aire libre",
        "Cultura todos los días",
        "En familia",
        "Sé un espectador",
        "Diversión y adrenalina",
        "MICE",
        "Por recinto",
        "Museos"
    ],
    "price": "",
    "categories": [
        "Arqueología",
        "Monumentos",
        "Palacios",
        "Casas históricas",
        "Patrimonio Mundial Cultural",
        "Patrimonio Cultural Inmaterial",
        "Parques",
        "Parques nacionales",
        "Jardines",
        "Bosques",
        "Lagos",
        "Galerías",
        "Casas de cultura",
        "Centros culturales",
        "Centros de entretenimiento familiares",
        "Centros de espectáculos y salas de conciertos",
        "Espacios para correr",
        "Espacios de reunión",
        "Con eventos",
        "Museos de arte e historia"
    ],
    "schedule": [
        "Cerrado",
        "05:00-19:00",
        "05:00-19:00",
        "05:00-19:00",
        "05:00-19:00",
        "05:00-19:00",
        "05:00-19:00"
    ],
    "contact": "+52 (55)  5281 5382",
    "location": {
        "map_url": "http://maps.google.com/maps?daddr=19.4195%2C-99.1896",
        "address": "Paseo de la Reforma I Sección s/n, Col. Bosque de Chapultepec. 11100, Polanco-Chapultepec"
    },
    "description": "Es el parque urbano más antiguo de América. El Cerro del Chapulín o Chapultepec tiene una herencia centenaria de cultura y diversidad multicultural. Su nombre se debe a que era un sitio donde nacía el agua. En la época Prehispánica fue un sitio ocupado por teotihuacanos, toltecas y mexicas; ahí Moctezuma, uno de los tlatoani de los mexicas, encomendó a Nezahualcóyotl, señor de Tetzuco y destacado arquitecto, construir un acueducto para llevar agua a Tenochtitlán, edificar baños con una función ritual, un jardín botánico y un zoológico.\n\nSiguiendo la vocación del lugar, en 1530, bajo mandato español, se decretó que Chapultepec fuera un lugar de recreo. En 1785 se inició la construcción del Palacio Virreinal (Castillo de Chapultepec) donde habitaron Maximiliano y Carlota, Porfirio Díaz, Francisco I. Madero, Venustiano Carranza y otros presidentes. El lugar ha sido defensa, sitio sagrado, observatorio, repositorio de historia y lugar de esparcimiento.\n\nConsta de 678 hectáreas entre áreas verdes y construcciones. Está dividido en tres secciones en las que se pueden encontrar dos lagos artificiales, espacios deportivos, cuatro fuentes, seis monumentos, ocho museos, un kiosco, una casa de cultura, el Zoológico de Chapultepec, un jardín botánico, teatros y más atractivos que lo convierten en un lugar de visita para turistas y vecinos. Sobra decir que los niños encontrarán un amplio espacio para correr, jugar y divertirse al aire libre disfrutando de la naturaleza, además con frecuencia se organizan espectáculos y actividades específicas para cada edad.\n\nMostrar todo ›Ocultar ›",
    "external_urls": [
        "https://www.facebook.com/ProChapultepec/",
        "https://www.instagram.com/prochapultepec/",
        "https://www.tripadvisor.com.mx/Attraction_Review-g150800-d152193-Reviews-Bosque_de_Chapultepec-Mexico_City_Central_Mexico_and_Gulf_Coast.html",
        "https://twitter.com/ProChapultepec",
        "http://chapultepec.org.mx/",
        "mailto:cultura.chapultepec@gmail.com"
    ],
    "url": "http://cdmxtravel.com/es/lugares/bosque-de-chapultepec.html",
    "destination": "Polanco-Chapultepec"
}