{
    "name": "Sala Miguel Covarrubias",
    "labels": [
        "Sé un espectador",
        "Por recinto"
    ],
    "price": "",
    "categories": [
        "Centros de espectáculos y salas de conciertos",
        "Teatros",
        "Cines de arte",
        "Con eventos"
    ],
    "schedule": [
        "Cerrado",
        "Cerrado",
        "16:30-20:30",
        "16:30-20:30",
        "16:30-20:30",
        "16:30-20:30",
        "16:30-19:30"
    ],
    "contact": "55 5665 6825",
    "location": {
        "map_url": "http://maps.google.com/maps?daddr=19.3134%2C-99.1853",
        "address": "Insurgentes Sur #3000, Col. Ciudad Universitaria. 04510, Ciudad Universitaria"
    },
    "description": "Esta sala se encuentra dentro del Centro Cultural Universitario y está dedicada, mayormente, a la danza, pero en ocasiones la Dirección General de Música de la UNAM organiza producciones operísticas. Tiene capacidad para albergar a 691 espectadores.\n\n",
    "external_urls": [
        "https://www.facebook.com/UNAMDanza",
        "https://twitter.com/DanzaUNAM",
        "https://www.youtube.com/user/DanzaUNAM",
        "http://www.musica.unam.mx/index.php?option=com_content&view=article&id=11&Itemid=173"
    ],
    "url": "http://cdmxtravel.com/es/lugares/sala-miguel-covarrubias.html",
    "destination": "Ciudad Universitaria"
}