{
    "name": "Plaza de la República",
    "labels": [
        "Al aire libre",
        "En familia",
        "MICE",
        "Museos"
    ],
    "price": "Gratuito",
    "categories": [
        "Plazas",
        "Centros de entretenimiento familiares",
        "Espacios de reunión",
        "Museos de arte e historia"
    ],
    "schedule": [
        "00:01-23:59",
        "00:01-23:59",
        "00:01-23:59",
        "00:01-23:59",
        "00:01-23:59",
        "00:01-23:59",
        "00:01-23:59"
    ],
    "contact": null,
    "location": {
        "map_url": "http://maps.google.com/maps?daddr=19.4361%2C-99.1542",
        "address": "Av. de la República s/n, Col. Tabacalera. 06030, Alameda"
    },
    "description": "Es cierto que el mayor atractivo no es la plaza en sí, sino el Monumento y Museo a la Revolución que se erige al centro de la explanada; sin embargo, la plaza se ha consolidado como un espacio de manifestaciones multitudinarias. El proyecto original de este espacio era una obra porfiriana, que fue interrumpida por los movimientos armados de 1910 (Revolución mexicana).\n\nLa plaza se encuentra delimitada por la avenida de la República, y alrededor se han construido algunos edificios de estilo art déco.",
    "external_urls": null,
    "url": "http://cdmxtravel.com/es/lugares/plaza-de-la-republica.html",
    "destination": "Alameda"
}