{
    "name": "Cervecería de Barrio Santa Fe",
    "labels": [
        "Vive la noche"
    ],
    "price": "Desde $250 MXN",
    "categories": [
        "Bar",
        "Cervecería"
    ],
    "schedule": [
        "13:00-00:00",
        "13:00-00:00",
        "13:00-02:00",
        "13:00-02:00",
        "13:00-02:00",
        "13:00-02:00",
        "11:30-20:00"
    ],
    "contact": "+52 (55) 5292 1949",
    "location": {
        "map_url": "http://maps.google.com/maps?daddr=19.3597%2C-99.2787",
        "address": "Juan Salvador Agraz #40, Col. Lomas de Santa Fe. 01219, Santa Fe"
    },
    "description": "Un lugar alejado de los bares o antros de cadena, se trata de un ambiente de marisquería de mercado en el que impera el buen ambiente, con música rock-pop y por supuesto deliciosas cervezas de diferentes tipos y orígenes, además de cocteles, vodkas, rones, margaritas, mojitos y mucho más. También ofrece un menú rico en mariscos, tostadas, empanadas y muchos más.",
    "external_urls": [
        "https://www.facebook.com/LaCerveceriaDeBarrioOficial?ref=hl#",
        "https://www.tripadvisor.com.mx/Restaurant_Review-g150800-d4137493-Reviews-La_Cerveceria_de_Barrio_Sta_Fe-Mexico_City_Central_Mexico_and_Gulf_Coast.html",
        "https://twitter.com/lacerveceria_",
        "http://www.lacerveceria.rest/",
        "mailto:info@lacerveceria.com.mx"
    ],
    "url": "http://cdmxtravel.com/es/lugares/cerveceria-de-barrio-santa-fe.html",
    "destination": "Santa Fe"
}