{
    "name": "ADO-Megapantalla Imax Papalote Museo del Niño",
    "labels": [
        "Museos",
        "En familia",
        "Sé un espectador",
        "Por recinto"
    ],
    "price": "Desde $99 MXN",
    "categories": [
        "Singulares",
        "Centros de entretenimiento familiares",
        "Cines",
        "Con eventos"
    ],
    "schedule": [
        "10:30-16:30",
        "10:30-16:30",
        "10:30-16:30",
        "10:30-21:30",
        "10:30-16:30",
        "10:30-18:30",
        "10:30-18:30"
    ],
    "contact": "(55) 5237 1781",
    "location": {
        "map_url": "http://maps.google.com/maps?daddr=19.4116%2C-99.1947",
        "address": "Av. Constituyentes #268, Col. Daniel Garza. 11830, Polanco-Chapultepec"
    },
    "description": "La pantalla más grande de su tipo en Latinoamérica. Aquí se puede disfrutar de las mejores proyecciones en tercera dimensión con sonido envolvente.\n\nSe localiza al interior del Papalote Museo del Niño, en Chapultepec.\n\nSe tiene que verificar la programación de la megapantalla antes de acudir.\n\n",
    "external_urls": [
        "https://www.facebook.com/PapaloteMuseo/app_293351367509462",
        "https://www.instagram.com/papalote_museo/",
        "https://www.tripadvisor.com.mx/ShowUserReviews-g150800-d155969-r507210260-Papalote_Museo_del_Nino-Mexico_City_Central_Mexico_and_Gulf_Coast.html",
        "https://twitter.com/papalote_museo",
        "https://www.youtube.com/user/PapaloteMuseoDelNino",
        "https://papalote.org.mx/ado-megapantalla-imax"
    ],
    "url": "http://cdmxtravel.com/es/lugares/ado-megapantalla-imax-papalote-museo-del-nino.html",
    "destination": "Polanco-Chapultepec"
}