{
    "name": "Casa de Humanidades de la UNAM",
    "labels": [
        "Museos",
        "México monumental",
        "Sé un espectador",
        "Cultura todos los días",
        "MICE"
    ],
    "price": "",
    "categories": [
        "Arte",
        "Patrimonio Mundial Cultural",
        "Filmotecas",
        "Casas de cultura",
        "Centros culturales",
        "Cines",
        "Cines de arte",
        "Espacios de reunión",
        "Librerías"
    ],
    "schedule": [
        "09:00-20:00",
        "09:00-20:00",
        "09:00-20:00",
        "09:00-20:00",
        "09:00-20:00",
        "Cerrado",
        "Cerrado"
    ],
    "contact": "+52 (55) 5554 5579",
    "location": {
        "map_url": "http://maps.google.com/maps?daddr=19.3477%2C-99.1646",
        "address": "Venustiano Carranza #162, Col. Villa Coyoacán. 04000, Coyoacán"
    },
    "description": "Desde el año 2000 la Casa de las Humanidades está a cargo de la Universidad Nacional Autónoma de México. Es una sede alterna de las actividades que lleva a cabo la universidad con un perfil académico.\n\nSe realizan presentaciones editoriales, conferencias, cursos, diplomados, cine debates, ferias de libros, viernes de lectura y otras actividades. Tiene un auditorio, una sala de usos múltiples y sala de videoconferencias.",
    "external_urls": [
        "https://www.facebook.com/cashum.unam/",
        "https://twitter.com/casahumanidades",
        "http://www.cashum.unam.mx/index.php",
        "mailto:difhum@unam.mx"
    ],
    "url": "http://cdmxtravel.com/es/lugares/casa-de-humanidades-de-la-unam.html",
    "destination": "Coyoacán"
}