{
    "name": "Antara Fashion Hall",
    "labels": [
        "En familia",
        "Tiempo libre",
        "MICE",
        "Por recinto",
        "Shopping"
    ],
    "price": "",
    "categories": [
        "Centros de entretenimiento familiares",
        "Centros comerciales",
        "Diseño mexicano",
        "Boutiques únicas/originales",
        "Espacios de reunión",
        "Con eventos",
        "Moda",
        "Accesorios",
        "Mobiliario",
        "diseño e interiorismo",
        "Joyería y relojería",
        "Gourmet"
    ],
    "schedule": [
        "11:00-20:00",
        "11:00-20:00",
        "11:00-20:00",
        "11:00-20:00",
        "11:00-20:00",
        "11:00-20:00",
        "11:00-20:00"
    ],
    "contact": "(55) 4593 8870",
    "location": {
        "map_url": "http://maps.google.com/maps?daddr=19.4393%2C-99.2023",
        "address": "Av. Ejército Nacional #843, Col. Granada. 11520, Polanco-Chapultepec"
    },
    "description": "Este centro comercial es un espacio único al aire libre con un excelente paseo peatonal en el que se encuentran tiendas con las últimas tendencias en moda, interiorismo y joyería. Cuenta con una fabulosa zona de ocio con bares, clubes y centros de espectáculos.\n\nUno de los centros comerciales más exclusivos de toda la ciudad donde el lujo, la couture y la alta cocina se combinan para dar a sus clientes las mejores experiencias sibaritas.\n\nEl edificio fue contruido por el arquitecto Javier Sordo Madaleno, cuenta con una superficie de 510,000m2.",
    "external_urls": [
        "https://www.facebook.com/At.Antara",
        "https://www.flickr.com/photos/antarafashionhall",
        "https://www.instagram.com/antarafashionhall/",
        "http://www.pinterest.com/antarafashion/",
        "https://www.tripadvisor.com.mx/Attraction_Review-g150800-d10234745-Reviews-Antara_Fashion_Hall-Mexico_City_Central_Mexico_and_Gulf_Coast.html",
        "https://twitter.com/antarafashion",
        "https://www.youtube.com/user/AntaraFashionHall",
        "http://www.antara.com.mx/landing",
        "mailto:callcenter@antara.com.mx"
    ],
    "url": "http://cdmxtravel.com/es/lugares/antara-fashion-hall.html",
    "destination": "Polanco-Chapultepec"
}