{
    "name": "Bazar del Oro",
    "labels": [
        "Museos",
        "Puro sabor local",
        "Tiempo libre"
    ],
    "price": "",
    "categories": [
        "Arte",
        "Mercados y bazares",
        "Artesanías",
        "Diseño mexicano"
    ],
    "schedule": [
        "Cerrado",
        "Cerrado",
        "Cerrado",
        "Cerrado",
        "Cerrado",
        "10:00-19:00",
        "10:00-19:00"
    ],
    "contact": null,
    "location": {
        "map_url": "http://maps.google.com/maps?daddr=19.4192%2C-99.165",
        "address": "Cjón. El Oro s/n, Col. Roma Norte. 06700, Condesa"
    },
    "description": "Este bazar se encuentra en el callejón El Oro, del que adopta su nombre, muy cerca de la Glorieta de la Cibeles en una de las zonas más bonitas de la famosa colonia Roma. Aquí pueden encontrarse una gran variedad de productos y servicios: desde las tradicionales quesadillas hasta paella, además de ropa, accesorios, música, café, e incluso cortes de cabello; los precios son variados y muy accesibles. Ya sea que se quiera ir de compras o a pasear, es un lugar imperdible.",
    "external_urls": [
        "https://www.facebook.com/pages/BAZAR-DEL-ORO/122711617806100?sk=timeline"
    ],
    "url": "http://cdmxtravel.com/es/lugares/bazar-del-oro.html",
    "destination": "Condesa"
}