{
    "name": "El Pecado de Noé",
    "labels": [
        "Vive la noche"
    ],
    "price": "Desde $250 MXN",
    "categories": [
        "Bar"
    ],
    "schedule": [
        "Cerrado",
        "13:00-01:15",
        "13:00-01:15",
        "13:00-01:15",
        "13:00-02:00",
        "13:00-02:00",
        "13:00-00:00"
    ],
    "contact": "+52 (55) 5514 8817",
    "location": {
        "map_url": "http://maps.google.com/maps?daddr=19.4192%2C-99.1669",
        "address": "Oaxaca #69, Col. Roma Norte. 06700, Condesa"
    },
    "description": "Pizzas, pastas, tapas y cortes forman parte de su menú, pero lo más importante son las cavas que resguardan sus paredes, que ambientan la tarde e inician la fiesta los fines de semana. Excelente ambiente con buena comida y vinos exclusivos con vista a la Fuente de la Cibeles.",
    "external_urls": [
        "https://www.tripadvisor.com.mx/Restaurant_Review-g150800-d1581682-Reviews-El_Pecado_de_Noe-Mexico_City_Central_Mexico_and_Gulf_Coast.html"
    ],
    "url": "http://cdmxtravel.com/es/lugares/el-pecado-de-noe.html",
    "destination": "Condesa"
}