{
    "name": "Viena Bar",
    "labels": [
        "Vive la noche"
    ],
    "price": "Desde $200 MXN",
    "categories": [
        "Gay bar"
    ],
    "schedule": [
        "14:00-01:30",
        "14:00-01:30",
        "14:00-01:30",
        "14:00-02:30",
        "14:00-02:30",
        "14:00-02:30",
        "14:00-01:30"
    ],
    "contact": "(55) 5512 0929",
    "location": {
        "map_url": "http://maps.google.com/maps?daddr=19.4378%2C-99.1402",
        "address": "República de Cuba #2-E, Col. Centro. 06000, Centro Histórico"
    },
    "description": "Entre semana es un lugar para precopear y relajarse, pero los fines de semana la música electro-pop alegra las paredes, ideal para hombres de entre 20 y 40 años quienes gustan bailar, platicar y recordar a Cher o a Tina Turner.",
    "external_urls": [
        "https://es-la.facebook.com/pages/El-Viena/177943008919979"
    ],
    "url": "http://cdmxtravel.com/es/lugares/viena-bar.html",
    "destination": "Centro Histórico"
}