{
    "name": "Terraza Cha Cha Chá",
    "labels": [
        "Vive la noche"
    ],
    "price": "Desde $500 MXN",
    "categories": [
        "Bar",
        "Pub"
    ],
    "schedule": [
        "Cerrado",
        "13:00-01:30",
        "13:00-01:30",
        "13:00-01:30",
        "13:00-01:30",
        "13:00-01:30",
        "13:00-18:30"
    ],
    "contact": "+52 (55) 5705 2272",
    "location": {
        "map_url": "http://maps.google.com/maps?daddr=19.4362%2C-99.1526",
        "address": "Av. de la República #157, Col. Tabacalera. 06030, Centro Histórico"
    },
    "description": "Terraza Cha Cha Chá es una nueva propuesta gastronómica especializada en mariscos y comida del mar, se encuentra ubicada en la colonia Tabacalera. Esta terraza además de ofrecer exquisitos platillos cuenta con una vista privilegiada hacia el Monumento a la Revolución. El ambiente es 100% tropical, ideal para pasar un buen rato con familiares o amigos.",
    "external_urls": [
        "https://www.facebook.com/TerrazaChaChaChaMX/",
        "https://www.tripadvisor.com.mx/Restaurant_Review-g150800-d13963936-Reviews-Terraza_Cha_Cha_Cha-Mexico_City_Central_Mexico_and_Gulf_Coast.html",
        "https://www.grupopalmares.com.mx/terraza-cha-cha-cha/"
    ],
    "url": "http://cdmxtravel.com/es/lugares/terraza-cha-cha-cha.html",
    "destination": "Centro Histórico"
}