{
    "name": "Grand San Ángel Plaza Comercial",
    "labels": [
        "En familia",
        "Tiempo libre",
        "MICE"
    ],
    "price": "",
    "categories": [
        "Centros de entretenimiento familiares",
        "Centros comerciales",
        "Espacios de reunión"
    ],
    "schedule": [
        "11:00-22:00",
        "11:00-22:00",
        "11:00-22:00",
        "11:00-22:00",
        "11:00-22:00",
        "11:00-22:00",
        "11:00-22:00"
    ],
    "contact": null,
    "location": {
        "map_url": "http://maps.google.com/maps?daddr=19.346%2C-99.191",
        "address": "Amargura #17, Col. San Ángel. 01000, San Ángel"
    },
    "description": "La plaza comercial Grand San Ángel se ha convertido en uno más de los atractivos de San Ángel. Llaman la atención sus corredores coloniales. Cuenta con diversas boutiques, galerías y con una oferta gastronómica inigualable, donde las terrazas deslumbran hasta al más escéptico.\n\nCuenta con estacionamiento, valet parking y circuito cerrado de vigilancia.",
    "external_urls": [
        "https://www.facebook.com/GrandSanAngel",
        "http://www.gransanangel.com.mx/"
    ],
    "url": "http://cdmxtravel.com/es/lugares/grand-san-angel-plaza-comercial.html",
    "destination": "San Ángel"
}