{
    "name": "Aguafuerte Galería",
    "labels": [
        "Cultura todos los días"
    ],
    "price": "Gratuito",
    "categories": [
        "Galerías"
    ],
    "schedule": [
        "Cerrado",
        "14:00-20:00",
        "14:00-20:00",
        "14:00-20:00",
        "14:00-20:00",
        "14:00-20:00",
        "Cerrado"
    ],
    "contact": "+52 (55) 4195 2713",
    "location": {
        "map_url": "http://maps.google.com/maps?daddr=19.4166%2C-99.16",
        "address": "Guanajuato #118, Col. Roma. 06700, Roma"
    },
    "description": "Desde 2006 la galería se ha convertido en un espacio de interés para todos aquellos que gozan del arte y la cultura: pintores, grabadores, escultores, fotógrafos, escritores, coleccionistas y amantes del arte.\n\nAdemás de las exposiciones temporales, Aguafuerte cuenta con un acervo importante de obras de artistas mexicanos y extranjeros, emergentes y consolidados, donde las propuestas y corrientes se mezclan para concebir proyectos y exposiciones inigualables.",
    "external_urls": [
        "https://www.facebook.com/aguafuerte.galeriamexico.7/",
        "https://twitter.com/#!/AguafuerteG",
        "http://www.aguafuertegaleria.com/",
        "mailto:contacto@aguafuertegaleria.com"
    ],
    "url": "http://cdmxtravel.com/es/lugares/aguafuerte-galeria.html",
    "destination": "Roma"
}