{
    "name": "Pan y Circo",
    "labels": [
        "Vive la noche"
    ],
    "price": "Desde $200 MXN",
    "categories": [
        "Bar",
        "Lounge"
    ],
    "schedule": [
        "Cerrado",
        "18:00-00:00",
        "18:00-00:00",
        "18:00-02:00",
        "18:00-02:00",
        "18:00-02:00",
        "Cerrado"
    ],
    "contact": "+52 (55) 2301 9522",
    "location": {
        "map_url": "http://maps.google.com/maps?daddr=19.4176%2C-99.1621",
        "address": "Av. Álvaro Obregón 1#60, Col. Roma Norte. 06700, Roma"
    },
    "description": "Pizzería y hamburguesería de barrio con ambiente de bar y lounge. Ideal para una tarde de fiesta con amigos o pareja. Se localiza en la colonia Roma.",
    "external_urls": [
        "https://www.facebook.com/panycircomxdf/"
    ],
    "url": "http://cdmxtravel.com/es/lugares/pan-y-circo.html",
    "destination": "Roma"
}