{
    "name": "Salón Sol",
    "labels": [
        "Vive la noche",
        "Por recinto"
    ],
    "price": "Desde $150 MXN",
    "categories": [
        "Bar",
        "Con eventos"
    ],
    "schedule": [
        "13:00-23:30",
        "13:00-23:30",
        "13:00-23:30",
        "13:00-23:30",
        "13:00-02:30",
        "13:00-02:30",
        "13:00-23:30"
    ],
    "contact": "(55) 5518 1511",
    "location": {
        "map_url": "http://maps.google.com/maps?daddr=19.4317%2C-99.1402",
        "address": "Venustiano Carranza #15, Col. Cuauhtémoc. 06500, Centro Histórico"
    },
    "description": "La fiesta y la convivencia son el objetivo del salón. Aquí el ambiente es relajado y abre sus puertas para todos aquellos que gustan celebrar o simplemente platicar con los amigos. También cuentan con acceso VIP.",
    "external_urls": [
        "https://www.facebook.com/SALONSOL.COM.MX/info",
        "https://www.instagram.com/salonsol.mx/",
        "https://www.tripadvisor.com.mx/Restaurant_Review-g150800-d10158075-Reviews-Salon_Sol-Mexico_City_Central_Mexico_and_Gulf_Coast.html",
        "https://twitter.com/salonsol_mx",
        "http://www.salonsol.mx/"
    ],
    "url": "http://cdmxtravel.com/es/lugares/salon-sol.html",
    "destination": "Centro Histórico"
}