{
    "name": "Metro Huerto",
    "labels": [
        "Al aire libre"
    ],
    "price": "",
    "categories": [
        "Huertos"
    ],
    "schedule": [
        "09:00-18:00",
        "09:00-18:00",
        "09:00-18:00",
        "09:00-18:00",
        "09:00-18:00",
        "09:00-18:00",
        "09:00-18:00"
    ],
    "contact": "+52 (55) 5264 3100",
    "location": {
        "map_url": "http://maps.google.com/maps?daddr=19.4141%2C-99.1646",
        "address": "Querétaro #225, Col. Roma Sur. 06700, Roma"
    },
    "description": "Metro Huerto es la forma de producir lo que comemos en un metro cuadrado de siembra. El muro comestible de Metro Huerto en Mercado Roma genera cultivos orgánicos de alta calidad, además de un hermoso paisaje. Ahí se encuentran brotes, hierbas culinarias, tisanas o flores comestibles.",
    "external_urls": [
        "https://www.facebook.com/metrohuerto?fref=site",
        "https://twitter.com/metrohuerto",
        "http://metrohuerto.com/",
        "mailto:info@metrohuerto.com"
    ],
    "url": "http://cdmxtravel.com/es/lugares/metro-huerto.html",
    "destination": "Roma"
}