{
    "name": "Estatua de José Guadalupe Posada",
    "labels": [
        "México monumental"
    ],
    "price": "",
    "categories": [
        "Monumentos"
    ],
    "schedule": [
        "Cerrado",
        "00:01-23:59",
        "00:01-23:59",
        "00:01-23:59",
        "00:01-23:59",
        "00:01-23:59",
        "00:01-23:59"
    ],
    "contact": "+52 (55) 5212 2171",
    "location": {
        "map_url": "http://maps.google.com/maps?daddr=19.4213%2C-99.1856",
        "address": "Bosque de Chapultepec 1a Sección s/n, Col. Bosque de Chapultepec. 11100, Polanco-Chapultepec"
    },
    "description": "Está ubicada al final de la Calzada de los Poetas al interior del Bosque de Chapultepec. José Guadalupe Posada fue un grabador que inmortalizó en su obra a la famosa Catrina y las calaveras, así como también representó a los políticos de la época. La estatua le rinde homenaje.",
    "external_urls": null,
    "url": "http://cdmxtravel.com/es/lugares/estatua-de-jose-guadalupe-posada.html",
    "destination": "Polanco-Chapultepec"
}