{
    "name": "Multiforo Alicia",
    "labels": [
        "Sé un espectador",
        "Por recinto"
    ],
    "price": "Desde $150 MXN",
    "categories": [
        "Centros de espectáculos y salas de conciertos",
        "Con eventos"
    ],
    "schedule": [
        "Cerrado",
        "18:00-02:00",
        "18:00-02:00",
        "18:00-02:00",
        "18:00-02:00",
        "Cerrado",
        "Cerrado"
    ],
    "contact": "55 5511 2100",
    "location": {
        "map_url": "http://maps.google.com/maps?daddr=19.4216%2C-99.1542",
        "address": "Cuauhtémoc #91, Col. Roma. 06700, Roma"
    },
    "description": "La historia del rock mexicano contemporáneo no se podría contar si no existiera este lugar, que durante años fue casi el único foro de expresión de las bandas mexicanas. Ahí se presentaron por primera vez grupos como Caifanes, La Maldita Vecindad y hasta Enrique Bunbury.\n\nFue inaugurado en 1995 y desde su creación se ha proclamado como un foro abierto para la expresión y la variedad; aquí se puede escuchar desde jazz y blues, hasta cumbias y huapango.\n\nActualmente sigue siendo un espacio que da cabida a lo independiente y lo underground.\n\nConsulta la cartelera de eventos.",
    "external_urls": [
        "http://multiforoalicia.blogspot.mx/",
        "https://www.facebook.com/pages/Multiforo-Alicia/244833642369",
        "https://twitter.com/multiforoalicio?ref_src=twsrc%5Egoogle%7Ctwcamp%5Eserp%7Ctwgr%5Eauthor"
    ],
    "url": "http://cdmxtravel.com/es/lugares/multiforo-alicia.html",
    "destination": "Roma"
}