{
    "name": "Lofft",
    "labels": [
        "Shopping"
    ],
    "price": "",
    "categories": [
        "Mobiliario",
        "diseño e interiorismo"
    ],
    "schedule": [
        "10:00-19:00",
        "10:00-19:00",
        "10:00-19:00",
        "10:00-19:00",
        "10:00-19:00",
        "09:00-15:00",
        "Cerrado"
    ],
    "contact": "+52 (55) 5250 0827",
    "location": {
        "map_url": "http://maps.google.com/maps?daddr=19.3379%2C-99.2002",
        "address": "Cuauhtémoc #158 B4, Col. Tizapán. 01090, San Ángel"
    },
    "description": "Empresa mexicana dedicada a promover el diseño de la más alta calidad tanto nacional como internacional en México. Ofrecen mobiliario, iluminación y diferentes accesorios de interior y exterior.",
    "external_urls": [
        "https://www.facebook.com/lofftmx",
        "https://www.instagram.com/estudiolofft/",
        "https://www.pinterest.com.mx/estudiolofft/",
        "https://twitter.com/ESTUDIOLOFFT",
        "https://www.youtube.com/channel/UCh3P3R5EcGfmYQnZIyCzdvw",
        "https://estudiolofft.com/",
        "mailto:ventas@estudiolofft.com"
    ],
    "url": "http://cdmxtravel.com/es/lugares/lofft.html",
    "destination": "San Ángel"
}