[
    {
        "name": "Museo del Tatuaje",
        "url": "http://cdmxtravel.com/es/lugares/museo-del-tatuaje.html"
    },
    {
        "name": "Jardín Pushkin",
        "url": "http://cdmxtravel.com/es/lugares/jardin-pushkin.html"
    },
    {
        "name": "Centro Cultural Teatro I y II",
        "url": "http://cdmxtravel.com/es/lugares/centro-cultural-teatro-i-y-ii.html"
    },
    {
        "name": "Foro Cultural Lenin",
        "url": "http://cdmxtravel.com/es/lugares/foro-cultural-lenin.html"
    },
    {
        "name": "Yak Casino Pabellón Cuauhtémoc",
        "url": "http://cdmxtravel.com/es/lugares/yak-casino-pabellon-cuauhtemoc.html"
    },
    {
        "name": "Pabellón Cuauhtémoc",
        "url": "http://cdmxtravel.com/es/lugares/pabellon-cuauhtemoc.html"
    },
    {
        "name": "Mercado de Medellín",
        "url": "http://cdmxtravel.com/es/lugares/mercado-de-medellin.html"
    },
    {
        "name": "Plaza Luis Cabrera",
        "url": "http://cdmxtravel.com/es/lugares/plaza-luis-cabrera.html"
    },
    {
        "name": "Mercado Roma",
        "url": "http://cdmxtravel.com/es/lugares/mercado-roma.html"
    },
    {
        "name": "Patrick Miller",
        "url": "http://cdmxtravel.com/es/lugares/patrick-miller.html"
    },
    {
        "name": "Foro Indie Rocks",
        "url": "http://cdmxtravel.com/es/lugares/foro-indie-rocks.html"
    },
    {
        "name": "Plaza Río de Janeiro",
        "url": "http://cdmxtravel.com/es/lugares/plaza-rio-de-janeiro.html"
    },
    {
        "name": "Iglesia Nuestra Señora de Fátima",
        "url": "http://cdmxtravel.com/es/lugares/iglesia-nuestra-senora-de-fatima.html"
    },
    {
        "name": "Casa Lamm",
        "url": "http://cdmxtravel.com/es/lugares/casa-lamm.html"
    },
    {
        "name": "El Rincón Cubano",
        "url": "http://cdmxtravel.com/es/lugares/el-rincon-cubano.html"
    },
    {
        "name": "Museo del Objeto del Objeto (Modo)",
        "url": "http://cdmxtravel.com/es/lugares/museo-del-objeto-del-objeto-modo.html"
    },
    {
        "name": "Huerto Roma Verde",
        "url": "http://cdmxtravel.com/es/lugares/huerto-roma-verde.html"
    },
    {
        "name": "\"El Burro Culto\", un espacio escondido que solo conocen los ...",
        "url": "http://cdmxtravel.com/es/lugares/el-burro-culto-un-espacio-escondido-que-solo-conocen-los-verdaderos-amantes-de-la-literatura.html"
    },
    {
        "name": "Pulquería Los Insurgentes",
        "url": "http://cdmxtravel.com/es/lugares/pulqueria-los-insurgentes.html"
    },
    {
        "name": "Levita Centro de Escalada",
        "url": "http://cdmxtravel.com/es/lugares/levita-centro-de-escalada.html"
    },
    {
        "name": "Enigma Rooms",
        "url": "http://cdmxtravel.com/es/lugares/enigma-rooms.html"
    },
    {
        "name": "Mundo Chocolate (MUCHO)",
        "url": "http://cdmxtravel.com/es/lugares/mundo-chocolate-mucho.html"
    },
    {
        "name": "Sensorama",
        "url": "http://cdmxtravel.com/es/lugares/sensorama.html"
    },
    {
        "name": "Museo Casa del Poeta Ramón López Velarde",
        "url": "http://cdmxtravel.com/es/lugares/museo-casa-del-poeta-ramon-lopez-velarde.html"
    },
    {
        "name": "Multiforo Alicia",
        "url": "http://cdmxtravel.com/es/lugares/multiforo-alicia.html"
    },
    {
        "name": "El Real Under",
        "url": "http://cdmxtravel.com/es/lugares/el-real-under.html"
    },
    {
        "name": "Museo Universitario de Ciencia y Arte (MUCA Roma)",
        "url": "http://cdmxtravel.com/es/lugares/museo-universitario-de-ciencia-y-arte-muca-roma.html"
    },
    {
        "name": "Tráfico Bazar",
        "url": "http://cdmxtravel.com/es/lugares/trafico-bazar.html"
    },
    {
        "name": "Casa Tibet México",
        "url": "http://cdmxtravel.com/es/lugares/casa-tibet-mexico.html"
    },
    {
        "name": "Sinagoga Sefaradí",
        "url": "http://cdmxtravel.com/es/lugares/sinagoga-sefaradi.html"
    },
    {
        "name": "Cinemex Insurgentes",
        "url": "http://cdmxtravel.com/es/lugares/cinemex-insurgentes.html"
    },
    {
        "name": "Parque Ramón López Velarde",
        "url": "http://cdmxtravel.com/es/lugares/parque-ramon-lopez-velarde.html"
    },
    {
        "name": "Salón San Luis",
        "url": "http://cdmxtravel.com/es/lugares/salon-san-luis.html"
    },
    {
        "name": "Apotheke",
        "url": "http://cdmxtravel.com/es/lugares/apotheke.html"
    },
    {
        "name": "Pulquería La Nuclear",
        "url": "http://cdmxtravel.com/es/lugares/pulqueria-la-nuclear.html"
    },
    {
        "name": "Hoja de Menta",
        "url": "http://cdmxtravel.com/es/lugares/hoja-de-menta.html"
    },
    {
        "name": "Salón de la Plástica Mexicana",
        "url": "http://cdmxtravel.com/es/lugares/salon-de-la-plastica-mexicana.html"
    },
    {
        "name": "Plaza Insurgentes",
        "url": "http://cdmxtravel.com/es/lugares/plaza-insurgentes.html"
    },
    {
        "name": "Plaza Romita",
        "url": "http://cdmxtravel.com/es/lugares/plaza-romita.html"
    },
    {
        "name": "Modernismo",
        "url": "http://cdmxtravel.com/es/lugares/modernismo.html"
    },
    {
        "name": "Casa de la Cultura de India",
        "url": "http://cdmxtravel.com/es/lugares/casa-de-la-cultura-de-india.html"
    },
    {
        "name": "Mama Rumba Roma",
        "url": "http://cdmxtravel.com/es/lugares/mama-rumba-roma.html"
    },
    {
        "name": "Cine Tonalá",
        "url": "http://cdmxtravel.com/es/lugares/cine-tonala.html"
    },
    {
        "name": "Cinemex Centro Telmex",
        "url": "http://cdmxtravel.com/es/lugares/cinemex-centro-telmex.html"
    },
    {
        "name": "Huerto Romita",
        "url": "http://cdmxtravel.com/es/lugares/huerto-romita.html"
    },
    {
        "name": "La Nacional Roma",
        "url": "http://cdmxtravel.com/es/lugares/la-nacional-roma.html"
    },
    {
        "name": "El Depósito Roma",
        "url": "http://cdmxtravel.com/es/lugares/el-deposito-roma.html"
    },
    {
        "name": "Metro Huerto",
        "url": "http://cdmxtravel.com/es/lugares/metro-huerto.html"
    },
    {
        "name": "Balmori Roofbar",
        "url": "http://cdmxtravel.com/es/lugares/balmori-roofbar.html"
    },
    {
        "name": "Trouvé",
        "url": "http://cdmxtravel.com/es/lugares/trouve.html"
    },
    {
        "name": "Melody Nelson Piano Bar",
        "url": "http://cdmxtravel.com/es/lugares/melody-nelson-piano-bar.html"
    },
    {
        "name": "Goethe Institut Mexiko",
        "url": "http://cdmxtravel.com/es/lugares/goethe-institut-mexiko.html"
    },
    {
        "name": "Dr. York",
        "url": "http://cdmxtravel.com/es/lugares/dr-york.html"
    },
    {
        "name": "La Mil Amores Mezcalería",
        "url": "http://cdmxtravel.com/es/lugares/la-mil-amores-mezcaleria.html"
    },
    {
        "name": "Foro del Tejedor",
        "url": "http://cdmxtravel.com/es/lugares/foro-del-tejedor.html"
    },
    {
        "name": "Tlachiquero",
        "url": "http://cdmxtravel.com/es/lugares/tlachiquero.html"
    },
    {
        "name": "Barón Rojo Chapultepec",
        "url": "http://cdmxtravel.com/es/lugares/baron-rojo-chapultepec.html"
    },
    {
        "name": "Tribu Bazar de Talento Creativo",
        "url": "http://cdmxtravel.com/es/lugares/tribu-bazar-de-talento-creativo.html"
    },
    {
        "name": "La Flor del Son",
        "url": "http://cdmxtravel.com/es/lugares/la-flor-del-son.html"
    },
    {
        "name": "Centro Budista de la Ciudad de México Colonia Roma",
        "url": "http://cdmxtravel.com/es/lugares/centro-budista-de-la-ciudad-de-mexico-colonia-roma.html"
    },
    {
        "name": "Galería Fifty24Mx",
        "url": "http://cdmxtravel.com/es/lugares/galeria-fifty24mx.html"
    },
    {
        "name": "Catedral Ortodoxa de San Jorge",
        "url": "http://cdmxtravel.com/es/lugares/catedral-ortodoxa-de-san-jorge.html"
    },
    {
        "name": "Naked Boutique",
        "url": "http://cdmxtravel.com/es/lugares/naked-boutique.html"
    },
    {
        "name": "La Botica Roma",
        "url": "http://cdmxtravel.com/es/lugares/la-botica-roma.html"
    },
    {
        "name": "Cultura Colectiva",
        "url": "http://cdmxtravel.com/es/lugares/cultura-colectiva.html"
    },
    {
        "name": "La Teatrería",
        "url": "http://cdmxtravel.com/es/lugares/la-teatreria.html"
    },
    {
        "name": "LIGA, Espacio para Arquitectura",
        "url": "http://cdmxtravel.com/es/lugares/liga-espacio-para-arquitectura.html"
    },
    {
        "name": "Lucille",
        "url": "http://cdmxtravel.com/es/lugares/lucille.html"
    },
    {
        "name": "Foro del Centro Cultural El Foco",
        "url": "http://cdmxtravel.com/es/lugares/foro-del-centro-cultural-el-foco.html"
    },
    {
        "name": "Casa Universitaria del Libro",
        "url": "http://cdmxtravel.com/es/lugares/casa-universitaria-del-libro.html"
    },
    {
        "name": "Aguafuerte Galería",
        "url": "http://cdmxtravel.com/es/lugares/aguafuerte-galeria.html"
    },
    {
        "name": "Delirio Colima",
        "url": "http://cdmxtravel.com/es/lugares/delirio-colima.html"
    },
    {
        "name": "Bet Hakneset Monte Sinai Querétaro",
        "url": "http://cdmxtravel.com/es/lugares/bet-hakneset-monte-sinai-queretaro.html"
    },
    {
        "name": "Carla Fernández Roma",
        "url": "http://cdmxtravel.com/es/lugares/carla-fernandez-roma.html"
    },
    {
        "name": "Galería OMR",
        "url": "http://cdmxtravel.com/es/lugares/galeria-omr.html"
    },
    {
        "name": "Casa de Cultura Romita",
        "url": "http://cdmxtravel.com/es/lugares/casa-de-cultura-romita.html"
    },
    {
        "name": "Eve Club Condesa",
        "url": "http://cdmxtravel.com/es/lugares/eve-club-condesa.html"
    },
    {
        "name": "Tienda Marca Chiapas",
        "url": "http://cdmxtravel.com/es/lugares/tienda-marca-chiapas.html"
    },
    {
        "name": "M.N. Roy",
        "url": "http://cdmxtravel.com/es/lugares/m-n-roy.html"
    },
    {
        "name": "Casa de Cultura Jesús Romero Flores",
        "url": "http://cdmxtravel.com/es/lugares/casa-de-cultura-jesus-romero-flores.html"
    },
    {
        "name": "Centro Cultural de la Diversidad",
        "url": "http://cdmxtravel.com/es/lugares/centro-cultural-de-la-diversidad.html"
    },
    {
        "name": "La Bonne Chance Spa",
        "url": "http://cdmxtravel.com/es/lugares/la-bonne-chance-spa.html"
    },
    {
        "name": "Mercado Roma, entre lo tradicional y lo trendy",
        "url": "http://cdmxtravel.com/es/lugares/mercado-roma-entre-lo-tradicional-y-lo-trendy.html"
    },
    {
        "name": "Aurora",
        "url": "http://cdmxtravel.com/es/lugares/aurora.html"
    },
    {
        "name": "CC186",
        "url": "http://cdmxtravel.com/es/lugares/cc186.html"
    },
    {
        "name": "Casa de Cultura Foro 37",
        "url": "http://cdmxtravel.com/es/lugares/casa-de-cultura-foro-37.html"
    },
    {
        "name": "La Graciela: Taller de cerveza",
        "url": "http://cdmxtravel.com/es/lugares/la-graciela-taller-de-cerveza.html"
    },
    {
        "name": "Parroquia Verbo Encarnado y Sagrada Familia",
        "url": "http://cdmxtravel.com/es/lugares/parroquia-verbo-encarnado-y-sagrada-familia.html"
    },
    {
        "name": "Multiforo 246",
        "url": "http://cdmxtravel.com/es/lugares/multiforo-246.html"
    },
    {
        "name": "Elektrosundays by Hibrido",
        "url": "http://cdmxtravel.com/es/lugares/elektrosundays-by-hibrido.html"
    },
    {
        "name": "Centro Cultural El Foco",
        "url": "http://cdmxtravel.com/es/lugares/centro-cultural-el-foco.html"
    },
    {
        "name": "Garash Galería",
        "url": "http://cdmxtravel.com/es/lugares/garash-galeria.html"
    },
    {
        "name": "Vintage Hoe",
        "url": "http://cdmxtravel.com/es/lugares/vintage-hoe.html"
    },
    {
        "name": "Cinemex Cuauhtémoc",
        "url": "http://cdmxtravel.com/es/lugares/cinemex-cuauhtemoc.html"
    },
    {
        "name": "Arca México",
        "url": "http://cdmxtravel.com/es/lugares/arca-mexico.html"
    },
    {
        "name": "Galería Toca",
        "url": "http://cdmxtravel.com/es/lugares/galeria-toca.html"
    },
    {
        "name": "Péndulo Roma",
        "url": "http://cdmxtravel.com/es/lugares/pendulo-roma.html"
    },
    {
        "name": "Galería de Arte Machete",
        "url": "http://cdmxtravel.com/es/lugares/galeria-de-arte-machete.html"
    },
    {
        "name": "Casa Constanza",
        "url": "http://cdmxtravel.com/es/lugares/casa-constanza.html"
    },
    {
        "name": "Gimnasio de Arte y Cultura",
        "url": "http://cdmxtravel.com/es/lugares/gimnasio-de-arte-y-cultura.html"
    },
    {
        "name": "Galería Proyectos Monclova",
        "url": "http://cdmxtravel.com/es/lugares/galeria-proyectos-monclova.html"
    },
    {
        "name": "Limantour Roma",
        "url": "http://cdmxtravel.com/es/lugares/limantour-roma.html"
    },
    {
        "name": "Romelia",
        "url": "http://cdmxtravel.com/es/lugares/romelia.html"
    },
    {
        "name": "El Palenquito",
        "url": "http://cdmxtravel.com/es/lugares/el-palenquito.html"
    },
    {
        "name": "Atelier Central",
        "url": "http://cdmxtravel.com/es/lugares/atelier-central.html"
    },
    {
        "name": "Galería Traeger and Pinto",
        "url": "http://cdmxtravel.com/es/lugares/galeria-traeger-and-pinto.html"
    },
    {
        "name": "Casa Jacaranda",
        "url": "http://cdmxtravel.com/es/lugares/casa-jacaranda.html"
    },
    {
        "name": "La Chicha Orizaba",
        "url": "http://cdmxtravel.com/es/lugares/la-chicha-orizaba.html"
    },
    {
        "name": "180o Grados",
        "url": "http://cdmxtravel.com/es/lugares/180-grados.html"
    },
    {
        "name": "Rococo",
        "url": "http://cdmxtravel.com/es/lugares/rococo.html"
    },
    {
        "name": "Garros Galerías",
        "url": "http://cdmxtravel.com/es/lugares/garros-galerias.html"
    },
    {
        "name": "Galería Arróniz Arte Contemporáneo",
        "url": "http://cdmxtravel.com/es/lugares/galeria-arroniz-arte-contemporaneo.html"
    },
    {
        "name": "Mercado el 100",
        "url": "http://cdmxtravel.com/es/lugares/mercado-el-100.html"
    },
    {
        "name": "Vértigo Galería",
        "url": "http://cdmxtravel.com/es/lugares/vertigo-galeria.html"
    },
    {
        "name": "Félix",
        "url": "http://cdmxtravel.com/es/lugares/felix.html"
    },
    {
        "name": "Avocet Jewelry",
        "url": "http://cdmxtravel.com/es/lugares/avocet-jewelry.html"
    },
    {
        "name": "CIB Natural Spa",
        "url": "http://cdmxtravel.com/es/lugares/cib-natural-spa.html"
    },
    {
        "name": "La Canasta",
        "url": "http://cdmxtravel.com/es/lugares/la-canasta.html"
    },
    {
        "name": "Biergarten",
        "url": "http://cdmxtravel.com/es/lugares/biergarten.html"
    },
    {
        "name": "Dime",
        "url": "http://cdmxtravel.com/es/lugares/dime.html"
    },
    {
        "name": "Covadonga",
        "url": "http://cdmxtravel.com/es/lugares/covadonga.html"
    },
    {
        "name": "Galería Hazme el Milagrito",
        "url": "http://cdmxtravel.com/es/lugares/galeria-hazme-el-milagrito.html"
    },
    {
        "name": "Espacio Arterial",
        "url": "http://cdmxtravel.com/es/lugares/espacio-arterial.html"
    },
    {
        "name": "Maison Artemisia",
        "url": "http://cdmxtravel.com/es/lugares/maison-artemisia.html"
    },
    {
        "name": "Garage Art",
        "url": "http://cdmxtravel.com/es/lugares/garage-art.html"
    },
    {
        "name": "Huertos Concretos",
        "url": "http://cdmxtravel.com/es/lugares/huertos-concretos.html"
    },
    {
        "name": "Lunchstudio",
        "url": "http://cdmxtravel.com/es/lugares/lunchstudio.html"
    },
    {
        "name": "Cantina Riviera del Sur",
        "url": "http://cdmxtravel.com/es/lugares/cantina-riviera-del-sur.html"
    },
    {
        "name": "Las Musas de PapáSibarita",
        "url": "http://cdmxtravel.com/es/lugares/las-musas-de-papasibarita.html"
    },
    {
        "name": "Tienda de Artesanías IAIP",
        "url": "http://cdmxtravel.com/es/lugares/tienda-de-artesanias-iaip.html"
    },
    {
        "name": "Más de 100 años del Mercado de Medellín",
        "url": "http://cdmxtravel.com/es/lugares/mas-de-100-anos-del-mercado-de-medellin.html"
    },
    {
        "name": "Or Tiferet",
        "url": "http://cdmxtravel.com/es/lugares/or-tiferet.html"
    },
    {
        "name": "Si Mon Bar",
        "url": "http://cdmxtravel.com/es/lugares/si-mon-bar.html"
    },
    {
        "name": "Miranda & Próspero Bar",
        "url": "http://cdmxtravel.com/es/lugares/miranda-prospero-bar.html"
    },
    {
        "name": "Galería Massimo Audiello",
        "url": "http://cdmxtravel.com/es/lugares/galeria-massimo-audiello.html"
    },
    {
        "name": "Supra Roma",
        "url": "http://cdmxtravel.com/es/lugares/supra-roma.html"
    },
    {
        "name": "Casa Museo Guillermo Tovar de Teresa",
        "url": "http://cdmxtravel.com/es/lugares/casa-museo-guillermo-tovar-de-teresa.html"
    },
    {
        "name": "Pong Bar Condesa",
        "url": "http://cdmxtravel.com/es/lugares/pong-bar-condesa.html"
    },
    {
        "name": "Caverna Karaoke",
        "url": "http://cdmxtravel.com/es/lugares/caverna-karaoke.html"
    },
    {
        "name": "Museo Casa Estudio de Leonora Carrington",
        "url": "http://cdmxtravel.com/es/lugares/museo-casa-estudio-de-leonora-carrington.html"
    },
    {
        "name": "Galería Klandestina",
        "url": "http://cdmxtravel.com/es/lugares/galeria-klandestina.html"
    },
    {
        "name": "The Dog House Pub",
        "url": "http://cdmxtravel.com/es/lugares/the-dog-house-pub.html"
    },
    {
        "name": "Museo del Padre Pro",
        "url": "http://cdmxtravel.com/es/lugares/museo-del-padre-pro.html"
    },
    {
        "name": "Terraza Roma",
        "url": "http://cdmxtravel.com/es/lugares/terraza-roma.html"
    },
    {
        "name": "Pan y Circo",
        "url": "http://cdmxtravel.com/es/lugares/pan-y-circo.html"
    },
    {
        "name": "Foro Rock Bizarro",
        "url": "http://cdmxtravel.com/es/lugares/foro-rock-bizarro.html"
    },
    {
        "name": "Ángulo Cero",
        "url": "http://cdmxtravel.com/es/lugares/angulo-cero.html"
    },
    {
        "name": "Departamento",
        "url": "http://cdmxtravel.com/es/lugares/departamento.html"
    },
    {
        "name": "Can Can",
        "url": "http://cdmxtravel.com/es/lugares/can-can.html"
    }
]