{
    "name": "Kinky bar",
    "labels": [
        "Vive la noche"
    ],
    "price": "Desde $200 MXN",
    "categories": [
        "Bar",
        "Karaoke",
        "Gay bar"
    ],
    "schedule": [
        "Cerrado",
        "Cerrado",
        "22:00-03:00",
        "22:00-03:00",
        "22:00-03:00",
        "22:00-03:00",
        "Cerrado"
    ],
    "contact": "(55) 5514 4920",
    "location": {
        "map_url": "http://maps.google.com/maps?daddr=19.4272%2C-99.1662",
        "address": "Amberes #1, Col. Juárez. 06600, Reforma-Zona Rosa"
    },
    "description": "Antes se llamaba Lipstick. El kinky bar está dividido en tres pisos, el primero es estilo cantina para copear con los amigos y se llama La Chipocluda; el segundo es un karaoke; y el tercero, la Gran Terraza con vistas al Paseo de la Reforma y el Ángel de la Independencia.",
    "external_urls": [
        "https://www.facebook.com/KINKYbar",
        "https://www.instagram.com/kinkybar/",
        "https://www.tripadvisor.com.mx/Attraction_Review-g150800-d6503236-Reviews-Kinky_Bar-Mexico_City_Central_Mexico_and_Gulf_Coast.html",
        "https://twitter.com/KINKY_bar?original_referer=http%3A%2F%2Fwww.kinkybar.com.mx%2F&profile_id=272031929&tw_i=475535576851316736&tw_p=embeddedtimeline&tw_w=392752972095967233",
        "http://www.kinkybar.com.mx/"
    ],
    "url": "http://cdmxtravel.com/es/lugares/kinky-bar.html",
    "destination": "Reforma-Zona Rosa"
}