{
    "name": "Basílica de Santa María de Guadalupe",
    "labels": [
        "Museos",
        "México monumental",
        "Por recinto"
    ],
    "price": "Gratuito",
    "categories": [
        "Arte",
        "Recintos religiosos",
        "Con eventos"
    ],
    "schedule": [
        "06:00-21:00",
        "06:00-21:00",
        "06:00-21:00",
        "06:00-21:00",
        "06:00-21:00",
        "06:00-21:00",
        "06:00-21:00"
    ],
    "contact": "(55) 5118 0500",
    "location": {
        "map_url": "http://maps.google.com/maps?daddr=19.4849%2C-99.1179",
        "address": "Plaza de las Américas #1, Col. Villa de Guadalupe. 07050, Villa de Guadalupe"
    },
    "description": "En la época Prehispánica en el Cerro del Tepeyac se adoraba a la diosa Chalchiuhtlicue, Matlalcueye o Tonantzin, la madre de todos los dioses. Cuando Hernán Cortés llegó a Tenochtitlán, el capitán Gonzalo Sandoval acampó en ese sitio religioso, marcando el inicio de la conquista espiritual de los mexicas.\n\nLa tradición mexicana indica que la Virgen de Guadalupe se apareció por primera vez a Juan Diego Cuauhtlatoatzin el 9 de diciembre de 1531. Ella se le apareció en cuatro ocasiones al indígena en el Cerro del Tepeyac. La virgen le pidió a Juan Diego en su cuarta aparición que colectara rosas en el ayate para llevarlas a Fray Juan de Zumárraga con la finalidad de que en ese sitio se le erigiera un templo, marcando el inicio de la devoción por la guadalupana.\n\nLa guadalupana se apareció en el ayate del indígena. La imagen es la prueba del milagro y ha sido estudiada por muchos científicos para constatarlo. La Basílica de Santa María de Guadalupe es el segundo lugar de culto más visitado en el mundo con 30 millones de feligreses y 10 millones de turistas nacionales y extranjeros al año. El 12 de diciembre es la fecha en la que se celebra a la virgen morena.\n\nLa Basílica es una construcción reciente que data de 1974 y estuvo a cargo de los arquitectos José Luis Benlliure, Pedro Ramírez Vázquez, Alejandro Schoenhofer, fray Gabriel Chávez de la Mora y Javier García Lascuráin. Es circular y libre de apoyos, lo que permite ver la imagen de la Virgen de Guadalupe desde cualquier punto de su interior, en el cual caben 10 mil personas.  Posteriormente se construyó una nueva edificación sustituyó a la antigua basílica, hoy el Templo expiatorio de San Cristo Rey, que durante los siglos sufrió daños y severo hundimiento, además que no era capaz de albergar la cantidad de peregrinos que llegan.La Villa de Guadalupe comprende un complejo de recintos religiosos aparte de la Basílica como la Capilla de Indios, Capilla del Cerrito, el Cementerio del Tepeyac, Capilla del Pocito, el Templo y antiguo convento de las Capuchinas, el mencionado Templo Expiatorio a Cristo Rey y la Plaza Mariana.\n\nMostrar todo ›Ocultar ›",
    "external_urls": [
        "https://www.facebook.com/INBGuadalupe",
        "https://www.instagram.com/INBGuadalupe/",
        "https://www.tripadvisor.com.mx/Attraction_Review-g150800-d153180-Reviews-Basilica_de_Santa_Maria_de_Guadalupe-Mexico_City_Central_Mexico_and_Gulf_Coast.html",
        "https://twitter.com/INBGuadalupe",
        "https://www.youtube.com/user/BasilicadeGuadalupe",
        "http://basilica.mxv.mx/web1/-home/index.html"
    ],
    "url": "http://cdmxtravel.com/es/lugares/basilica-de-santa-maria-de-guadalupe.html",
    "destination": "Villa de Guadalupe"
}