{
    "name": "\"Katharsis\" de José Clemente Orozco",
    "labels": [
        "Museos",
        "México monumental"
    ],
    "price": "Desde $45 MXN",
    "categories": [
        "Arte",
        "Murales"
    ],
    "schedule": [
        "Cerrado",
        "10:00-17:30",
        "10:00-17:30",
        "10:00-17:30",
        "10:00-17:30",
        "10:00-17:30",
        "10:00-17:30"
    ],
    "contact": "+52 (55) 5512 2593 ext. 1305",
    "location": {
        "map_url": "http://maps.google.com/maps?daddr=19.4353%2C-99.1412",
        "address": "Juárez #1, Col. Centro.  06050, Alameda"
    },
    "description": "Una de las obras más reconocidas del muralista José Clemente Orozco. Se encuentra en el Palacio de Bellas Artes, y lo que expresa es el odio por la crueldad y corrupción de la sociedad moderna. En general se puede observar la historia del país y el mundo, pero haciendo énfasis en el individuo y no en la sociedad.\n\nLa idea final es que a través de la destrucción podría construirse un mundo renovado.",
    "external_urls": [
        "http://es-es.facebook.com/palaciobellasartesoficial",
        "https://www.tripadvisor.com.br/LocationPhotoDirectLink-g150800-d153969-i118140273-Palacio_de_Bellas_Artes-Mexico_City_Central_Mexico_and_Gulf_Coast.html",
        "http://twitter.com/PalacioOficial",
        "http://palacio.bellasartes.gob.mx",
        "mailto:gerenciapba@inba.gob.mx"
    ],
    "url": "http://cdmxtravel.com/es/lugares/katharsis-de-jose-clemente-orozco.html",
    "destination": "Alameda"
}