{
    "name": "Foro Cultural Quetzalcóatl",
    "labels": [
        "Museos",
        "Cultura todos los días",
        "En familia",
        "Por recinto"
    ],
    "price": "",
    "categories": [
        "Arte",
        "Centros culturales",
        "Centros de entretenimiento familiares",
        "Con eventos"
    ],
    "schedule": [
        "08:00-21:00",
        "08:00-21:00",
        "08:00-21:00",
        "08:00-21:00",
        "08:00-21:00",
        "09:00-14:00",
        "Cerrado"
    ],
    "contact": "(55) 5334 0600 ext. 3629",
    "location": {
        "map_url": "http://maps.google.com/maps?daddr=19.2651%2C-99.1098",
        "address": "Av. Guadalupe I. Ramírez #4, Barrio El Rosario. 16070, Xochimilco"
    },
    "description": "En este inmueble se localizan las oficinas de la delegación, cuenta con salas dedicadas a exposiciones temporales y auditorios para llevar a cabo espectáculos culturales y salas para talleres.\n\nFue construido durante 1969, con la finalidad de ser un lugar común para la recreación y la cultura de los habitantes de Xochimilco.",
    "external_urls": [
        "https://es-la.facebook.com/pages/category/Community-Organization/Foro-Cultural-Quetzalpilli-549750135061071/",
        "https://sic.cultura.gob.mx/ficha.php?table=centro_cultural&table_id=796"
    ],
    "url": "http://cdmxtravel.com/es/lugares/foro-cultural-quetzalcoatl.html",
    "destination": "Xochimilco"
}