{
    "name": "Archivo Histórico de la Ciudad de México (Casa de los Condes de Heras)",
    "labels": [
        "México monumental",
        "Cultura todos los días",
        "Por recinto"
    ],
    "price": "Gratuito",
    "categories": [
        "Casas históricas",
        "Bibliotecas",
        "Con eventos"
    ],
    "schedule": [
        "08:30-18:00",
        "08:30-18:00",
        "08:30-18:00",
        "08:30-18:00",
        "08:30-15:00",
        "Cerrado",
        "Cerrado"
    ],
    "contact": "(55) 5510 8582",
    "location": {
        "map_url": "http://maps.google.com/maps?daddr=19.4361%2C-99.1361",
        "address": "República de Chile #8, Col. Centro. 06010, Centro Histórico"
    },
    "description": "Fue la casa del conde de Heras y Soto a inicios del siglo XIX, quien fue uno de los firmantes del Acta de Independencia de 1821. La casa está integrada por dos edificaciones, ambas con patio principal y con una sola fachada. Actualmente resguarda el archivo histórico de las administraciones públicas que han gobernado en la Ciudad de México desde 1524. Los documentos incluyen legajos rescatados por el escritor Carlos de Sigüenza y Góngora del incendio del Palacio Virreinal durante un motín en 1692.\n\nLos fondos están divididos en Actas de cabildo, ayuntamiento, municipalidades, gobierno de la Ciudad, departamento del D.F., cárceles y el Archivo Esperanza Iris. También hay una planoteca, un centro de la imagen, carteles e ilustraciones y una biblioteca con libros de 1696 a 2007.\n\n",
    "external_urls": [
        "https://www.facebook.com/pages/Archivo-Hist%C3%B3rico-del-Distrito-Federal-Carlos-de-Sig%C3%BCenza-y-G%C3%B3ngora/270104126344785?sk=timeline",
        "http://www.cultura.cdmx.gob.mx/recintos/archivo-historico",
        "mailto:archivohistorico01@yahoo.com.mx"
    ],
    "url": "http://cdmxtravel.com/es/lugares/archivo-historico-de-la-ciudad-de-mexico-casa-de-los-condes-de-heras.html",
    "destination": "Centro Histórico"
}