{
    "name": "Casa de Cultura Jesús Romero Flores",
    "labels": [
        "Cultura todos los días"
    ],
    "price": "Gratuito",
    "categories": [
        "Casas de cultura",
        "Centros culturales"
    ],
    "schedule": [
        "08:00-20:00",
        "08:00-20:00",
        "08:00-20:00",
        "08:00-20:00",
        "08:00-20:00",
        "08:00-20:00",
        "Cerrado"
    ],
    "contact": "+52 (55) 4335 8130",
    "location": {
        "map_url": "http://maps.google.com/maps?daddr=19.4037%2C-99.1702",
        "address": "Culiacán #103, Col. Hipódromo. 06100, Roma"
    },
    "description": "Una casa de cultura para la comunidad de la Roma-Condesa que ofrece actividades culturales como función con títeres, exposiciones colectivas e individuales de arte, recitales, concursos de disfraces y demás para divertirse en un ambiente totalmente familiar.",
    "external_urls": [
        "https://es-la.facebook.com/CCulturaJRF/",
        "https://alcaldiacuauhtemoc.mx/descubre/casa-de-cultura-profr-jesus-romero-flores/",
        "mailto:casadeculturajrf@hotmail.com"
    ],
    "url": "http://cdmxtravel.com/es/lugares/casa-de-cultura-jesus-romero-flores.html",
    "destination": "Roma"
}