{
    "name": "\"El canto y la música\" de Rufino Tamayo",
    "labels": [
        "México monumental"
    ],
    "price": "Gratuito",
    "categories": [
        "Murales"
    ],
    "schedule": [
        "09:00-17:00",
        "09:00-17:00",
        "09:00-17:00",
        "09:00-17:00",
        "09:00-17:00",
        "Cerrado",
        "Cerrado"
    ],
    "contact": "+52 (55) 5522 4162",
    "location": {
        "map_url": "http://maps.google.com/maps?daddr=19.4335%2C-99.13",
        "address": "Moneda #16, Col. Centro.  06060, Centro Histórico"
    },
    "description": "Este mural no sólo es uno de los primeros murales de Tamayo, sino que marca el inicio de una nueva etapa en su vida, ya que fue en la Escuela Nacional de Música donde conoció a la que se convertiría en su esposa: la pianista Olga Flores.\n\nA unos pasos del Museo Nacional de las Culturas, hoy se ubica la Subdirección de Laboratorios y Apoyo Académico, que era donde se encontraba dicha escuela y en donde se creó este mural. Con el pasar de los años se fue deteriorando, pero en 2011 se concluyó la restauración de éste y otro fresco que se dice fueron las primeras obras del oaxaqueño.",
    "external_urls": null,
    "url": "http://cdmxtravel.com/es/lugares/el-canto-y-la-musica-de-rufino-tamayo.html",
    "destination": "Centro Histórico"
}