{
    "name": "Mónica Barajas Hernández",
    "labels": [
        "Puro sabor local"
    ],
    "price": "",
    "categories": [
        "Artesanías"
    ],
    "schedule": [
        "11:00-19:00",
        "11:00-19:00",
        "11:00-19:00",
        "11:00-19:00",
        "11:00-19:00",
        "11:00-15:00",
        "11:00-15:00"
    ],
    "contact": "+52 (55) 5866 0244",
    "location": {
        "map_url": "http://maps.google.com/maps?daddr=19.2964%2C-99.0221",
        "address": "Priv. Acueducto #8, Col. Zacatenco. 13440, Xochimilco"
    },
    "description": "Agrupa a artesanos en orfebrería, mimbre y barro, con diseños únicos y sobre pedido.",
    "external_urls": [
        "https://www.facebook.com/arzolike/about",
        "http://www.arzolike.com.mx/"
    ],
    "url": "http://cdmxtravel.com/es/lugares/monica-barajas-hernandez.html",
    "destination": "Xochimilco"
}