{
    "name": "El Rincón Cubano",
    "labels": [
        "Vive la noche"
    ],
    "price": "Desde $200 MXN",
    "categories": [
        "Antro",
        "Bar"
    ],
    "schedule": [
        "Cerrado",
        "Cerrado",
        "Cerrado",
        "08:00-02:00",
        "20:00-03:00",
        "20:00-03:00",
        "14:00-03:00"
    ],
    "contact": "+52 (55) 5264 0549",
    "location": {
        "map_url": "http://maps.google.com/maps?daddr=19.4139%2C-99.1657",
        "address": "Querétaro # 300, Col. Roma. 06700, Roma"
    },
    "description": "Centro nocturno con el sabor y la música de Cuba, ideal para bailar salsa y ritmos caribeños. Además ofrecen shows de bailarinas y música en vivo con grupos espectaculares.\n\n",
    "external_urls": [
        "https://www.facebook.com/face.elrinconcubano",
        "mailto:elrinconcubanodf@gmail.com "
    ],
    "url": "http://cdmxtravel.com/es/lugares/el-rincon-cubano.html",
    "destination": "Roma"
}