{
    "name": "Capilla de San Simón y San Judas Tadeo",
    "labels": [
        "México monumental"
    ],
    "price": "",
    "categories": [
        "Recintos religiosos"
    ],
    "schedule": [
        "16:00-18:00",
        "16:00-18:00",
        "16:00-18:00",
        "16:00-18:00",
        "16:00-18:00",
        "16:00-18:00",
        "16:00-18:00"
    ],
    "contact": "+52 (55) 5561 0453",
    "location": {
        "map_url": "http://maps.google.com/maps?daddr=19.4831%2C-99.1869",
        "address": "Zaragoza s/n, Col. Centro de Azcapotzalco. 02000, Azcapotzalco"
    },
    "description": "Es el templo de la orden de los dominicos más antiguo de Azcapotzalco. Tiene una imponente cúpula blanca que contrasta con el resto de la construcción de piedra sin pintura y un amplio patio con áreas verdes.",
    "external_urls": null,
    "url": "http://cdmxtravel.com/es/lugares/capilla-de-san-simon-y-san-judas-tadeo.html",
    "destination": "Azcapotzalco"
}