{
    "name": "Arca México",
    "labels": [
        "Cultura todos los días"
    ],
    "price": "Gratuito",
    "categories": [
        "Galerías"
    ],
    "schedule": [
        "10:00-19:00",
        "10:00-19:00",
        "10:00-19:00",
        "10:00-19:00",
        "10:00-19:00",
        "10:00-19:00",
        "Cerrado"
    ],
    "contact": "+52 (55) 5207 5412",
    "location": {
        "map_url": "http://maps.google.com/maps?daddr=19.4176%2C-99.165",
        "address": "Insurgentes Sur #257 int. C, Col. Roma Norte. 06700, Roma"
    },
    "description": "La galería exhibe arte urbano e ilustración de artistas nacionales e internacionales como Acamonchi, Dabiel J. Valadez, Steve Javier y Belin. Tiene un proyecto denominado Agencia de Artes Visuales, para particulares que buscan intervenir algún muro. En sus espacios ofrece experiencias educativas, talleres, cursos como el de retrato digital o el de dibujo como base creativa, enfocados en el público general e impartidos por invitados especiales como diseñadores e ilustradores.",
    "external_urls": [
        "https://www.facebook.com/arcamx.galeria?_rdr=p",
        "https://instagram.com/arca_mx/",
        "https://twitter.com/arca_mx",
        "https://www.youtube.com/channel/UCD1Wdtch1kPMydlx6aPY7gg",
        "http://arcamx.com/",
        "mailto:info@arcamx.com"
    ],
    "url": "http://cdmxtravel.com/es/lugares/arca-mexico.html",
    "destination": "Roma"
}