{
    "name": "Museo de la Basílica de Guadalupe",
    "labels": [
        "Museos"
    ],
    "price": "Desde $5 MXN",
    "categories": [
        "Arte"
    ],
    "schedule": [
        "Cerrado",
        "10:00-18:00",
        "10:00-18:00",
        "10:00-18:00",
        "10:00-18:00",
        "10:00-18:00",
        "10:00-18:00"
    ],
    "contact": "5577 6022 ext. 175",
    "location": {
        "map_url": "http://maps.google.com/maps?daddr=19.4852%2C-99.1165",
        "address": "Plaza de las Américas #1, Col. Villa de Guadalupe. 07050, Villa de Guadalupe"
    },
    "description": "El Museo de la Basílica de Guadalupe es una institución privada que tiene el compromiso de dar a conocer una colección de arte religioso y sacro católico, sin olvidar su importancia como parte del patrimonio cultural del pueblo mexicano.\nSu labor se centra en conservar, estudiar y difundir cerca de cuatro mil bienes culturales resguardados por la Insigne y Nacional Basílica de Guadalupe: lienzos, láminas, esculturas en mármol y marfil, estandartes, libros y mucho más.\n\nCabe destacar que este recinto cuenta con el mayor acervo, a nivel nacional, en temáticas guadalupana y mariana, en su gran mayoría son un referente en el arte pictórico novohispano. También es importante el trabajo de artistas como Matías de Arteaga y Alfaro, Cristóbal de Villalpando, Nicolás Rodríguez Juárez, José de Ibarra, Miguel Cabrera, entre otros.",
    "external_urls": [
        "https://www.facebook.com/museodelabasilica/",
        "mailto:museo@basilicadeguadalupe.mx"
    ],
    "url": "http://cdmxtravel.com/es/lugares/museo-de-la-basilica-de-guadalupe.html",
    "destination": "Villa de Guadalupe"
}