{
    "name": "Carla Fernández Roma",
    "labels": [
        "Shopping"
    ],
    "price": "",
    "categories": [
        "Moda"
    ],
    "schedule": [
        "11:00-20:00",
        "11:00-20:00",
        "11:00-20:00",
        "11:00-20:00",
        "11:00-20:00",
        "11:00-20:00",
        "11:00-18:00"
    ],
    "contact": "+52 (55)  55 4216 3389",
    "location": {
        "map_url": "http://maps.google.com/maps?daddr=19.4171%2C-99.1642",
        "address": "Álvaro Obregón #200, Col. Roma. 06700, Roma"
    },
    "description": "La diseñadora internacional ha cuidado al máximo detalle cada parte de la tienda. En los aparadores puedes encontrar algunos de sus famosos diseños. Sus prendas están inspiradas en la riqueza del textil de México y en la confección indígena, así como en el uso del cuadrado y el rectángulo.",
    "external_urls": [
        "https://www.facebook.com/carlafernandezMX/timeline",
        "https://instagram.com/carlafernandezmx",
        "https://twitter.com/carlafdesign",
        "http://carlafernandez.com/es/"
    ],
    "url": "http://cdmxtravel.com/es/lugares/carla-fernandez-roma.html",
    "destination": "Roma"
}