{
    "name": "Museo de Historia de Tlalpan",
    "labels": [
        "Museos",
        "México monumental"
    ],
    "price": "Gratuito",
    "categories": [
        "Arte",
        "Casas históricas"
    ],
    "schedule": [
        "Cerrado",
        "09:00-18:00",
        "09:00-18:00",
        "09:00-18:00",
        "09:00-18:00",
        "09:00-18:00",
        "09:00-18:00"
    ],
    "contact": "+52 (55) 5485 9048",
    "location": {
        "map_url": "http://maps.google.com/maps?daddr=19.2879%2C-99.1669",
        "address": "Plaza de la Constitución #10, Col. Centro Tlalpan.  14000, Tlalpan"
    },
    "description": "Este inmueble data de 1874 y es considerado monumento histórico desde 1986 por el Instituto Nacional de Antropología e Historia. Entre los lugareños también se le conoce como La Casona. Su importancia radica en ser el primer espacio desde el cual se realizó la primera llamada telefónica de larga distancia del país en 1878.\n\nEl museo ha pasado por varias etapas, y fue hasta hace algunos lustros cuando se planteó convertirlo en un espacio de divulgación de la cultura, la historia y la riqueza del patrimonio histórico local. Actualmente el recinto presta sus cuatro salas para apreciar exposiciones temporales de reconocidos artistas, como Alberto Castro Leñero, Isabel Leñero, Javier Anzures, entre otros.Asimismo, los patios que lo conforman también han sido escenario de diversos eventos culturales, como conciertos, recitales y obras de teatro.",
    "external_urls": [
        "https://www.mexicoescultura.com/recinto/66966/museo-de-historia-de-tlalpan.html",
        "mailto:difusion_tlalpan@hotmail.com"
    ],
    "url": "http://cdmxtravel.com/es/lugares/museo-de-historia-de-tlalpan.html",
    "destination": "Tlalpan"
}