{
    "name": "Palacio de las máscaras Galería Eugenio",
    "labels": [
        "Puro sabor local",
        "En familia",
        "MICE",
        "Por recinto"
    ],
    "price": "",
    "categories": [
        "Artesanías",
        "Centros de entretenimiento familiares",
        "Espacios de reunión",
        "Con eventos"
    ],
    "schedule": [
        "10:00-16:00",
        "10:00-16:00",
        "10:00-16:00",
        "10:00-16:00",
        "10:00-16:00",
        "10:00-17:30",
        "Cerrado"
    ],
    "contact": "(55) 5529 2849",
    "location": {
        "map_url": "http://maps.google.com/maps?daddr=19.4423%2C-99.1372",
        "address": "Ignacio Allende #84, Col. Centro. 06100, Norte"
    },
    "description": "Es un taller encargado de crear máscaras tradicionales de distintas partes del país. La colección cuenta con más de 7,000 piezas cuyos precios son variados. La experiencia de ir y conocer un lugar genuino de fabricación de estas máscaras en pleno Centro Histórico de la CDMX despierta la curiosidad e interés en los visitantes.",
    "external_urls": [
        "https://www.facebook.com/pages/Galeria-Eugenio/188358447894029?sk=timeline",
        "https://www.tripadvisor.com.mx/Attraction_Review-g150800-d5871275-Reviews-Galeria_Eugenio-Mexico_City_Central_Mexico_and_Gulf_Coast.html"
    ],
    "url": "http://cdmxtravel.com/es/lugares/palacio-de-las-mascaras-galeria-eugenio.html",
    "destination": "Norte"
}