{
    "name": "Antolina",
    "labels": [
        "Vive la noche"
    ],
    "price": "Desde $200 MXN",
    "categories": [
        "Bar",
        "Mezcalería"
    ],
    "schedule": [
        "13:00-23:00",
        "13:00-23:00",
        "13:00-23:00",
        "13:00-00:00",
        "13:00-00:00",
        "13:00-00:00",
        "13:00-23:00"
    ],
    "contact": "+52 (55) 5211 6845",
    "location": {
        "map_url": "http://maps.google.com/maps?daddr=19.4071%2C-99.173",
        "address": "Aguascalientes #232, Col. Hipódromo Condesa. 06170, Condesa"
    },
    "description": "Un lugar en el que puede disfrutarse el mezcal de cinco regiones distintas: Guerrero, Michoacán, Jalisco, Durango y Sonora. Se puede complementar la bebida con platillos tradicionales y de perfecto maridaje como pescadillas, salbutes de cochinita pibil, sopa de tortilla, ensalada de flor del maguey, tlayudas, así como platillos más sofisticados como la trucha sarandeada a la talla y las enchiladas michoacanas rellenas de lechón y bañadas en mole verde. Los viernes ofrecen un menú mezcalero.",
    "external_urls": [
        "https://www.facebook.com/pages/Alip%C3%BAs-Condesa/248116285398233",
        "https://instagram.com/mezcalalipus/",
        "https://twitter.com/alipuscondesa",
        "http://www.alipus.com/mezcalerias/condesa/",
        "mailto:marco@losdanzantes.com"
    ],
    "url": "http://cdmxtravel.com/es/lugares/antolina.html",
    "destination": "Condesa"
}