{
    "name": "Lincoln",
    "labels": [
        "Vive la noche"
    ],
    "price": "Desde $450 MXN",
    "categories": [
        "Bar",
        "Lounge"
    ],
    "schedule": [
        "14:00-00:00",
        "14:00-00:00",
        "14:00-00:00",
        "14:00-00:00",
        "14:00-00:00",
        "14:00-00:00",
        "13:00-22:00"
    ],
    "contact": "+52 (55) 5280 1939",
    "location": {
        "map_url": "http://maps.google.com/maps?daddr=19.4303%2C-99.1997",
        "address": "Emilio Castelar #163, Col. Polanco. 11550, Polanco-Chapultepec"
    },
    "description": "Un bar estilo lounge con tonos azules en las paredes, el piso y la barra. Un lugar elegante es el ideal para impresionar a los papás, al jefe o para ir después del trabajo con los amigos.\n\nEl menú incluye hamburguesa de cerdo ibérico, salmón con salsa de vainilla y espinacas, ensalada de higos con queso de cabra y más. Esta casa de estilo porfiriana enamora a primera vista.",
    "external_urls": [
        "https://www.atrapalo.com.mx/restaurantes/lincoln-polanco_f41385.html"
    ],
    "url": "http://cdmxtravel.com/es/lugares/lincoln.html",
    "destination": "Polanco-Chapultepec"
}