{
    "name": "Biblioteca del Instituto de Investigaciones sobre la Universidad y la Educación",
    "labels": [
        "Cultura todos los días"
    ],
    "price": "",
    "categories": [
        "Bibliotecas"
    ],
    "schedule": [
        "09:00-19:00",
        "09:00-19:00",
        "09:00-19:00",
        "09:00-19:00",
        "09:00-19:00",
        "Cerrado",
        "Cerrado"
    ],
    "contact": "+52 (55)  5622 6986",
    "location": {
        "map_url": "http://maps.google.com/maps?daddr=19.3157%2C-99.1845",
        "address": "Centro Cultural Universitario, Col. Ciudad Universitaria. 04510, Ciudad Universitaria"
    },
    "description": "Ubicada en el Centro Cultural Universitario, en la planta baja del Edificio del IISUE. Fue creada en 1976 en el Centro de Estudios sobre la Universidad (CESU) para dar apoyo a las investigaciones del Archivo Histórico de la UNAM. En 2006 el Honorable Consejero Universitario reconoció el nivel y la labor académica del CESU, otorgándole más responsabilidad social y cambiando su denominación por la de Instituto de Investigaciones sobre la Universidad y la Educación (IISUE).\n\nActualmente ocupa un lugar destacado entre las bibliotecas dedicadas al campo educativo en México, con un acervo de 101,800 materiales de libros, revistas, tesis y 38,306 títulos en sus distintas colecciones.\n\nOfrece diferentes servicios como el préstamo en sala, a domicilio para el personal del centro, interbibliotecario, consulta a bancos de datos automatizados y especializada, así como visitas guiadas con previa cita.\n\n",
    "external_urls": [
        "https://www.facebook.com/pages/Iisue-UNAM/114818071927586",
        "https://twitter.com/DifusionIISUE",
        "http://iisue.bibliotecas.unam.mx/",
        "mailto:biblioteca_iisue@unam.mx"
    ],
    "url": "http://cdmxtravel.com/es/lugares/biblioteca-del-instituto-de-investigaciones-sobre-la-universidad-y-la-educacion.html",
    "destination": "Ciudad Universitaria"
}