{
    "name": "Cine Más Allá",
    "labels": [
        "Sé un espectador"
    ],
    "price": "Gratuito",
    "categories": [
        "Cines de arte"
    ],
    "schedule": [
        "Cerrado",
        "11:00-19:00",
        "11:00-19:00",
        "11:00-19:00",
        "11:00-19:00",
        "11:00-19:00",
        "11:00-19:00"
    ],
    "contact": "+52 (55) 1000 2637",
    "location": {
        "map_url": "http://maps.google.com/maps?daddr=19.4231%2C-99.1758",
        "address": "Paseo de la Reforma s/n, Col. Juárez 06600, Reforma-Zona Rosa"
    },
    "description": "Es el espacio dentro del Centro de Cultura Digital que busca impulsar la expresión cinematográfica por medio de ciclos de cine, talleres, encuentros profesionales y plataformas online.",
    "external_urls": [
        "http://www.centroculturadigital.mx/es/actividades/cine/actual.html"
    ],
    "url": "http://cdmxtravel.com/es/lugares/cine-mas-alla.html",
    "destination": "Reforma-Zona Rosa"
}