{
    "name": "Lo mejor para disfrutar la vida nocturna en la colonia Tabacalera",
    "labels": [
        "Vive la noche"
    ],
    "price": "Desde $200 MXN",
    "categories": [
        "Antro",
        "Cantina",
        "Bar",
        "Cervecería",
        "Pulquería",
        "Mezcalería",
        "Centros nocturnos"
    ],
    "schedule": null,
    "contact": null,
    "location": {
        "map_url": "http://maps.google.com/maps?daddr=%2C",
        "address": "Colonia Tabacalera.  06030, Centro Histórico"
    },
    "description": "Cantinas y bares imperdibles de esta emblemática colonia...\n\n\n\nEn distintos puntos de la Tabacalera se ubican algunos establecimientos, que aunque sencillos, hablan del divertido y casual ambiente que caracteriza a la colonia. Conviene pasar la tarde en esta parte de la ciudad, y después de visitar museos como el de San Carlos o subir hasta la cima del Monumento a la Revolución, y acabar con un tarro de cerveza en alguno de estos bares:\n\n\n\nLa Antigua, enGustavo Baz 2220, col. Centro\n\nEste restaurante se convierte en un bar por las noches, donde se presentan distintos grupos de música para amenizar los encuentros entre amigos y familias. Cuentan con una gran variedad de vinos importados, así que si tu gusto es refinado, te recomendamos que visites este lugar.\n\n\n\nCrisanta, enAv. Republica 51, col. Tabacalera.\n\nPara los amantes de la cerveza artesanal existe este lugar, con una vista espectacular al Monumento a la Revolución. La variedad es bastante abundante y de calidad, lo ideal es pedirle al personal que te recomiende algo según tus gustos y antojos. En ocasiones ponen música para que la gente se pare a bailar.\n\n\n\nSalón Palacio, enEje 1 Puente 5, col. Tabacalera.\n\nLos clientes que frecuentan este bar aseguran que cuenta con todos los elementos que constituyen una auténtica cantina. Para los que gustan de acompañar sus bebidas con alimentos, el lugar tiene una carta de platillos típicos mexicanos. Los precios son accesibles y el ambiente divertido.\n\n\n\nPulquería Spíritu Santo, en Eje 1 Puente Rosales 5Bc, col. Tabacalera.\n\nHaciendo alusión al tema esotérico que envuelve al pulque, este relajado lugar se ha convertido en uno de los favoritos de los jóvenes que frecuentan la colonia. El pulque que sirven proviene de Hidalgo, y cada día tienen de diferentes sabores. Para los valientes están los tarros de cinco litros, pero si eres nuevo puedes ir pidiéndolo por vaso.\n\n\n\nLa esquina de Abolengo, enMaestro Antonio Caso 30, col. Tabacalera.\n\nSin duda una de los bares más agradables y cómodos de la colonia. Aquí el servicio es excelente y el trato amable. Tienen de todos los licores, lo cual es ideal para cuando arriban a sus mesas grupos grandes de personas. La botana es rica, los precios accesibles y la música depara una gran velada.\n\nImágenes: MXCity.",
    "external_urls": [
        "https://mxcity.mx/2017/03/la-vida-nocturna-de-la-colonia-tabacalera/"
    ],
    "url": "http://cdmxtravel.com/es/lugares/lo-mejor-para-disfrutar-la-vida-nocturna-en-la-colonia-tabacalera.html",
    "destination": "Centro Histórico"
}