{
    "name": "Casa de Jaime Sabines",
    "labels": [
        "Museos",
        "México monumental",
        "Cultura todos los días",
        "MICE",
        "Por recinto"
    ],
    "price": "Gratuito",
    "categories": [
        "Arte",
        "Casas históricas",
        "Casas de cultura",
        "Centros culturales",
        "Espacios de reunión",
        "Con eventos"
    ],
    "schedule": [
        "Cerrado",
        "09:00-20:00",
        "09:00-20:00",
        "09:00-20:00",
        "09:00-20:00",
        "09:00-20:00",
        "Cerrado"
    ],
    "contact": "(55) 5550 3134",
    "location": {
        "map_url": "http://maps.google.com/maps?daddr=19.3448%2C-99.1906",
        "address": "Av. Revolución #1747, Col. San Ángel. 01000, San Ángel"
    },
    "description": "Centro de cultura que ofrece talleres, cursos y presentaciones artísticas y editoriales.\n\nTodo se hace con referencia a la memoria del poeta chiapaneco, incitando al arte, la crítica y el diálogo.",
    "external_urls": [
        "http://casajaimesabines.blogspot.com/",
        "https://www.facebook.com/pages/Casa-Jaime-Sabines/215006975194161",
        "mailto:casadeculturajaimesabines@gmail.com"
    ],
    "url": "http://cdmxtravel.com/es/lugares/casa-de-jaime-sabines.html",
    "destination": "San Ángel"
}