{
    "name": "Tlachiquero",
    "labels": [
        "Vive la noche"
    ],
    "price": "Desde $150 MXN",
    "categories": [
        "Pub",
        "Pulquería"
    ],
    "schedule": [
        "Cerrado",
        "Cerrado",
        "16:00-01:00",
        "16:00-01:00",
        "16:00-01:00",
        "16:00-01:00",
        "16:00-01:00"
    ],
    "contact": "+52 (55) 6380 2746",
    "location": {
        "map_url": "http://maps.google.com/maps?daddr=19.4213%2C-99.1543",
        "address": "Colima 5 A, Col. Roma Norte. 06700, Roma"
    },
    "description": "Es una pulquería donde se venden curados (pulque de sabores) con antojitos. También cuentan con una pequeña selección de mezcales. Uno de los favoritos de los visitantes es el mezcal en las cazuelas: un preparado especial a un excelente precio.",
    "external_urls": [
        "https://web.facebook.com/tlachiqueromezcaleria"
    ],
    "url": "http://cdmxtravel.com/es/lugares/tlachiquero.html",
    "destination": "Roma"
}