{
    "name": "\"Masacre en el Templo Mayor o La Conquista de Tenochtitlan\" de Jean Charlot",
    "labels": [
        "México monumental",
        "MICE"
    ],
    "price": "Desde $45 MXN",
    "categories": [
        "Murales",
        "Espacios de reunión"
    ],
    "schedule": [
        "Cerrado",
        "10:00-20:00",
        "10:00-18:00",
        "10:00-18:00",
        "10:00-18:00",
        "10:00-18:00",
        "10:00-18:00"
    ],
    "contact": null,
    "location": {
        "map_url": "http://maps.google.com/maps?daddr=19.4363%2C-99.131",
        "address": "Justo Sierra #16, Col. Centro. 06020, Centro Histórico"
    },
    "description": "Este mural es un fresco hecho por el artista Jean Charlot entre 1922 y 1923; en él se narra la batalla entre indígenas y españoles.\n\nEn el ángulo inferior derecho, tres hombres atestiguan el hecho: Diego Rivera, Fernando Leal y el propio Charlot. La imagen del niño representa el futuro. A lo largo del borde inferior del mural el pintor escribió: “Fue tanto el alboroto de la ciudad y la vocería que se levantó que a los montes hacían resonar y a las piedras habían quebrantar de dolor y lástima. P. Durán”. Esta frase fue tomada del libro del cronista Fray Diego Durán Historia de la Indias de la Nueva España e Islas de la Tierra Firme.",
    "external_urls": [
        "https://www.facebook.com/AntiguoColegiodeSanIldefonso?ref=ts",
        "http://www.sanildefonso.org.mx/acervo.php#prettyPhoto"
    ],
    "url": "http://cdmxtravel.com/es/lugares/masacre-en-el-templo-mayor-o-la-conquista-de-tenochtitlan-de-jean-charlot.html",
    "destination": "Centro Histórico"
}