{
    "name": "Biblioteca José María Lafragua",
    "labels": [
        "Cultura todos los días"
    ],
    "price": "Gratuito",
    "categories": [
        "Bibliotecas"
    ],
    "schedule": [
        "09:00-18:00",
        "09:00-18:00",
        "09:00-18:00",
        "09:00-18:00",
        "09:00-18:00",
        "Cerrado",
        "Cerrado"
    ],
    "contact": "(55) 9157 4333 ext. 4102",
    "location": {
        "map_url": "http://maps.google.com/maps?daddr=19.4509%2C-99.1366",
        "address": "Av. Ricardo Flores Magón #1, Col. Guerrero. \r\n 06995, Norte"
    },
    "description": "Esta biblioteca se localiza en el Ex Colegio de la Santa Cruz de Tlatelolco, caracterizado por su plaza central y sus arcos blancos. Actualmente el inmueble pertenece a la Secretaría de Relaciones Exteriores y homenajea al político y escritor José María Lafragua. Su acervo es rico en materiales de historia de la diplomacia mexicana, relaciones internacionales y temas afines.\n\nAdemás del apoyo bibliográfico, apoya en las necesidades de información de la Secretaría, embajadas y consulados, así como en la realización de procesos técnicos de las bibliotecas en el extranjero. La colección de libros supera los 125,000 volúmenes, incluida una fototeca y un acervo de reserva.",
    "external_urls": [
        "https://www.facebook.com/Biblioteca-Hist%C3%B3rica-Jos%C3%A9-Mar%C3%ADa-Lafragua-105547582868381/timeline/",
        "https://www.tripadvisor.com.mx/Attraction_Review-g249850-d12707229-Reviews-Biblioteca_Publica_del_Estado_Jose_Maria_Pino_Suarez-Villahermosa_Central_Mexico.html",
        "https://acervo.sre.gob.mx/index.php/biblioteca-jose-ma-lafragua",
        "mailto:bibliotecajmlafragua@sre.gob.mx"
    ],
    "url": "http://cdmxtravel.com/es/lugares/biblioteca-jose-maria-lafragua.html",
    "destination": "Norte"
}