{
    "name": "Casa Gallina",
    "labels": [
        "Cultura todos los días"
    ],
    "price": "Gratuito",
    "categories": [
        "Centros culturales"
    ],
    "schedule": [
        "10:00-18:00",
        "10:00-18:00",
        "10:00-18:00",
        "10:00-18:00",
        "10:00-14:00",
        "Cerrado",
        "Cerrado"
    ],
    "contact": "+52 (55) 2630 2601",
    "location": {
        "map_url": "http://maps.google.com/maps?daddr=19.4505%2C-99.1596",
        "address": "Sabino #190, Col. Santa María la Ribera.  06400, Santa María la Ribera"
    },
    "description": "Casa Gallina se ubica en la colonia Santa María la Ribera. Es un proyecto cultural cuyo objetivo está enfocado en el aprendizaje, temas culturales, comunidad y cuidado del medio ambiente.\n\nCasa Gallina también se define como un laboratorio de experiencias grupales de resiliencia, generación ecológica y creatividad. Cuenta con programas liderados por profesionales de alto nivel, que colaboran con diferentes procesos creativos sobre sustentabilidad y ecología.\n\nEl acceso a Casa Gallina sólo se permite a personas que vivan, estudien o trabajen en el barrio de Santa María la Ribera, con el fin de que sea un entorno vecinal y evitar transformar los espacios en parada turística de los múltiples visitantes de la colonia.\n\nPara conocer más de los programas que realizan se recomienda consultar la página oficial.",
    "external_urls": [
        "https://www.facebook.com/Casa-Gallina-1253981211449325/",
        "https://casagallina.org.mx/la-casa",
        "mailto:info@casagallina.org.mx"
    ],
    "url": "http://cdmxtravel.com/es/lugares/casa-gallina.html",
    "destination": "Santa María la Ribera"
}