{
    "name": "Mercado de Xochimilco",
    "labels": [
        "Puro sabor local",
        "MICE",
        "Por recinto",
        "Shopping"
    ],
    "price": "",
    "categories": [
        "Mercados y bazares",
        "Artesanías",
        "Espacios de reunión",
        "Con eventos",
        "Comercios centenarios"
    ],
    "schedule": [
        "10:00-18:00",
        "10:00-18:00",
        "10:00-18:00",
        "10:00-18:00",
        "10:00-18:00",
        "10:00-18:00",
        "10:00-18:00"
    ],
    "contact": "(55) 5676 8879",
    "location": {
        "map_url": "http://maps.google.com/maps?daddr=19.2623%2C-99.1041",
        "address": "Av. Nuevo León s/n, Col. Barrio Santa Crucita. 16070, Xochimilco"
    },
    "description": "Es uno de los mercados más tradicionales de la Ciudad de México. Está ubicado en el corazón del pueblo de Xochimilco, famoso por sus canales que le dieron el reconocimiento de Patrimonio Cultural de la Humanidad por la UNESCO.\n\nConstruido en los años 50 del siglo pasado, es de los mejores lugares para comprar productos del campo frescos. Además, se pueden comprar flores y plantas y artesanías de cerámica. Recorrer su pasillo central lleno de puestos de comida es una experiencia cultural y gastronómica singular. Hoy en día se ha convertido en uno de los más visitados de la ciudad.",
    "external_urls": [
        "https://www.tripadvisor.com.mx/Attraction_Review-g150800-d15030262-Reviews-Mercado_de_Xochimilco-Mexico_City_Central_Mexico_and_Gulf_Coast.html"
    ],
    "url": "http://cdmxtravel.com/es/lugares/mercado-de-xochimilco.html",
    "destination": "Xochimilco"
}