{
    "name": "Galería Toca",
    "labels": [
        "Cultura todos los días"
    ],
    "price": "Gratuito",
    "categories": [
        "Galerías"
    ],
    "schedule": [
        "11:00-19:00",
        "11:00-19:00",
        "11:00-19:00",
        "11:00-19:00",
        "11:00-19:00",
        "11:30-15:00",
        "Cerrado"
    ],
    "contact": "(55) 5525 7614",
    "location": {
        "map_url": "http://maps.google.com/maps?daddr=19.4198%2C-99.1603",
        "address": "Colima #174, Col. Roma Norte. 06700, Roma"
    },
    "description": "Se encuentra en una casona de principios del siglo XX de la colonia Roma. Representa a artistas con una trayectoria consolidada en la escena contemporánea desde 2009. Actualmente, la galería hace énfasis en la fotografía y la pintura de artistas nacionales e internacionales, como Javier Areán, Mie Olise, Javier Peláez e Ivonne Venegas.",
    "external_urls": [
        "https://twitter.com/tocagaleria",
        "http://www.tocagaleria.com/index.php",
        "mailto:info@tocagaleria.com"
    ],
    "url": "http://cdmxtravel.com/es/lugares/galeria-toca.html",
    "destination": "Roma"
}