{
    "name": "El sur del Centro Histórico y su próxima restauración",
    "labels": [
        "Al aire libre"
    ],
    "price": "",
    "categories": [
        "Plazas"
    ],
    "schedule": null,
    "contact": null,
    "location": null,
    "description": "Pronto los capitalinos veremos un nuevo rostro de Pino Suárez...\n\n\n\nEl gobierno de la CDMX ha emprendido un ambicioso proyecto que pretende restaurar la cara sur del Centro Histórico. Con una inversión 96 millones de pesos, y las ganas de rescatar uno de los lugares más emblemáticos de la capital, durante un año se trabajará arduamente para recuperar las calles y las avenidas que se encuentran entre San Antonio Abad y la Plaza Pino Suárez.\n\nEl objetivo de este plan es principalmente darles la oportunidad a las personasde apropiarse de los espacios públicos que hay en sus barrios o colonias. Para lograr lo anterior, la prioridad de esta renovación serán los peatones, y por eso se ampliarán las banquetas, se aumentará radicalmente la seguridad y se alumbrarán las calles.\n\nAdemás, se colocarán fuentes secas como las que están en el Monumento a la Revolución, habrán nuevos espacios para que los niños jueguen y un sitio de práctica para los entusiastas de las patinetas. Asimismo, se tiene contemplado renovar el sistema de drenajes y agua que corre debajo del piso.\n\nTambién, con la ayuda de especialistas se rescatarán las hermosas fachadas de las casonas que están desperdigadas por toda la zona y que han sido maltratadas por el tiempo. Los edificios modernos serán intervenidos por el talento de los mejores artistas de arte urbano que hay en la capital y las avenidas que están en el barrio contarán con racks para bicicletas, bancas, renovación del pavimento y hasta un transporte público más eficiente.\n\nA pesar de todos estos magníficos planes, cabe destacar que llevar a cabo esta tarea no será fácil, y habrá que hacer una transformación profunda en la cotidianidad del barrio. Esto se debe, entre otras cosas, a que la parte sur del Zócalo es un sitio sumamente transitado en el que abundan los ambulantes, las calles pequeñas y las unidades habitacionales.\n\nBienvenidos sean todos los proyectos que pretendan rescatar labelleza inconmensurable que hay en el Centro Histórico. Después de todo, decisiones como esta pueden tocar muchas vidas y transformarlas en un sentido positivo.\n\nImágenes: MXCity.\n\n",
    "external_urls": null,
    "url": "http://cdmxtravel.com/es/lugares/el-sur-del-centro-historico-y-su-proxima-restauracion.html",
    "destination": "Centro Histórico"
}