{
    "name": "Surtidora Don Batiz Centro",
    "labels": [
        "Vive la noche"
    ],
    "price": "Desde $200 MXN",
    "categories": [
        "Cantina",
        "Pulquería"
    ],
    "schedule": [
        "10:00-02:00",
        "10:00-02:00",
        "10:00-02:00",
        "10:00-02:00",
        "10:00-02:00",
        "10:00-02:00",
        "10:00-02:00"
    ],
    "contact": "+52 (55) 5512 0105",
    "location": {
        "map_url": "http://maps.google.com/maps?daddr=19.4338%2C-99.1387",
        "address": "Av Francisco I. Madero #23, Centro Histórico de la Cdad. de México,CDMX 06000, Centro Histórico"
    },
    "description": "Una antojería estilo cantina donde se degustan sopes, tostadas, quesadillas, tlayudas, tacos, huaraches, gorditas y demás delicias con un vaso de pulque.",
    "external_urls": [
        "https://www.facebook.com/DonBatizSurtidora",
        "https://www.instagram.com/surtidoradonbatiz/",
        "https://twitter.com/DonBatiz",
        "https://www.surtidoradonbatiz.mx/"
    ],
    "url": "http://cdmxtravel.com/es/lugares/surtidora-don-batiz-centro.html",
    "destination": "Centro Histórico"
}