{
    "name": "Salón Niza",
    "labels": [
        "Vive la noche",
        "Por recinto"
    ],
    "price": "Desde $200 MXN",
    "categories": [
        "Cantina",
        "Bar",
        "Con eventos"
    ],
    "schedule": [
        "12:00-20:00",
        "12:00-20:00",
        "12:00-21:00",
        "12:00-21:00",
        "12:00-22:00",
        "12:00-22:00",
        "12:00-20:00"
    ],
    "contact": "55 5525 6708",
    "location": {
        "map_url": "http://maps.google.com/maps?daddr=19.4244%2C-99.1612",
        "address": "Chapultepec #259, Col. Juárez. 06600, Reforma-Zona Rosa"
    },
    "description": "Con televisiones de plasma en las paredes y meseros de vestimenta formal, esta cantina es ideal para pasar la tarde con los amigos o los colegas del trabajo. Se puede jugar dominó y pedir una bebida antes de emprender el camino a casa.",
    "external_urls": null,
    "url": "http://cdmxtravel.com/es/lugares/salon-niza.html",
    "destination": "Reforma-Zona Rosa"
}