{
    "name": "Casa Refugio Citlaltépetl",
    "labels": [
        "Museos",
        "México monumental",
        "Cultura todos los días",
        "Sé un espectador"
    ],
    "price": "Gratuito",
    "categories": [
        "Arte",
        "Singulares",
        "Casas históricas",
        "Bibliotecas",
        "Casas de cultura",
        "Centros culturales",
        "Pinacotecas",
        "Teatros",
        "Museos de arte e historia"
    ],
    "schedule": [
        "10:00-19:00",
        "10:00-19:00",
        "10:00-19:00",
        "10:00-19:00",
        "10:00-19:00",
        "10:00-19:00",
        "Cerrado"
    ],
    "contact": "+52 (55)  5919 1463",
    "location": {
        "map_url": "http://maps.google.com/maps?daddr=19.4088%2C-99.1718",
        "address": "Citlaltépetl #25, Col. Hipódromo Condesa.  06170, Condesa"
    },
    "description": "El nombre del recinto obedece a la calle en la que se encuentra, a unos pasos de la fuente del mismo nombre que proporciona calidez y tranquilidad. Casa Refugio se ha consolidado como un punto de encuentro para literatos, pintores, artistas, lectores y en general consumidores culturales, donde las exposiciones, las presentaciones editoriales y mucho más, son los eventos cotidianos. Además de contar con un restaurante gourmet que destaca las tonalidades de la comida mexicana.\n\nEs primordial destacar que Casa Refugio Citlaltépetl nace precisamente como una asociación civil, con el cometido de hospedar a escritores amenazados o perseguidos en sus países de origen.",
    "external_urls": [
        "https://www.facebook.com/casarefugio.citlaltepetl/",
        "https://twitter.com/casarefugio?fbclid=IwAR2DqpC82Cfdkj_rw6xUkOLe_jxH1u69KRWqVzio3quf56WcRReQA-oK9Zs",
        "http://www.casarefugio.com/",
        "mailto:contacto.casarefugio@gmail.com"
    ],
    "url": "http://cdmxtravel.com/es/lugares/casa-refugio-citlaltepetl.html",
    "destination": "Condesa"
}