{
    "name": "Museo Ferrocarrilero Víctor Flores",
    "labels": [
        "Museos"
    ],
    "price": "Gratuito",
    "categories": [
        "Ciencia e historia"
    ],
    "schedule": [
        "10:00-15:00",
        "10:00-15:00",
        "10:00-15:00",
        "10:00-15:00",
        "10:00-15:00",
        "Cerrado",
        "Cerrado"
    ],
    "contact": "+52 (55) 5597 1255",
    "location": {
        "map_url": "http://maps.google.com/maps?daddr=19.4535%2C-99.1497",
        "address": "Calz. Ricardo Flores Magón #206, Col. Guerrero. 06300, Norte"
    },
    "description": "El objetivo del museo es difundir la historia, el conocimiento y la aportación de los ferrocarrileros al desarrollo de nuestro país. Funciona desde 2001 en el Sindicato de Trabajadores Ferrocarrileros de la República Mexicana, la remodelación del área correspondiente al museo estuvo a cargo del fundador y director Manuel Alejandro Márquez González.\n\nEn sus seis salas exhibe más de tres mil piezas entre fotografías antiguas, planos de estaciones, maquetas de trenes, recreaciones de talleres y oficinas de los ferrocarrileros, pinturas, esculturas, fotomurales y herramientas propias del oficio.\n\nAdemás cuenta con tienda, restaurante y visitas guiadas.",
    "external_urls": [
        "https://www.facebook.com/pages/category/Civilization-Museum/Museo-Ferrocarrilero-Victor-Flores-1145575075547310/",
        "mailto:marquezgonzalez@hotmail.com"
    ],
    "url": "http://cdmxtravel.com/es/lugares/museo-ferrocarrilero-victor-flores.html",
    "destination": "Norte"
}