[
    {
        "name": "Parque Nacional Desierto de los Leones",
        "url": "http://cdmxtravel.com/es/lugares/parque-nacional-desierto-de-los-leones.html"
    },
    {
        "name": "Parque Insurgente Miguel Hidalgo y Costilla (La Marquesa)",
        "url": "http://cdmxtravel.com/es/lugares/parque-insurgente-miguel-hidalgo-y-costilla-la-marquesa.html"
    },
    {
        "name": "Exconvento del Desierto de los Leones",
        "url": "http://cdmxtravel.com/es/lugares/exconvento-del-desierto-de-los-leones.html"
    },
    {
        "name": "Granja del Tío Pepe",
        "url": "http://cdmxtravel.com/es/lugares/granja-del-tio-pepe.html"
    },
    {
        "name": "Parroquia de San Pedro Apóstol",
        "url": "http://cdmxtravel.com/es/lugares/parroquia-de-san-pedro-apostol.html"
    },
    {
        "name": "Museo Miguel Hidalgo y Costilla",
        "url": "http://cdmxtravel.com/es/lugares/museo-miguel-hidalgo-y-costilla.html"
    },
    {
        "name": "Teatro Morelos (Cuajimalpa)",
        "url": "http://cdmxtravel.com/es/lugares/teatro-morelos-cuajimalpa.html"
    },
    {
        "name": "Casa de Cultura Delegación Cuajimalpa",
        "url": "http://cdmxtravel.com/es/lugares/casa-de-cultura-delegacion-cuajimalpa.html"
    },
    {
        "name": "Museo de Zapata",
        "url": "http://cdmxtravel.com/es/lugares/museo-de-zapata.html"
    },
    {
        "name": "La naturaleza de la ciudad: El Desierto de los Leones",
        "url": "http://cdmxtravel.com/es/lugares/la-naturaleza-de-la-ciudad-el-desierto-de-los-leones.html"
    },
    {
        "name": "Cuajimalpa",
        "url": "http://cdmxtravel.com/es/lugares/cuajimalpa.html"
    },
    {
        "name": "Jardín y Casa Hidalgo",
        "url": "http://cdmxtravel.com/es/lugares/jardin-y-casa-hidalgo.html"
    },
    {
        "name": "The Muddy Boot",
        "url": "http://cdmxtravel.com/es/lugares/the-muddy-boot.html"
    },
    {
        "name": "Centro Cultural Nacional Pedro Infante",
        "url": "http://cdmxtravel.com/es/lugares/centro-cultural-nacional-pedro-infante.html"
    }
]