{
    "name": "Foro Indie Rocks",
    "labels": [
        "Sé un espectador",
        "MICE",
        "Por recinto"
    ],
    "price": "",
    "categories": [
        "Centros de espectáculos y salas de conciertos",
        "Teatros",
        "Espacios de reunión",
        "Con eventos"
    ],
    "schedule": [
        "Cerrado",
        "Cerrado",
        "10:00-18:00",
        "10:00-18:00",
        "10:00-18:00",
        "10:00-18:00",
        "Cerrado"
    ],
    "contact": "(55) 6394 7745",
    "location": {
        "map_url": "http://maps.google.com/maps?daddr=19.4166%2C-99.1562",
        "address": "Zacatecas #39, Col. Roma. 06700, Roma"
    },
    "description": "Este foro sufre varias renovaciones de acuerdo con el festival, evento o artista que se presente. Aquí tocaron bandas y artistas de la talla de Metric, Deap Vally, El Columpio Asesino y muchos más; grupos que generalmente están en los gustos de los jóvenes.\n\nConsulta la cartelera de eventos.",
    "external_urls": [
        "https://www.facebook.com/foroindierocks",
        "https://www.instagram.com/indierocksmagazine/",
        "https://twitter.com/indierocks",
        "https://www.youtube.com/channel/UCKn7O890Sk-JcOIMtBzEt7g",
        "http://www.indierocks.mx/",
        "mailto:foro@indierocks.mx"
    ],
    "url": "http://cdmxtravel.com/es/lugares/foro-indie-rocks.html",
    "destination": "Roma"
}