{
    "name": "Torre Insignia",
    "labels": [
        "México monumental",
        "MICE"
    ],
    "price": "",
    "categories": [
        "Rascacielos y miradores",
        "Espacios de reunión"
    ],
    "schedule": null,
    "contact": null,
    "location": {
        "map_url": "http://maps.google.com/maps?daddr=19.4545%2C-99.1511",
        "address": "Av. Insurgentes Norte s/n, Col. Conjunto Urbano Nonoalco-Tlatelolco. 06900, Norte"
    },
    "description": "Esta torre fue construida en 1962 para albergar las oficinas del Banco del Gobierno Mexicano Banobras (Banco Nacional de Obras Públicas), en ese año era considerado el segundo edificio más alto de México, sólo por debajo de la Torre Latinoamericana, pero ahora está clasificado como un edificio de altura media. Mide 127 metros de altura y cuenta con 25 pisos. Después del sismo de 1985 quedó abandonado hasta que en 2008 lo adquirió la empresa estadounidense de bienes raíces Cushman & Wakefield y lo convirtió en el Corporativo Tlatelolco.\n\nEn 2011 fue remodelado.",
    "external_urls": null,
    "url": "http://cdmxtravel.com/es/lugares/torre-insignia.html",
    "destination": "Norte"
}