{
    "name": "Casa Prisión de Morelos",
    "labels": [
        "México monumental"
    ],
    "price": "",
    "categories": [
        "Monumentos",
        "Casas históricas"
    ],
    "schedule": [
        "00:01-23:59",
        "00:01-23:59",
        "00:01-23:59",
        "00:01-23:59",
        "00:01-23:59",
        "00:01-23:59",
        "00:01-23:59"
    ],
    "contact": "(55) 55 5472 8043",
    "location": {
        "map_url": "http://maps.google.com/maps?daddr=19.2907%2C-99.1634",
        "address": "Av. San Fernando #3, Col. Tlalpan. 14000, Tlalpan"
    },
    "description": "José María Morelos y Pavón es uno de los héroes de la Independencia de México. Redactó el texto Sentimientos de la Nación donde se aborda la declaración de Independencia de América de España y cualquier otra nación o monarquía, reafirma la religión católica sin tolerancia a que exista otra, entre otros puntos.\n\nEl sacerdote fue preso el 5 de noviembre de 1815 en Temalaca, Puebla. Durante su juicio por la Inquisición estuvo encarcelado en la Torre de Santa Inés, que ahora es una casa privada. Sólo está colocada una placa que dice: Esta fue tu prisión, ¡Oh! Gran soldado, por el crimen de habernos liberado. Fue fusilado en Ecatepec el 22 de diciembre de 1815.\n\nSólo se puede apreciar la fachada pues no está abierta al público.",
    "external_urls": [
        "https://www.facebook.com/tlalpanhistoria/posts/1520245228059925/"
    ],
    "url": "http://cdmxtravel.com/es/lugares/casa-prision-de-morelos.html",
    "destination": "Tlalpan"
}