{
    "name": "Centro Cultural Universitario de la UNAM (CCU)",
    "labels": [
        "Museos",
        "Al aire libre",
        "Cultura todos los días",
        "En familia",
        "Sé un espectador",
        "MICE",
        "Por recinto"
    ],
    "price": "",
    "categories": [
        "Arte",
        "Ciencia e historia",
        "Museos interactivos",
        "Jardines",
        "Bibliotecas",
        "Hemerotecas",
        "Galerías",
        "Centros culturales",
        "Centros de entretenimiento familiares",
        "Centros de espectáculos y salas de conciertos",
        "Teatros",
        "Cines",
        "Cines de arte",
        "Espacios de reunión",
        "Con eventos",
        "Museos de arte e historia",
        "Librerías"
    ],
    "schedule": [
        "07:00-21:00",
        "07:00-21:00",
        "07:00-21:00",
        "07:00-21:00",
        "07:00-21:00",
        "07:00-21:00",
        "07:00-21:00"
    ],
    "contact": null,
    "location": {
        "map_url": "http://maps.google.com/maps?daddr=19.3141%2C-99.1852",
        "address": "Av. Insurgentes Sur #3000, Col. Ciudad Universitaria. 04510, Ciudad Universitaria"
    },
    "description": "El Centro Cultural Universitario se encuentra al sur de la ciudad de México y pertenece a la Universidad Nacional Autónoma de México. En su amplio espacio se concentran diversos recintos con diferentes ofertas culturales.\n\nEl complejo incluye el Museo Universitario de Arte Contemporáneo (MUAC), la Sala Miguel Covarrubias; la Unidad de Cines (José Revueltas, Julio Bracho y Carlos Monsiváis), la sala Carlos Chávez, el teatro Juan Ruiz de Alarcón, el Foro Sor Juana Inés de la Cruz, la Sala Nezahualcóyotl, el Centro Universitario de Teatro y el Espacio Escultórico, donde una serie de esculturas se funden con el mar de lava, producto de la erupción del Xitle. En estos espacios convergen las artes, la naturaleza, la gastronomía y los conocimientos tradicionales a precios accesibles para disfrute de todos los mexicanos.\n\nEl CCU organiza además talleres para niños de seis a 14 años. Las temáticas son variadas pero todas están enfocadas en desarrollar su creatividad a través del juego, la ciencia y el arte.\n\nSe recomienda consultar la página oficial para conocer los horarios y las cuotas.\n\nForma parte del programa #YoVoyalteatro\n\nFacebook: yovoyalteatromx\nTwitter: yovoyalteatromx",
    "external_urls": [
        "https://www.facebook.com/Cultura.UNAM.pagina",
        "https://www.instagram.com/culturaunam/",
        "https://twitter.com/culturaunam",
        "https://www.youtube.com/user/culturaunam",
        "http://www.cultura.unam.mx/index.aspx"
    ],
    "url": "http://cdmxtravel.com/es/lugares/centro-cultural-universitario-de-la-unam-ccu.html",
    "destination": "Ciudad Universitaria"
}