{
    "name": "Hookah Condesa",
    "labels": [
        "Vive la noche"
    ],
    "price": "Desde $250 MXN",
    "categories": [
        "Bar",
        "Lounge"
    ],
    "schedule": [
        "17:00-00:00",
        "17:00-00:00",
        "17:00-02:00",
        "17:00-02:00",
        "17:00-02:00",
        "17:00-02:00",
        "17:00-00:00"
    ],
    "contact": "55 5584 1742",
    "location": {
        "map_url": "http://maps.google.com/maps?daddr=19.4083%2C-99.1708",
        "address": "Campeche #284, Col. Condesa. 06140, Condesa"
    },
    "description": "En Hookah siempre tocan los mejores djs de México y de la escena mundial. Las tres sucursales son sede y referencia de los diferentes tipos de música electrónica: minimal, electro, techno, trance, house, incluso, es foro de música jazz y flamenco. Se sirven platillos árabes y hay narguiles (pipas para fumar) disponibles para los visitantes.",
    "external_urls": [
        "http://reservantro.blogspot.com/2013/08/reservantro.html",
        "https://www.facebook.com/grupohookah",
        "https://www.instagram.com/hookahloungecondesa/",
        "https://twitter.com/grupohookah",
        "https://hookahlounge.com.mx/hookahcondesa",
        "mailto:alicia@hookahlounge.com.mx"
    ],
    "url": "http://cdmxtravel.com/es/lugares/hookah-condesa.html",
    "destination": "Condesa"
}