{
    "name": "Parroquia de Santa Rosa de Lima",
    "labels": [
        "México monumental",
        "Por recinto"
    ],
    "price": "Gratuito",
    "categories": [
        "Recintos religiosos",
        "Con eventos"
    ],
    "schedule": [
        "08:00-20:00",
        "08:00-20:00",
        "08:00-20:00",
        "08:00-20:00",
        "08:00-20:00",
        "08:00-20:00",
        "08:00-20:00"
    ],
    "contact": "(55) 5273 4350",
    "location": {
        "map_url": "http://maps.google.com/maps?daddr=19.4085%2C-99.1769",
        "address": "Tamaulipas #177, Col. Hipódromo Condesa. 06170, Condesa"
    },
    "description": "El templo se construyó en 1943. No tiene un estilo arquitectónico definido, más bien es ecléctico.\n\nEs una parroquia de frailes dominicos que tiene como patrona a Santa Rosa de Lima, la primera santa originaria de América, que nació en España pero realizó sus milagros en Perú. Fue canonizada en 1671 por el papa Clemente X. En su interior están las imágenes de Santo Domingo de Guzmán, San Francisco de Asís, el Papa Pío V, la Divina Providencia y Santa Rosa de Lima. En la capilla se venera al Señor de las Maravillas.",
    "external_urls": null,
    "url": "http://cdmxtravel.com/es/lugares/parroquia-de-santa-rosa-de-lima.html",
    "destination": "Condesa"
}