{
    "name": "Galería Arróniz Arte Contemporáneo",
    "labels": [
        "Cultura todos los días"
    ],
    "price": "Gratuito",
    "categories": [
        "Galerías"
    ],
    "schedule": [
        "10:00-19:00",
        "10:00-19:00",
        "10:00-19:00",
        "10:00-19:00",
        "10:00-19:00",
        "11:00-14:00",
        "Cerrado"
    ],
    "contact": "(55) 5511 7965",
    "location": {
        "map_url": "http://maps.google.com/maps?daddr=19.4187%2C-99.1619",
        "address": "Tabasco #198, Roma Norte, Cuauhtémoc. 06700, Roma"
    },
    "description": "Arróniz Arte Contemporáneo abre sus puertas en octubre del 2006, con el objetivo de fomentar el trabajo de una nueva generación de artistas en México y Latinoamérica. Partiendo del uso del dibujo para el desarrollo de las obras, los artistas que representan transitan en diversos caminos, como pintura, fotografía, video, escultura e instalación.",
    "external_urls": [
        "https://www.facebook.com/GaleriaArroniz/",
        "https://www.instagram.com/galeriaarroniz/",
        "https://www.twitter.com/GaleriaArroniz",
        "http://www.arroniz-arte.com/",
        "mailto:info@arroniz-arte.com"
    ],
    "url": "http://cdmxtravel.com/es/lugares/galeria-arroniz-arte-contemporaneo.html",
    "destination": "Roma"
}