{
    "name": "Pista El Sope",
    "labels": [
        "En familia",
        "Diversión y adrenalina"
    ],
    "price": "Gratuito",
    "categories": [
        "Centros de entretenimiento familiares",
        "Espacios para correr"
    ],
    "schedule": [
        "Cerrado",
        "09:00-18:00",
        "09:00-18:00",
        "09:00-18:00",
        "09:00-18:00",
        "09:00-18:00",
        "09:00-18:00"
    ],
    "contact": null,
    "location": {
        "map_url": "http://maps.google.com/maps?daddr=19.4164%2C-99.2027",
        "address": "2da. Sección Bosque de Chapultepec. 11100, Polanco-Chapultepec"
    },
    "description": "La pista atlética El Sope recibe diariamente a aproximadamente mil corredores y está abierta los 365 días del año.\n\nHoy en día es uno de los mejores lugares para toda la comunidad atlética que lo visita, de esta manera se fomentan actividades sanas entre la sociedad.",
    "external_urls": [
        "https://www.facebook.com/ChapultepecCDMX",
        "https://www.instagram.com/chapultepeccdmx/",
        "https://www.tripadvisor.com.mx/Attraction_Review-g150800-d11925908-Reviews-El_Sope-Mexico_City_Central_Mexico_and_Gulf_Coast.html",
        "https://twitter.com/chapultepeccdmx",
        "http://chapultepec.cdmx.gob.mx/sitio/pista-atletica-el-sope"
    ],
    "url": "http://cdmxtravel.com/es/lugares/pista-el-sope.html",
    "destination": "Polanco-Chapultepec"
}