{
    "name": "Yak Casino Plaza Loreto",
    "labels": [
        "Tiempo libre"
    ],
    "price": "",
    "categories": [
        "Casinos",
        "bingos y salas de juegos"
    ],
    "schedule": [
        "11:00-02:00",
        "11:00-02:00",
        "11:00-02:00",
        "11:00-02:00",
        "11:00-03:00",
        "11:00-03:00",
        "11:00-02:00"
    ],
    "contact": null,
    "location": {
        "map_url": "http://maps.google.com/maps?daddr=19.3393%2C-99.1939",
        "address": "Altamirano #46, Col. Tizapan. 01090, San Ángel"
    },
    "description": "Yak es una empresa dedicada al entretenimiento para mayores de 18 años, a través de apuestas, tableros deportivos, bingo y mucho más.",
    "external_urls": [
        "https://www.facebook.com/pages/Yak/136468230076175"
    ],
    "url": "http://cdmxtravel.com/es/lugares/yak-casino-plaza-loreto.html",
    "destination": "San Ángel"
}