{
    "name": "Arena Coliseo",
    "labels": [
        "Puro sabor local",
        "En familia",
        "Diversión y adrenalina",
        "MICE",
        "Por recinto"
    ],
    "price": "Desde $60 MXN",
    "categories": [
        "Arenas de lucha libre",
        "Centros de entretenimiento familiares",
        "Centros deportivos",
        "Espacios de reunión",
        "Con eventos"
    ],
    "schedule": [
        "Cerrado",
        "Cerrado",
        "Cerrado",
        "Cerrado",
        "Cerrado",
        "11:00-21:00",
        "Cerrado"
    ],
    "contact": "(55) 5526 7765",
    "location": {
        "map_url": "http://maps.google.com/maps?daddr=19.4394%2C-99.1347",
        "address": "República de Perú #77, Col. Centro. 06040, Centro Histórico"
    },
    "description": "Es una arena para lucha libre y boxeo, conocida como “El Embudo de la Lagunilla” o \"El Embudo Coliseo\" debido a su forma circular. Su construcción fue financiada por el señor Salvador Lutteroth, considerado el padre de la lucha libre mexicana. Las taquillas abren únciamente los sábados. Se recomienda consultar las funciones para conocer los horarios y eventos.\n\n",
    "external_urls": [
        "https://www.facebook.com/cmll.oficial",
        "https://www.instagram.com/cmll_mx/",
        "https://instagram.com/cmll_mx/",
        "https://www.tripadvisor.com.mx/Attraction_Review-g150800-d12280212-Reviews-Arena_Coliseo-Mexico_City_Central_Mexico_and_Gulf_Coast.html",
        "https://twitter.com/CMLL_OFICIAL",
        "http://www.cmll.com/"
    ],
    "url": "http://cdmxtravel.com/es/lugares/arena-coliseo.html",
    "destination": "Centro Histórico"
}