{
    "name": "Casa Universitaria del Libro",
    "labels": [
        "Museos",
        "Cultura todos los días",
        "Por recinto"
    ],
    "price": "Gratuito",
    "categories": [
        "Arte",
        "Centros culturales",
        "Con eventos"
    ],
    "schedule": [
        "10:00-18:00",
        "10:00-18:00",
        "10:00-18:00",
        "10:00-18:00",
        "09:00-18:00",
        "Cerrado",
        "Cerrado"
    ],
    "contact": "+52 (55) 5511 4468",
    "location": {
        "map_url": "http://maps.google.com/maps?daddr=19.4231%2C-99.1607",
        "address": "Orizaba #24, Col. Roma. 06700, Roma"
    },
    "description": "Es un recinto que se suma a la difusión y la promoción de la palabra impresa. Pertenece a la Universidad Nacional Autónoma de México y se encuentra en la famosa colonia Roma. La Máxima Casa de Estudios es una de las principales casas editorales que se ha dedicado a publicar textos fundamentales para entender el presente y pasado de la historia de México y el mundo. El edificio cuenta con una sala de lectura y ofrece diversos cursos y talleres relacionados con el mundo del libro, además de diplomados, presentaciones de libros, conferencias, videoconferencias, webcast, exposiciones y proyecciones de películas.",
    "external_urls": [
        "https://www.facebook.com/casul.unam",
        "https://twitter.com/casulunam",
        "http://casul.humanidades.unam.mx/",
        "mailto:difusioncasul@gmail.com"
    ],
    "url": "http://cdmxtravel.com/es/lugares/casa-universitaria-del-libro.html",
    "destination": "Roma"
}