{
    "name": "Cinemex Reforma",
    "labels": [
        "Sé un espectador"
    ],
    "price": "",
    "categories": [
        "Cines"
    ],
    "schedule": [
        "10:00-23:00",
        "10:00-23:00",
        "10:00-23:00",
        "10:00-23:00",
        "10:00-23:00",
        "10:00-23:00",
        "10:00-23:00"
    ],
    "contact": "01 800 710 8888",
    "location": {
        "map_url": "http://maps.google.com/maps?daddr=19.4272%2C-99.1693",
        "address": "Río Guadalquivir #104, Col. Cuauhtémoc. 06500, Reforma-Zona Rosa"
    },
    "description": "Disfruta de las peliculas de cartelera en esta cadena de cines, no te pierdas los grandes estrenos!\n\nCheca los horarios en la página de internet.",
    "external_urls": [
        "https://www.facebook.com/Cinemex",
        "https://twitter.com/cinemex",
        "https://www.youtube.com/user/CinemexOficial",
        "http://cinemex.com/cine/35/cinemex-reforma"
    ],
    "url": "http://cdmxtravel.com/es/lugares/cinemex-reforma.html",
    "destination": "Reforma-Zona Rosa"
}