{
    "name": "New Orleans",
    "labels": [
        "Vive la noche"
    ],
    "price": "Desde $400 MXN",
    "categories": [
        "Bar"
    ],
    "schedule": [
        "Cerrado",
        "18:30-02:00",
        "18:30-02:00",
        "18:30-02:00",
        "18:30-02:00",
        "18:30-02:00",
        "18:30-02:00"
    ],
    "contact": "55 5550 1908",
    "location": {
        "map_url": "http://maps.google.com/maps?daddr=19.3477%2C-99.1907",
        "address": "Revolución #1655, Col. San Ángel. 01000, San Ángel"
    },
    "description": "Se denominan la Catedral del Jazz y el Blues, ya que se presentan bandas en vivo que amenizan el ambiente junto a la mejor actitud de los visitantes, las diversas bebidas son uno de los hits del lugar.",
    "external_urls": [
        "https://www.facebook.com/RestauranteBarNewOrleans?fref=ts",
        "https://twitter.com/neworleans_jazz",
        "https://nwjazz.wordpress.com/"
    ],
    "url": "http://cdmxtravel.com/es/lugares/new-orleans.html",
    "destination": "San Ángel"
}