{
    "name": "La Camelia Cantabar",
    "labels": [
        "Vive la noche"
    ],
    "price": "Desde $200 MXN",
    "categories": [
        "Bar",
        "Karaoke"
    ],
    "schedule": [
        "12:00-20:00",
        "12:00-20:00",
        "12:00-20:00",
        "12:00-21:00",
        "12:00-02:00",
        "12:00-02:00",
        "12:00-20:00"
    ],
    "contact": "+52 (55) 5616 5643",
    "location": {
        "map_url": "http://maps.google.com/maps?daddr=19.345%2C-99.1913",
        "address": "Francisco I. Madero #3, Col. San Ángel. 01000, San Ángel"
    },
    "description": "Hay una gran tradición que envuelve a Camelia de Noche, ya que desde 1931 es un bar de San Ángel. Cuenta con una amplia carta en platillos mexicanos, pero también bebidas de todo tipo, además de un ambiente inigualable. También ofrece servicio en su terraza, desde donde se puede contemplar el San Ángel tradicional. Además los fines de semana por la noche ofrece el servicio de cantabar.",
    "external_urls": [
        "https://www.instagram.com/explore/locations/808466035/la-camelia-cantabar",
        "https://www.tripadvisor.com.mx/Restaurant_Review-g150800-d7591200-Reviews-La_Camelia-Mexico_City_Central_Mexico_and_Gulf_Coast.html",
        "https://twitter.com/cameliacantabar",
        "https://www.queremoscomer.rest/bares-y-antros/cantabar/san-angel-altavista/la-camelia/"
    ],
    "url": "http://cdmxtravel.com/es/lugares/la-camelia-cantabar.html",
    "destination": "San Ángel"
}