{
    "name": "Centro Cultural Vladimir Kaspé",
    "labels": [
        "Cultura todos los días"
    ],
    "price": "",
    "categories": [
        "Bibliotecas",
        "Centros culturales"
    ],
    "schedule": null,
    "contact": "+52 (55) 5278 9573",
    "location": {
        "map_url": "http://maps.google.com/maps?daddr=19.4087%2C-99.1814",
        "address": "Benjamín Hill #43, Col. Condesa. 06140, Condesa"
    },
    "description": "Ubicado en la Universidad La Salle, se trata de un punto de reunión para jóvenes que gustan del arte y la cultura en todas sus expresiones. El nombre del lugar recuerda al arquitecto mexicano que construyó importantes obras en colonias cosmopolitas como Polanco o Lomas.\n\nSe recomienda consultar la página de la universidad para conocer los horarios y eventos.",
    "external_urls": [
        "http://www.lasalle.mx/",
        "mailto:mavt@ulsa.mx"
    ],
    "url": "http://cdmxtravel.com/es/lugares/centro-cultural-vladimir-kaspe.html",
    "destination": "Condesa"
}