{
    "name": "Templo El Mesías Iglesia Metodista de México A. R.",
    "labels": [
        "México monumental"
    ],
    "price": "",
    "categories": [
        "Recintos religiosos"
    ],
    "schedule": [
        "09:00-21:00",
        "09:00-21:00",
        "09:00-21:00",
        "09:00-21:00",
        "09:00-21:00",
        "09:00-21:00",
        "09:00-21:00"
    ],
    "contact": "+52 (55) 5512 1608",
    "location": {
        "map_url": "http://maps.google.com/maps?daddr=19.4339%2C-99.1478",
        "address": "Balderas #47, Col. Centro. 06020, Alameda"
    },
    "description": "Es un templo de la Iglesia Metodista Episcopal que se estableció en 1873, con ayuda del obispo Juan C. Keener quien junto con Sóstenes Juárez, otro protestante liberal, compraron la Capilla de San Andrés, donde fue embalsamado el cuerpo de Maximiliano de Habsburgo.\n\nEn el siglo XIX cambiaron de residencia a la ubicación actual con la finalidad de estar en un lugar más amplio. El edificio es una joya de la arquitectura gótica del estilo inglés. La primera misa se ofició en 1901 en ese sitio.",
    "external_urls": [
        "http://www.temploelmesias.org/",
        "mailto:info@immarbalderas.org.mx"
    ],
    "url": "http://cdmxtravel.com/es/lugares/templo-el-mesias-iglesia-metodista-de-mexico-a-r.html",
    "destination": "Alameda"
}