{
    "name": "Pasaje Moneda-Soledad",
    "labels": [
        "Puro sabor local"
    ],
    "price": "",
    "categories": [
        "Mercados y bazares"
    ],
    "schedule": [
        "09:00-19:30",
        "09:00-19:30",
        "09:00-19:30",
        "09:00-19:30",
        "09:00-19:30",
        "09:00-19:30",
        "Cerrado"
    ],
    "contact": null,
    "location": {
        "map_url": "http://maps.google.com/maps?daddr=19.4333%2C-99.1295",
        "address": "Moneda 19 a Soledad 8, colonia Centro 06000, Centro Histórico"
    },
    "description": "En los distintos locales de este pasaje encontrarás juguetes modestos e importaciones diversas: paraguas, bolsos y mochilas de materiales sintéticos, por ejemplo. La mayoría de los locales ofrece mayoreo y menudeo.\n\nInformación proporcionada por el Fideicomiso del Centro Histórico.",
    "external_urls": null,
    "url": "http://cdmxtravel.com/es/lugares/pasaje-moneda-soledad.html",
    "destination": "Centro Histórico"
}