{
    "name": "Bahía Bar",
    "labels": [
        "Vive la noche"
    ],
    "price": "Desde $200 MXN",
    "categories": [
        "Antro",
        "Bar"
    ],
    "schedule": [
        "13:00-15:00",
        "Cerrado",
        "13:00-15:00",
        "20:00-23:59",
        "20:00-02:00",
        "20:00-02:00",
        "Cerrado"
    ],
    "contact": "+52 (55) 5709 6227",
    "location": {
        "map_url": "http://maps.google.com/maps?daddr=19.4274%2C-99.1509",
        "address": "Tolsá #36, Col. Juárez. 06060, Alameda"
    },
    "description": "Bailar con buena música no es una petición en Bahía Bar, sino lo cotidiano y justo para todos los clientes que religiosamente visitan el corazón de la Juárez. También cuenta con un menú rico en tortas, cochinita pibil, cervezas a excelente precio y mucho más.",
    "external_urls": [
        "https://www.facebook.com/BahiaBar",
        "mailto:leon.rodga547@gmail.com"
    ],
    "url": "http://cdmxtravel.com/es/lugares/bahia-bar.html",
    "destination": "Alameda"
}