{
    "name": "Dónde hacer picnics en la CDMX",
    "labels": [
        "Al aire libre",
        "MICE"
    ],
    "price": "",
    "categories": [
        "Parques",
        "Jardines",
        "Bosques",
        "Lagos",
        "Espacios de reunión"
    ],
    "schedule": null,
    "contact": null,
    "location": {
        "map_url": "http://maps.google.com/maps?daddr=19.4194%2C-99.1893",
        "address": "Bosque de Chapultepec, Ciudad de México 11580, Polanco-Chapultepec"
    },
    "description": "A continuación, enlistamos algunos de los sitios más espectaculares que pueden servir de maravilla para hacer un delicioso picnic. Escenarios en los que el ambiente campirano puede sentirse a pesar de estar escondido en las profundidades de nuestra metrópoli.\n\nCineteca Nacional\n\nA partir de la sofisticada remodelación que se hizo a este recinto del cine nacional, se adecuaron algunos jardines que, combinados con la estructura arquitectónica del sitio, resultan en escenarios muy agradables para pasar un rato. Precisamente aquí puedes disfrutar de un cómodo picnic e incluso te puede tocar una función de cine al aire libre.\n\nUbicación: Av. México-Coyoacán 389, col. Xoco, del. Benito Juárez.\n\nParque Lincoln\n\nEl lugar esta ubicado en Polanco, y es uno de los parques más especiales de la ciudad. Además, está rodeado por bancas estratégicamente posicionadas que acompañan a la perfección los espejos de agua dispuestos en distintos puntos del parque. Esta opción, es muy práctica por su céntrica ubicación y favorece momentos oníricos y poéticos.\n\nUbicación: Av. Emilio Castelar, col. Chapultepec Polanco.\n\nJardín del Arte A.C. Sullivan (Jardín del Arte de la Colonia Cuauhtémoc)\n\nSe trata de un pequeño bazar considerado entre las galerías de arte y artesanías más grandes del mundo. Se recomienda ir durante el día ya que es cuando sus jardines tienen un ambiente muy tranquilo. Aquí podrás tener un picnic acompañado de un folclor de fondo que te dará mucho para contemplar.\n\nUbicación: James E. Sullivan (José Rosas Moreno), del. Cuauhtémoc.\n\nBosque de Chapultepec\n\nEn este maravilloso pulmón verde se pueden admirar sus pinos, ahuehuetes, tules, los museos que lo circundan y el lago artificial. Aspectos que te inyectarán de vitalidad, ofreciéndo un rápido y delicioso escape de la ciudad. De hecho, los fines de semana, los citadinos ocupan la mayor parte del lugar justamente para gozar del espacio natural con alguna comida que hayan llevado o solamente relajarse bajo algún árbol.\n\nUbicación: Paseo de la Reforma.\n\nZona Arqueológica Cuicuilco\n\nEn pocas ciudades del mundo es posible hacer un picnic que esté enmarcado por una zona arqueológica, y además que tenga una singular pirámide circular como pantalla. Pues en este vestigio arqueológico sí podrás hacerlo en sus jardines, lo cual te garantiza un picnic con un singular ambiente de historia y cultura.\n\nUbicación: Av. Insurgentes, col. Isidro Fabela.\n\nBosque de Tlalpan\n\nEl Bosque de Tlalpan es uno de los espacios mejor preservados de nuesra urbe. El secreto del lugar radica en subir una tangente que te lleva hacia el zoológico interno, el cual se ubica en el área superior del bosque. Ahí encontrarás bancas y cabañas perfectas para el picnic que quieras armar.\n\nUbicación: Esquina Zacatepetl, Camino a Santa Teresa, Parque Nacional Bosque del Pedregal.\n\n\n\n\n\n\n\n",
    "external_urls": null,
    "url": "http://cdmxtravel.com/es/lugares/donde-hacer-picnics-en-la-cdmx.html",
    "destination": "Polanco-Chapultepec"
}