{
    "name": "Monolito a Tláloc",
    "labels": [
        "México monumental",
        "Museos"
    ],
    "price": "Gratuito",
    "categories": [
        "Monumentos",
        "Patrimonio Mundial Cultural",
        "Museos de arte e historia"
    ],
    "schedule": null,
    "contact": null,
    "location": {
        "map_url": "http://maps.google.com/maps?daddr=19.4256%2C-99.1875",
        "address": "Paseo de la Reforma s/n, Col. Chapultepec Polanco. 11560, Polanco-Chapultepec"
    },
    "description": "Este monolito se encuentra sobre Paseo de la Reforma y destaca por su peso neto, que es de 125 toneladas, con una altura de siete metros. Fue localizado en el pueblo de Coatlinchán, Estado de México, y ahora forma parte de las colecciones resguardadas por el Museo Nacional de Antropología. El monolito está inconcluso, pero se sabe que representa a Tláloc, dios del agua, elemento fundamental en la vida de los pobladores de Teotihuacán.",
    "external_urls": null,
    "url": "http://cdmxtravel.com/es/lugares/monolito-a-tlaloc.html",
    "destination": "Polanco-Chapultepec"
}