{
    "name": "Dos Naciones",
    "labels": [
        "Vive la noche"
    ],
    "price": "Desde $200 MXN",
    "categories": [
        "Cantina"
    ],
    "schedule": [
        "09:00-00:00",
        "09:00-00:00",
        "09:00-00:00",
        "09:00-00:00",
        "09:00-00:00",
        "09:00-00:00",
        "09:00-00:00"
    ],
    "contact": "+52 (55)  5526-5867",
    "location": {
        "map_url": "http://maps.google.com/maps?daddr=19.439%2C-99.1414",
        "address": "Calle Mina #13,CDMX 06300, Centro Histórico"
    },
    "description": "Hotel Dos Naciones nace en 1957, como producto del esfuerzo de Don. Ernesto Vázquez Álvarez y con el objetivo de brindar un servicio de hospedaje de calidad y confianza, en la Ciudad de México. Con el mismo ánimo y calidez con la que él inició, hoy nos esforzamos por cubrir todas las necesidades de nuestros clientes, con los mejores precios.",
    "external_urls": [
        "http://www.hoteldosnaciones.com.mx/",
        "mailto:reservaciones@hoteldosnaciones.com.mx"
    ],
    "url": "http://cdmxtravel.com/es/lugares/dos-naciones.html",
    "destination": "Centro Histórico"
}