{
    "name": "Aventurarse México Escalódromo",
    "labels": [
        "Diversión y adrenalina"
    ],
    "price": "Desde $500 MXN",
    "categories": [
        "Escalódromos"
    ],
    "schedule": [
        "Cerrado",
        "Cerrado",
        "Cerrado",
        "Cerrado",
        "Cerrado",
        "09:00-15:00",
        "09:00-15:00"
    ],
    "contact": "+52 (55) 5926 5245",
    "location": {
        "map_url": "http://maps.google.com/maps?daddr=19.3287%2C-99.1894",
        "address": "Insurgentes Sur s/n, Col. Ciudad Universitaria. 04510, Ciudad Universitaria"
    },
    "description": "Aventurarse México es una empresa con equipo e instructores capacitados en montañismo. Ofrecen diversas actividades de distinta intensidad para que incluso los niños puedan divertirse escalando o lanzándose de la tirolesa. Su ubicación principal es Ciudad Universitaria, pero también son expertos en organizar salidas a lugares como Pachuca, Aculco, Xilotepec y diferentes zonas de la Ciudad de México. Cuentan con más de una década de experiencia.\n\nConsultar las actividades de escalada en la página o en los teléfonos del grupo.\n\nSitio WebFacebook",
    "external_urls": [
        "https://www.facebook.com/aventurarse.mexico?fref=ts",
        "http://www.aventurarsemexico.com",
        "mailto:aventurarsemex@hotmail.com"
    ],
    "url": "http://cdmxtravel.com/es/lugares/aventurarse-mexico-escalodromo.html",
    "destination": "Ciudad Universitaria"
}