{
    "name": "Bet Hakneset Monte Sinai Querétaro",
    "labels": [
        "México monumental"
    ],
    "price": "",
    "categories": [
        "Recintos religiosos"
    ],
    "schedule": [
        "07:00-19:00",
        "07:00-19:00",
        "07:00-19:00",
        "07:00-19:00",
        "07:00-19:00",
        "07:00-19:00",
        "07:00-19:00"
    ],
    "contact": "5596 9966 ext. 225",
    "location": {
        "map_url": "http://maps.google.com/maps?daddr=19.4147%2C-99.1609",
        "address": "Querétaro #110, Col. Roma Norte. 06700, Roma"
    },
    "description": "Es un templo que pertenece a la Sociedad de Beneficiencia Alianza Monte Sinaí I.A.P. Su historia se remonta a 1941 cuando la directiva compró el terreno en la calle Querétaro y se inauguró en 1953 bajo la presidencia de Elías Atri. Es una construcción imponente de dos pisos con capacidad para albergar a 1000 personas. Tiene un mural en la parte superior del Hejal elaborado con hoja de oro que simboliza el primer día de la creación del Universo. Hay dos grandes leones de mármol que sostienen las tablas de la ley en el Hejal.",
    "external_urls": [
        "https://www.facebook.com/msinaimx/",
        "https://www.instagram.com/msinaimx/",
        "https://www.youtube.com/c/msinaimx",
        "https://msinai.mx"
    ],
    "url": "http://cdmxtravel.com/es/lugares/bet-hakneset-monte-sinai-queretaro.html",
    "destination": "Roma"
}