{
    "name": "Museo de Zoología Alfonso Herrera",
    "labels": [
        "Museos",
        "En familia"
    ],
    "price": "Gratuito",
    "categories": [
        "Ciencia e historia",
        "Centros de entretenimiento familiares",
        "Museos de arte e historia"
    ],
    "schedule": [
        "09:00-15:00",
        "09:00-15:00",
        "09:00-15:00",
        "09:00-15:00",
        "09:00-15:00",
        "Cerrado",
        "Cerrado"
    ],
    "contact": "(55) 5622 4825",
    "location": {
        "map_url": "http://maps.google.com/maps?daddr=19.3242%2C-99.1809",
        "address": "Circuito Exterior s/n, Col. Ciudad Universitaria. 04510, Ciudad Universitaria"
    },
    "description": "El museo muestra la sistemática y biogeografía de aves y mamíferos de Mesoamérica. Se encuentra en el Departamento de Biología Evolutiva en el interior de la Facultad de Ciencias de la UNAM. La Colección se inició en 1978 con 400 ejemplares de aves y mamíferos, producto de dos tesis profesionales, pero ha ido creciendo con el tiempo gracias a nuevos proyectos de investigación. Ahora se cuenta con colecciones de tejidos congelados, esqueletos, huellas, vocalizaciones digitalizadas, contenidos estomacales y fotografías. En el museo hay 85% de los taxones o grupos emparentados de México.\n\nTiene 10 mil ejemplares de mamíferos debidamente georreferenciados, con 200 especímenes específicamente del país, lo que representa un 42% del total. También se han colectado ectoparásitos, principalmente pulgas. En cuanto a las aves, cuenta con 18 mil especímenes en piel y conservados en líquido, mil esqueletos, 800 contenidos estomacales y algunos nidos y huevecillos, provenientes de todos los estados del país y de Estados Unidos, Canadá, Costa Rica, Cuba y Venezuela. La colección de tejidos comprende 5 mil muestras de aves mexicanas y 2 mil 500 de mamíferos.\n\n",
    "external_urls": [
        "https://www.facebook.com/pages/Museo-de-Zoolog%C3%ADa-Alfonso-L-Herrera/377931306080918",
        "http://mzfcaves.fciencias.unam.mx",
        "mailto:aves.uniciencias@ciencias.unam.mx"
    ],
    "url": "http://cdmxtravel.com/es/lugares/museo-de-zoologia-alfonso-herrera.html",
    "destination": "Ciudad Universitaria"
}