{
    "name": "Galería de Arte Schwarzstein",
    "labels": [
        "Cultura todos los días"
    ],
    "price": "",
    "categories": [
        "Galerías"
    ],
    "schedule": [
        "11:00-18:00",
        "11:00-18:00",
        "11:00-18:00",
        "11:00-18:00",
        "11:00-18:00",
        "Cerrado",
        "Cerrado"
    ],
    "contact": "(55) 5281-2220",
    "location": {
        "map_url": "http://maps.google.com/maps?daddr=19.4333%2C-99.1933",
        "address": "Aristóteles #165, Col. Polanco. 11550, Polanco-Chapultepec"
    },
    "description": "Bertha Schwarzstein fundó la galería en 1980 y desde entonces ha sido un espacio de promoción y difusión del arte contemporáneo mexicano y latinoamericano. Ahí se expone pintura, escultura, cerámica y tapiz. Sus actividades abarcan happenings, performances, cursos de historia del arte, pintura para jóvenes y adultos.",
    "external_urls": [
        "http://bsgaleria.mx/",
        "https://www.facebook.com/bsgaleria",
        "https://www.instagram.com/bsgaleria.mx/",
        "https://twitter.com/bsgaleria",
        "http://www.schwarscteingaleria.com.mx/node/247",
        "mailto:ventas@bsgaleria.mx"
    ],
    "url": "http://cdmxtravel.com/es/lugares/galeria-de-arte-schwarzstein.html",
    "destination": "Polanco-Chapultepec"
}