{
    "name": "Museo Británico Americano",
    "labels": [
        "Museos"
    ],
    "price": "",
    "categories": [
        "Ciencia e historia"
    ],
    "schedule": [
        "Cerrado",
        "11:00-18:00",
        "11:00-18:00",
        "11:00-18:00",
        "11:00-18:00",
        "10:00-17:00",
        "Cerrado"
    ],
    "contact": "+52 (55) 5510 0469",
    "location": {
        "map_url": "http://maps.google.com/maps?daddr=19.4328%2C-99.1464",
        "address": "Artículo #123, Col. Centro. 06000, Alameda"
    },
    "description": "Un temblor dio origen al museo, que antiguamente era la Antigua Christ Church, la que fuera la primera catedral anglicana en México. Tras el derrumbe ocasionado por el movimiento telúrico se decidió convertirlo en un espacio para la cultura y el intercambio de ideas.\n\nLa anexión del nombre \"americano\" al museo se debe a que la Embajada Americana otorgó dinero para la remoción de restos, así como al arreglo del mismo. Actualmente ya no hay ninguna actividad eclesiástica, pero sí ciclos de cine, presentaciones de libros, exposiciones temporales y mucho más.",
    "external_urls": [
        "https://www.facebook.com/centroculturaltudor?fref=ts",
        "https://www.instagram.com/CentroTudor/",
        "https://twitter.com/CentroTudor"
    ],
    "url": "http://cdmxtravel.com/es/lugares/museo-britanico-americano.html",
    "destination": "Alameda"
}