{
    "name": "Pedalea México",
    "labels": [
        "Diversión y adrenalina"
    ],
    "price": "Desde $600 MXN",
    "categories": [
        "Ciclovías"
    ],
    "schedule": [
        "09:00-18:00",
        "09:00-18:00",
        "09:00-18:00",
        "09:00-18:00",
        "09:00-18:00",
        "09:00-18:00",
        "09:00-18:00"
    ],
    "contact": "04455 1828 3466",
    "location": {
        "map_url": "http://maps.google.com/maps?daddr=19.355%2C-99.1624",
        "address": "Recorridos en delegaciones Coyoacán, Cuauhtémoc y Miguel Hidalgo.  04100, Coyoacán"
    },
    "description": "Combina bicitours con cultura, gastronomía e historia.\n\nRutas de bicitours por la Ciudad de México, que integran un paseo en bicicleta con visitas guiadas a los mejores puntos gastronómicos, históricos y artísticos de la CDMX. Todos los tours incluyen bicicletas de 18 velocidades, casco, entrada al museo del recorrido, lunch box, plática de seguridad vial y el acompañamiento de un guía experto en todo momento.\n\nRecorridos:\n\nPedaleo cultural (Zócalo, Ángel de la Independencia, Monumento a la Revolución, Exposición Fotográfica de Reforma, Castillo de Chapultepec)Paseo de Frida (Parque México, Colonia Condesa, Centro de Coyoacán, Museo de Frida Kahlo, Viveros de Coyoacán)Sabores de México (Parque México, Colonia Condesa, Museo del Chocolate, Zócalo, Palacio de Bellas Artes, Mercado de San Juan)",
    "external_urls": [
        "https://www.facebook.com/PedaleaMX/",
        "https://www.instagram.com/pedaleamexico/",
        "https://twitter.com/Pedalea_mexico?lang=es",
        "https://www.pedaleamexico.com/",
        "mailto:pedaleamexico@gmail.com"
    ],
    "url": "http://cdmxtravel.com/es/lugares/pedalea-mexico.html",
    "destination": "Coyoacán"
}