{
    "name": "Mercado Artesanal Mexicano",
    "labels": [
        "Puro sabor local",
        "Tiempo libre"
    ],
    "price": "",
    "categories": [
        "Mercados y bazares",
        "Artesanías",
        "Diseño mexicano"
    ],
    "schedule": [
        "11:00-21:00",
        "11:00-21:00",
        "11:00-21:00",
        "11:00-21:00",
        "10:00-23:00",
        "10:00-23:00",
        "10:00-23:00"
    ],
    "contact": "+52 (55) 5588 4531",
    "location": {
        "map_url": "http://maps.google.com/maps?daddr=19.35%2C-99.1629",
        "address": "Felipe Carrillo Puerto #25, Col. Villa Coyoacán. 04000, Coyoacán"
    },
    "description": "Este mercado tiene una gran variedad de curiosidades y artesanías mexicanas, ahí se pueden se puede comprar un cuadro pintado por algún artista independiente, una falda bordada, unos zapatos de piel hechos a mano, joyas y hasta dulces típicos.",
    "external_urls": [
        "https://es-es.facebook.com/pg/MercadoArtesanalMexicanodeCoyoacan/posts/",
        "https://www.tripadvisor.com.mx/Attraction_Review-g150800-d10306566-Reviews-Mercado_Artesanal_Mexicano-Mexico_City_Central_Mexico_and_Gulf_Coast.html",
        "https://mercado-artesanal-mexicano.business.site"
    ],
    "url": "http://cdmxtravel.com/es/lugares/mercado-artesanal-mexicano.html",
    "destination": "Coyoacán"
}