{
    "name": "Café Bar Génova",
    "labels": [
        "Puro sabor local",
        "Vive la noche",
        "MICE"
    ],
    "price": "Desde $200 MXN",
    "categories": [
        "Patrimonio Cultural Inmaterial",
        "Bar",
        "Espacios de reunión"
    ],
    "schedule": [
        "08:00-23:00",
        "08:00-23:00",
        "08:00-23:00",
        "08:00-03:00",
        "08:00-03:00",
        "08:00-03:00",
        "08:00-23:00"
    ],
    "contact": "+52 (55) 5208 2840",
    "location": {
        "map_url": "http://maps.google.com/maps?daddr=19.4252%2C-99.1634",
        "address": "Calle Genova 71 Cuauhtemoc, Ciudad de México, México. 06600, Reforma-Zona Rosa"
    },
    "description": "Como su nombre lo dice es un café confortable, con mesas en el exterior y una carta internacional exquisita, pero por las tardes y noches esto se convierte en un punto de encuentro para los habitantes de la zona. Ideal para precopear o cenar antes del antro.",
    "external_urls": [
        "https://www.facebook.com/cafegenovaspencer",
        "https://www.tripadvisor.com.mx/Restaurant_Review-g150800-d10356185-Reviews-Cafe_Bar_Genova-Mexico_City_Central_Mexico_and_Gulf_Coast.html"
    ],
    "url": "http://cdmxtravel.com/es/lugares/cafe-bar-genova.html",
    "destination": "Reforma-Zona Rosa"
}