{
    "name": "Museo de la Colección Jumex",
    "labels": [
        "Museos",
        "Tiempo libre"
    ],
    "price": "Desde $50 MXN",
    "categories": [
        "Arte",
        "Singulares",
        "Diseño mexicano",
        "Museos de arte e historia"
    ],
    "schedule": [
        "Cerrado",
        "11:00-20:00",
        "11:00-20:00",
        "11:00-20:00",
        "11:00-20:00",
        "11:00-20:00",
        "11:00-20:00"
    ],
    "contact": "+52 (55) 5395 2615",
    "location": {
        "map_url": "http://maps.google.com/maps?daddr=19.4408%2C-99.2046",
        "address": "Blvd. Miguel de Cervantes Saavedra #303, Col. Ampliación Granada. 11529, Polanco-Chapultepec"
    },
    "description": "El Museo de la colección Jumex es el más reciente espacio de vanguardia de la Ciudad de México. El edificio, diseñado por el arquitecto británico David Chipperfield, fue pensado para fomentar el descubrimiento, la reflexión y el aprendizaje del arte contemporáneo, mediante un programa crítico que cuestiona los paradigmas de pensamiento y los grandes temas de nuestro tiempo.\n\nCon líneas rectas, cantera y mármol claros y énfasis en la luz natural, el Museo Jumex es un espacio museístico vanguardista. Los altísimos techos y la excelente iluminación hacen de la visita una experiencia para los sentidos.\n\nEl museo muestra parte del acervo de la Colección Jumex que fue fundada en el 2001 para conservar y promover la producción artística de la segunda mitad del siglo XX a la actualidad. La colección se ha convertido en uno de los acervos de arte contemporáneo más trascendentales de toda América Latina, posicionándose como un referente cultural en México y en el mundo. Por si fuera poco, este museo ha creado varias alianzas con distintas escuelas de la ciudad para ofrecer actividades y programas que sean atractivos para los niños desde preescolar y que vayan acorde con su programa escolar. Así aprender se vuelve mucho más divertido.",
    "external_urls": [
        "https://www.facebook.com/Fundaci%C3%B3n-Jumex-Arte-Contempor%C3%A1neo-84295854183/timeline/",
        "https://instagram.com/museojumex/",
        "https://www.tripadvisor.com.mx/Attraction_Review-g150800-d6603058-Reviews-Museo_Jumex-Mexico_City_Central_Mexico_and_Gulf_Coast.html",
        "https://twitter.com/FundacionJumex",
        "http://fundacionjumex.org/#museo.html",
        "mailto:info@museojumex.org"
    ],
    "url": "http://cdmxtravel.com/es/lugares/museo-de-la-coleccion-jumex.html",
    "destination": "Polanco-Chapultepec"
}