{
    "name": "Mercado de Azcapotzalco",
    "labels": [
        "Puro sabor local",
        "Shopping"
    ],
    "price": "",
    "categories": [
        "Mercados y bazares",
        "Artesanías",
        "Comercios centenarios"
    ],
    "schedule": [
        "07:30-18:00",
        "07:30-18:00",
        "07:30-18:00",
        "07:30-18:00",
        "07:30-18:00",
        "07:30-18:00",
        "07:30-18:00"
    ],
    "contact": "55 5354 9994",
    "location": {
        "map_url": "http://maps.google.com/maps?daddr=19.4829%2C-99.1858",
        "address": "Av. Azcapotzalco s/n, Col. Azcapotzalco Centro.  02000, Azcapotzalco"
    },
    "description": "Uno de los puntos de encuentro y convivencia de la zona, se localiza a unos pasos del edificio delegacional de Azcapotzalco. En el lugar se ofertan variedad de frutas, verduras, dulces y en temporadas especiales se vende pan de muerto, adornos para celebrar el 15 de septiembre, Día de Muertos y Navidad.\n\nDestaca por sus naves pintadas en vino y blanco. El inmueble está rodeado de comercios tradicionales, así como por la famosa cantina El Dux de Venecia.\n\n\n\n",
    "external_urls": null,
    "url": "http://cdmxtravel.com/es/lugares/mercado-de-azcapotzalco.html",
    "destination": "Azcapotzalco"
}