{
    "name": "Julio de Mucha",
    "labels": [
        "Shopping"
    ],
    "price": "",
    "categories": [
        "Moda"
    ],
    "schedule": [
        "11:00-20:30",
        "11:00-20:30",
        "11:00-20:30",
        "11:00-20:30",
        "11:00-20:30",
        "11:00-20:30",
        "11:00-19:00"
    ],
    "contact": "+52 (55) 5564 1782",
    "location": {
        "map_url": "http://maps.google.com/maps?daddr=19.4119%2C-99.1677",
        "address": "Ámsterdam #264, Col. Condesa. 06140, Condesa"
    },
    "description": "Firma mexicana dedicada a diseñar y producir calzado cómodo y con estilo. Su secreto es el modelo y el confort. Julia de Mucha se ha enfocado a la creación de zapatos, cuyas bondades satisfagan las necesidades de sus clientes. Las colecciones son variadas y las líneas ofrecen opciones para toda ocasión.",
    "external_urls": [
        "https://juliodemuchablog.wordpress.com/",
        "https://www.facebook.com/juliodemuchacalzado",
        "https://instagram.com/juliodemucha/",
        "https://es.pinterest.com/juliodemucha/",
        "https://twitter.com/juliodemucha",
        "https://www.youtube.com/channel/UCeS-ATxHitMQebzpSs1IlxQ",
        "http://juliodemucha.com.mx/"
    ],
    "url": "http://cdmxtravel.com/es/lugares/julio-de-mucha.html",
    "destination": "Condesa"
}