{
    "name": "Espacio Escultórico de la UNAM",
    "labels": [
        "Museos",
        "México monumental",
        "Al aire libre",
        "Cultura todos los días",
        "Por recinto"
    ],
    "price": "Gratuito",
    "categories": [
        "Arte",
        "Monumentos",
        "Parques",
        "Centros culturales",
        "Con eventos"
    ],
    "schedule": [
        "10:00-15:00",
        "10:00-15:00",
        "10:00-15:00",
        "10:00-15:00",
        "10:00-15:00",
        "Cerrado",
        "Cerrado"
    ],
    "contact": "+52 (55) 5622 7008",
    "location": {
        "map_url": "http://maps.google.com/maps?daddr=19.3188%2C-99.1825",
        "address": "Mario de La Cueva s/n, Col. Ciudad Universitaria. 04510, Ciudad Universitaria"
    },
    "description": "Un espacio fascinante ubicado dentro de la reserva ecológica de Ciudad Universitaria (UNAM). Un paseo que integra arte y ecología. Un anillo de tezontle con suelo de lava negra es el centro. Aparecen entre el pedregal esculturas de metal que contrastan fuertemente con el paisaje.\n\nSu diámetro exterior es de 120 metros, mientras que la zona interior mide 92.78 metros, con un espacio de ancho de plataforma de 13.61 metros. Dicha plataforma está construida a partir de piedra volcánica y sobre ella se levantan una serie de módulos de base rectangular de 9x 3 metros con una altura de 4 metros.\n\nSu objetivo es representar el cosmos con referencia a la cultura prehispánica, por ello las figuras fueron creadas por siete artistas pertenecientes al movimiento del Geometrismo Estético.\n\nAlgunas de las obras expuestas son: Las serpientes del Pedregal y Ocho conejos, de Federico Silva; Ave dos, de Hersúa; Coatl, de Helen Escobedo; Colotl, de Sebastián; Corona del Pedregal, de Mathias Goeritz, y Variante de la llave de Kepler, de Manuel Felguérez.\n\n",
    "external_urls": [
        "https://www.facebook.com/ccuvisitaguiada?fref=ts",
        "https://www.tripadvisor.com.mx/Attraction_Review-g150800-d10229950-Reviews-Espacio_escultorico_de_la_UNAM-Mexico_City_Central_Mexico_and_Gulf_Coast.html",
        "http://www.difusioncultural.unam.mx/visitasguiadas/?page_id=10"
    ],
    "url": "http://cdmxtravel.com/es/lugares/espacio-escultorico-de-la-unam.html",
    "destination": "Ciudad Universitaria"
}