{
    "name": "Apotheke",
    "labels": [
        "Vive la noche"
    ],
    "price": "Desde $500 MXN",
    "categories": [
        "Antro",
        "Bar"
    ],
    "schedule": [
        "Cerrado",
        "Cerrado",
        "Cerrado",
        "22:00-04:00",
        "22:00-04:00",
        "22:00-04:00",
        "Cerrado"
    ],
    "contact": "+52 (55) 4796 1318",
    "location": {
        "map_url": "http://maps.google.com/maps?daddr=19.4201%2C-99.1676",
        "address": "Durango #205 int. 2, Col. Roma Norte. 06700, Roma"
    },
    "description": "Exclusivo bar y restaurante en la colonia Roma, con un ambiente casual y sofisticado. Está inspirado en la tradición europea del siglo XIX, donde el absenta es la bebida por excelencia. Un sitio para dejarse soprender por los cocteles más innovadores y la mejor música actual.",
    "external_urls": [
        "https://www.facebook.com/ApothekeDF",
        "https://www.instagram.com/apothekedf/",
        "http://twitter.com/ApothekeDF",
        "http://www.apothekeclub.com/",
        "mailto:apothekedf@hotmail.com"
    ],
    "url": "http://cdmxtravel.com/es/lugares/apotheke.html",
    "destination": "Roma"
}