{
    "name": "Monumento a la Revolución",
    "labels": [
        "México monumental",
        "MICE"
    ],
    "price": "Desde $50 MXN",
    "categories": [
        "Monumentos",
        "Rascacielos y miradores",
        "Espacios de reunión"
    ],
    "schedule": [
        "12:00-20:00",
        "12:00-20:00",
        "12:00-20:00",
        "12:00-20:00",
        "12:00-22:00",
        "12:00-22:00",
        "10:00-20:00"
    ],
    "contact": "+52 (55) 5592 2038",
    "location": {
        "map_url": "http://maps.google.com/maps?daddr=19.4362%2C-99.1546",
        "address": "Plaza de la República s/n, Col. Tabacalera. 06030, Alameda"
    },
    "description": "El Monumento a la Revolución Mexicana es una obra arquitectónica inconclusa, que en realidad iba a ser el Palacio de la Cámara de Diputados y Senadores. Del proyecto original queda la cúpula.\n\nDentro del monumento un elevador de cristal sube hasta la cúpula y linternilla. Por la impresionante vista de la ciudad, donde se contempla el emblemático Centro Histórico, es considerado un mirador único en su tipo.\n\nFue un recinto promovido por Porfirio Díaz. Inicialmente estuvo a cargo del arquitecto Èmile Bènard pero se suspendió tras el estallido de la Revolución Mexicana por falta de recursos. Fue retomado por el arquitecto Carlos Obregón después de la revuelta, para convertirlo en un monumento a la Revolución, las obras duraron de 1933 a 1938 y está inspirado en el estilo art déco.\n\nTiene esculturas alusivas a la Independencia, las Leyes de Reforma, las Leyes Agrarias y las Leyes Obreras. Fue reinaugurado en el centenario de la gesta en 2010. Ahí reposan los restos funerarios de Francisco I. Madero, Plutarco Elías Calles, Lázaro Cárdenas y Francisco Villa.\n\nConsulta nuestra cartelera de eventos\n\n",
    "external_urls": [
        "https://www.facebook.com/monrevmex/",
        "https://www.tripadvisor.com.mx/Attraction_Review-g150800-d558912-Reviews-Monumento_y_Museo_de_la_Revolucion-Mexico_City_Central_Mexico_and_Gulf_Coast.html",
        "https://twitter.com/monrevmex",
        "http://www.youtube.com/MonRevMex",
        "http://www.mrm.mx/",
        "mailto:info@mrm.mx"
    ],
    "url": "http://cdmxtravel.com/es/lugares/monumento-a-la-revolucion.html",
    "destination": "Alameda"
}