[
    {
        "name": "¡Visita el ahuehuete de 700 años en Azcapotzalco!",
        "url": "http://cdmxtravel.com/es/lugares/visita-el-ahuehuete-de-700-anos-en-azcapotzalco.html"
    },
    {
        "name": "Mercado de Azcapotzalco",
        "url": "http://cdmxtravel.com/es/lugares/mercado-de-azcapotzalco.html"
    },
    {
        "name": "Estatua de Miguel Hidalgo y Costilla",
        "url": "http://cdmxtravel.com/es/lugares/estatua-de-miguel-hidalgo-y-costilla.html"
    },
    {
        "name": "Capilla de San Simón y San Judas Tadeo",
        "url": "http://cdmxtravel.com/es/lugares/capilla-de-san-simon-y-san-judas-tadeo.html"
    },
    {
        "name": "Videoteca Manuel Álvarez Bravo",
        "url": "http://cdmxtravel.com/es/lugares/videoteca-manuel-alvarez-bravo.html"
    },
    {
        "name": "Estatua a Tezozomoctzin",
        "url": "http://cdmxtravel.com/es/lugares/estatua-a-tezozomoctzin.html"
    },
    {
        "name": "Cinépolis Azcapotzalco",
        "url": "http://cdmxtravel.com/es/lugares/cinepolis-azcapotzalco.html"
    },
    {
        "name": "Capilla de las Ánimas",
        "url": "http://cdmxtravel.com/es/lugares/capilla-de-las-animas.html"
    },
    {
        "name": "Capilla de Nuestra Señora del Rosario",
        "url": "http://cdmxtravel.com/es/lugares/capilla-de-nuestra-senora-del-rosario.html"
    },
    {
        "name": "Biblioteca Fray Bartolomé de las Casas",
        "url": "http://cdmxtravel.com/es/lugares/biblioteca-fray-bartolome-de-las-casas.html"
    },
    {
        "name": "Azcapotzalco",
        "url": "http://cdmxtravel.com/es/lugares/azcapotzalco.html"
    },
    {
        "name": "Busto de Fray Bartolomé de las Casas",
        "url": "http://cdmxtravel.com/es/lugares/busto-de-fray-bartolome-de-las-casas.html"
    },
    {
        "name": "Earthgonomic México A. C.",
        "url": "http://cdmxtravel.com/es/lugares/earthgonomic-mexico-a-c.html"
    }
]