{
    "name": "Sala Xavier Villaurrutia",
    "labels": [
        "Sé un espectador"
    ],
    "price": "",
    "categories": [
        "Teatros"
    ],
    "schedule": [
        "17:00-19:00",
        "17:00-19:00",
        "17:00-19:00",
        "17:00-19:00",
        "17:00-19:00",
        "17:00-19:00",
        "16:00-18:00"
    ],
    "contact": "+52 (55) 5280 2738 ext. 502",
    "location": {
        "map_url": "http://maps.google.com/maps?daddr=19.4236%2C-99.1947",
        "address": "Bosque de Chapultepec I Secc, CDMX 11560, Polanco-Chapultepec"
    },
    "description": "Espacio dentro del Centro Cultural del Bosque. Lleva el nombre de uno de los más importantes poetas y dramaturgos de México. Se realizan obras de teatro, música, danza, espectáculos infantiles, festivales, cine y video, así como conferencias.\n\n\n\nForma parte del programa #YoVoyalteatro\n\nFacebook: yovoyalteatromx\nTwitter: yovoyalteatromx",
    "external_urls": [
        "https://www.facebook.com/pages/Centro-Cultural-del-Bosque-INBA/113500562082580",
        "https://www.instagram.com/elteatrocdmx/",
        "https://twitter.com/CCB_INBA",
        "https://www.youtube.com/user/ccbinba",
        "http://www.ccb.bellasartes.gob.mx/recintos/villaurrutia",
        "mailto:gentedeteatro@inba.mx"
    ],
    "url": "http://cdmxtravel.com/es/lugares/sala-xavier-villaurrutia.html",
    "destination": "Polanco-Chapultepec"
}