{
    "name": "Anzures",
    "description": "Aquí se respira el aire del Bosque de Chapultepec, se está cerca del arte y se convive con la comunidad extranjera que habita la capital. Vivir en la Anzures es disfrutar lo mejor de la gastronomía y las boutiques de Polanco, pero sin estar expuesto a una de las zonas más transitadas de la ciudad.\n\nLa Anzures sigue conservando el aire de un barrio tranquilo, pero simultáneamente forma parte de una de las zonas más dinámicas de esta urbe, con una población de adultos jóvenes siempre activos.\n\nHistoria\n\nLa colonia Anzures se estableció como zona residencial a principios del siglo XX, en los terrenos del ex rancho de Anzures, adquiridos por la inglesa Werner Beit y el gobierno mexicano, a través del ministro José Yves Limantour, para ampliar y embellecer el Bosque de Chapultepec.\n\nPosteriormente, los terrenos fueron adquiridos por W. D. Pearson, un lord inglés con numerosos negocios en el país, que incluían a la petrolera El Águila. Todo esto se realizó a través de la Anzures Land Co., una empresa con sede en Londres, cuyo objetivo era adquirir los terrenos para la construcción de un hospital que serviría para atender a la comunidad inglesa y al público de la zona. Fue como parte de este proyecto que se planeó una zona residencial que pronto albergó las casas de renombradas familias de la época.\n\nUbicación y movilidad\n\nEs frecuente que la gente confunda la colonia Anzures con Polanco, pues no solo se encuentran una al lado de otra, sino que comparten un mismo ambiente y estilo de vida. Asimismo, hay quien piensa que la Anzures y la Verónica Anzures son la misma colonia, cuando, a pesar de encontrarse una al lado de otra, en realidad se trata de zonas contiguas.\n\nLa ubicación de la Anzures es inigualable, se encuentra justo en frente del pulmón más grande de la ciudad: el Bosque de Chapultepec. Además tiene salida a importantes avenidas como Mariano Escobedo, Ejercito Nacional, Marina Nacional, Circuito Interior y Paseo de la Reforma, sin por ello sacrificar la tranquilidad de sus calles arboladas. En cuanto a transporte público, se conecta a través de los autobuses que circulan Reforma, Mariano Escobedo y Thiers, y se encuentra a tan solo unos minutos de los metros Polanco y Auditorio de la línea 7 del metro.\n\nAdemás de colindar con Polanco, la Anzures se conecta directamente con la colonia Cuauhtémoc, la primera sección de Chapultepec, la colonia Anáhuac y la colonia Granada, estando también muy cerca de las colonias Roma y Juárez.\n\nActualidad\n\nLa Anzures es una colonia tradicionalmente residencial que ha luchado desde su surgimiento para permanecer como un espacio de tranquilas casas y edificios resguardado del bullicio habitual de la gran urbe. Sin embargo, sólo hace falta cruzar a la zona de Polanco para encontrarte las últimas tendencias del diseño, la moda y la arquitectura.\n\nAl encontrarse en una zona de espíritu cosmopolita, la Anzures cuenta con una riqueza cultural y gastronómica envidiables (restaurantes como el Pujol o el Quintonil, catalogados entre los mejores de Latinoamérica, se encuentran a escasas cuadras). Además, se ubica a tan solo unos pasos del Museo Tamayo, uno de los museos de arte contemporáneo más importantes de la ciudad, y está prácticamente enfrente del Auditorio Nacional, uno de foros de conciertos más importantes del mundo.\n\nImágenes: MXCity.",
    "places_url": null,
    "url": "http://cdmxtravel.com/es/destinos/anzures.html"
}