{
    "name": "Biblioteca Manuel Sandoval Vallarta",
    "labels": [
        "Cultura todos los días"
    ],
    "price": "",
    "categories": [
        "Bibliotecas"
    ],
    "schedule": [
        "09:00-18:00",
        "09:00-18:00",
        "09:00-18:00",
        "09:00-18:00",
        "09:00-18:00",
        "10:00-17:00",
        "10:00-17:00"
    ],
    "contact": "+52 (55) 5622 7252",
    "location": {
        "map_url": "http://maps.google.com/maps?daddr=19.3118%2C-99.1806",
        "address": "Circuito Mario de la Cueva s/n, Col. Ciudad Universitaria. 04510, Ciudad Universitaria"
    },
    "description": "Forma parte de la Dirección General de Divulgación de la Ciencia, ubicada en el tercer piso del Edificio del Museo Universum.\n\nSatisface las necesidades de información tanto del personal académico como del público que visita los Museos de la Luz y Universum. Ha incorporado colecciones de libros, revistas, tesis, videos, discos, etc.\n\nOfrece visitas guiadas, se realizan actividades con proyección de videos, posee diferentes salas de consulta: infantil y de revistas.",
    "external_urls": [
        "https://www.facebook.com/BibliotecaManuelSandovalVallarta",
        "http://biblioteca.universum.unam.mx/conoce_la_biblioteca/mision_objetivo"
    ],
    "url": "http://cdmxtravel.com/es/lugares/biblioteca-manuel-sandoval-vallarta.html",
    "destination": "Ciudad Universitaria"
}