{
    "name": "Razones para visitar hoy el Mercado de Jamaica",
    "labels": [
        "Puro sabor local"
    ],
    "price": "",
    "categories": [
        "Mercados y bazares"
    ],
    "schedule": null,
    "contact": null,
    "location": {
        "map_url": "http://maps.google.com/maps?daddr=%2C",
        "address": "Guillermo Prieto 45, Magdalena Mixhuca, Jamaica, Venustiano Carranza, CDMX 15800, La Merced"
    },
    "description": "Un mercado que además de popularidad, se jacta de guardar en sí varios de los sucesos más representativos de la capital.\n\n\n\nLos mercados en México tienen un contexto cultural más grande de lo que imaginamos; y hoy, muchos de ellos se han posicionado como los favoritos de los capitalinos. Uno de los más emblemáticos es el Mercado de Jamaica, el cual es uno de los puntos con más historia, con mucho movimiento y carácter. Este lugar se distingue por la venta de flores, pero no se sabe de dónde viene el nombre, ya que su historia es muy amplia y hay muchas versiones acerca su origen.\n\nAsí que, primero hay que saber un poco de la línea del tiempo de los mercados en la capital. En 1940, se anunció la construcción de una plaza dedicada a crear un espacio para todos los comerciantes. Lamentablemente en 1952 el lugar se incendió, y fue durante el gobierno de Adolfo Ruíz Cortines que se impulsó la modernización de los mercados de la zona de La Merced. Finalmente en 1957 se inauguraron 38 mercados, entre los que se encontraba el de Jamaica.\n\nEl diseño de esta nueva plaza quedó a cargo de los arquitectos Pedro Ramírez Vázquez y Félix Candela. Su intención fue utilizar el mayor espacio posible para los locatarios del mercado, favorecer la entrada de luz y ventilación natural; fue uno de los primeros mercados en incluir estacionamiento.\n\nUn rasgo que definió a la plaza fueron las parábolas hiperbólicas de Félix Candela en la cubierta del mercado, pero por desgracia colapsaron en el sismo del 85. Por ello varios comerciantes fueron trasladados a la Central de Abastos, lo que hoy se conoce como Mercado de Jamaiquita. La tercera intervención a la fachada del mercado fue el 23 de febrero del 2013, en la que el artista plástico Mibe junto con el colectivo Germen intervinieron con un hermoso mural. Después en mayo de ese mismo año en un evento de Nike sportswear se intervinieron con otros 2 murales las paredes del estacionamiento de adentro.\n\nPor todo esto, es que este emblemático mercado acumula historia y es un lugar que vale la pena visitar en cualquier momento pues está abierto las 24 horas del día, los 7 días de la semana. Si no lo conoces solo ve a Guillermo Prieto 45, Venustiano Carranza, y descubre todo lo que este popular espacio tiene para ofrecer.\n\n\n\nFotos de MXCity",
    "external_urls": null,
    "url": "http://cdmxtravel.com/es/lugares/razones-para-visitar-hoy-el-mercado-de-jamaica.html",
    "destination": "La Merced"
}