{
    "name": "Centro Comercial y Cultural Plaza Loreto",
    "labels": [
        "Cultura todos los días",
        "En familia",
        "MICE",
        "Por recinto",
        "Museos"
    ],
    "price": "",
    "categories": [
        "Galerías",
        "Casas de cultura",
        "Centros culturales",
        "Centros de entretenimiento familiares",
        "Espacios de reunión",
        "Con eventos",
        "Museos de arte e historia"
    ],
    "schedule": [
        "11:00-20:00",
        "11:00-20:00",
        "11:00-20:00",
        "11:00-20:00",
        "11:00-20:00",
        "11:00-20:00",
        "11:00-20:00"
    ],
    "contact": "(55) 5550 6292",
    "location": {
        "map_url": "http://maps.google.com/maps?daddr=19.3396%2C-99.1941",
        "address": "Altamirano #46, Col. Tizapan. 01090, San Ángel"
    },
    "description": "Es una complejo donde conviven el arte y las tiendas de ropa y accesorios. En la plaza principal hay un espacio acondicionado para conciertos, recitales, obras de teatro y demás actividades al aire libre. También hay un pasillo donde se exponen artesanías de diferentes estados o se montan fotografías que permiten acercarse a otros países y culturas.",
    "external_urls": [
        "https://www.facebook.com/PlazaLoreto",
        "https://twitter.com/plaza_loreto",
        "http://www.centrocomercialloreto.com.mx/",
        "mailto:loretocultural@hotmail.com"
    ],
    "url": "http://cdmxtravel.com/es/lugares/centro-comercial-y-cultural-plaza-loreto.html",
    "destination": "San Ángel"
}