{
    "name": "Unidad Cultural y Recreativa Prof. Ismael Rodríguez y Aragón",
    "labels": [
        "Cultura todos los días",
        "En familia",
        "MICE"
    ],
    "price": "Gratuito",
    "categories": [
        "Centros culturales",
        "Centros de entretenimiento familiares",
        "Espacios de reunión"
    ],
    "schedule": [
        "09:00-17:00",
        "09:00-17:00",
        "09:00-17:00",
        "09:00-17:00",
        "09:00-17:00",
        "09:00-17:00",
        "09:00-17:00"
    ],
    "contact": "(55) 5241 6000",
    "location": {
        "map_url": "http://maps.google.com/maps?daddr=19.4206%2C-99.1739",
        "address": "Av. Sonora #13, Col.  Condesa. 06170, Condesa"
    },
    "description": "Es un centro de esparcimiento y actividades artísticas del Sindicato Nacional de Trabajadores del Seguro Social.",
    "external_urls": [
        "mailto:gonzalezgar_1323@hotmail.com"
    ],
    "url": "http://cdmxtravel.com/es/lugares/unidad-cultural-y-recreativa-prof-ismael-rodriguez-y-aragon.html",
    "destination": "Condesa"
}