{
    "name": "CoMo",
    "labels": [
        "Vive la noche"
    ],
    "price": "Desde $300 MXN",
    "categories": [
        "Bar"
    ],
    "schedule": [
        "13:30-23:00",
        "13:30-23:00",
        "13:30-23:00",
        "13:30-23:00",
        "13:30-23:00",
        "11:00-00:00",
        "11:00-18:00"
    ],
    "contact": "+52 (55) 5250 1596",
    "location": {
        "map_url": "http://maps.google.com/maps?daddr=19.4351%2C-99.1931",
        "address": "Aristóteles #239, Col. Polanco. 11560, Polanco-Chapultepec"
    },
    "description": "Un refugio para los ejecutivos y oficinistas de Polanco, en CoMo hay gran variedad de platillos italianos, franceses, españoles, veganos y vegetarianos en un ambiente de bar. Se pueden degustar ensaladas de pollo a las brasas, tapas y pizzas. Todos los días hay brunch de 11:00 a 16:00 horas. La carta de bebidas incluye una cuidada selección de mezcales.",
    "external_urls": [
        "https://www.facebook.com/RestaurantComo/timeline",
        "https://twitter.com/RestauranteComo",
        "http://restaurantcomo.com/como/index.html",
        "mailto:daniel@restaurantcomo.com"
    ],
    "url": "http://cdmxtravel.com/es/lugares/como.html",
    "destination": "Polanco-Chapultepec"
}