{
    "name": "Torre Reforma",
    "labels": [
        "México monumental"
    ],
    "price": "",
    "categories": [
        "Rascacielos y miradores"
    ],
    "schedule": [
        "05:00-23:00",
        "05:00-23:00",
        "05:00-23:00",
        "05:00-23:00",
        "05:00-23:00",
        "06:00-23:00",
        "08:00-23:00"
    ],
    "contact": "9156.3500",
    "location": {
        "map_url": "http://maps.google.com/maps?daddr=19.4245%2C-99.1743",
        "address": "Reforma #483, Col. Cuauhtémoc. 06500, Reforma-Zona Rosa"
    },
    "description": "Este edificio alberga varias oficinas corporativas. Tiene una altura de 246 metros, que se traducen en 57 niveles. Se encuentra muy próximo a la Torre Latino y la supera en altura por varios metros, lo que lo convierten en una de las construcciones más altas en Latinoamérica. Desde aquí pueden observarse el Castillo de Chapultepec y el Bosque en general. Gracias a su manejo eficiente de recursos se ha ganado la certificación LEED (Leadership in Energy and Environmental Design), máximo reconocimiento del U.S. Green Building Council (USGBC).\n\nLa obra estuvo a cargo del arquitecto mexicano Benjamín Romano y su despacho LBR&A Arquitectos. A pesar de no estar abierto al público en general, es una construcción que vale la pena admirar.",
    "external_urls": [
        "https://www.facebook.com/torrereformaoficial/",
        "https://www.instagram.com/torre_reforma/",
        "https://www.youtube.com/channel/UCjQPFdWl2UYLZgO0hkVBVZQ",
        "http://torrereforma.com/",
        "mailto:info@torrereforma.com"
    ],
    "url": "http://cdmxtravel.com/es/lugares/torre-reforma.html",
    "destination": "Reforma-Zona Rosa"
}