{
    "name": "Salón España",
    "labels": [
        "Vive la noche"
    ],
    "price": "Desde $200 MXN",
    "categories": [
        "Cantina"
    ],
    "schedule": [
        "11:00-00:00",
        "11:00-00:00",
        "11:00-00:00",
        "11:00-00:00",
        "11:00-00:00",
        "11:00-00:00",
        "11:00-19:00"
    ],
    "contact": "+52 (55) 5702 1719",
    "location": {
        "map_url": "http://maps.google.com/maps?daddr=19.4364%2C-99.1317",
        "address": "República de Argentina s/n, Col. Centro. 06000, Centro Histórico"
    },
    "description": "Fue fundada en 1925 por refugiados españoles que llegaron al país, antes de que estallara la Guerra Civil Española. Ofrece más de 250 etiquetas de tequila y como buena cantina se puede jugar dominó, ajedrez y cartas.",
    "external_urls": [
        "https://www.facebook.com/cantinaSalonEspana/"
    ],
    "url": "http://cdmxtravel.com/es/lugares/salon-espana.html",
    "destination": "Centro Histórico"
}