{
    "name": "Museo Nacional de las Intervenciones",
    "labels": [
        "Museos",
        "México monumental"
    ],
    "price": "Desde $75 MXN",
    "categories": [
        "Ciencia e historia",
        "Recintos religiosos"
    ],
    "schedule": [
        "Cerrado",
        "09:00-18:00",
        "09:00-18:00",
        "09:00-18:00",
        "09:00-18:00",
        "09:00-18:00",
        "09:00-18:00"
    ],
    "contact": "41660780 ext. 413303",
    "location": {
        "map_url": "http://maps.google.com/maps?daddr=19.355%2C-99.1488",
        "address": "20 de Agosto s/n, Col. San Diego Churubusco. 04120, Coyoacán"
    },
    "description": "El Museo Nacional de las Intervenciones se inauguró en 1981 pero abrió su salón de usos múltiples Gastón García Cantú y el centro de consulta El Catalejo de la historia hasta 2006. Este museo tiene como objetivo acercar a la población a la historia de México por medio de libros, folletos, videos, aplicaciones interactivas y discos.\nLa colección permanente está compuesta por litografías, banderas, armas, mobiliario y accesorios tanto civiles como militares de la época, combinados con reproducciones que permiten recrear museográficamente los hechos históricos, en especial las invasiones militares del XIX y XX. \nEl museo se ubica en el exconvento de Churubusco, el cual perteneció a la orden de los franciscanos, quienes cedieron el inmueble a la orden de los dieguinos, en 1580. Funcionó como cuartel militar durante el siglo XIX y fue uno de los escenarios de una de las batallas más importantes contra el país vecino del Norte, en 1847.\n\nLa entrada es gratis para estudiantes con credencial, maestros y personas de la tercera edad.",
    "external_urls": [
        "https://www.facebook.com/museodelasintervenciones",
        "https://www.instagram.com/museointervenciones/",
        "https://twitter.com/mintervenciones",
        "https://www.youtube.com/channel/UCQ2mjbF3oum_K7q-fWnDnMQ",
        "https://www.intervenciones.inah.gob.mx/",
        "mailto:munaint@gmail.com"
    ],
    "url": "http://cdmxtravel.com/es/lugares/museo-nacional-de-las-intervenciones.html",
    "destination": "Coyoacán"
}