{
    "name": "Bar Baltra",
    "labels": [
        "Vive la noche"
    ],
    "price": "Desde $400 MXN",
    "categories": [
        "Bar"
    ],
    "schedule": [
        "Cerrado",
        "18:00-00:00",
        "18:00-00:00",
        "18:00-02:00",
        "18:00-02:00",
        "18:00-02:00",
        "13:00-19:00"
    ],
    "contact": "+52 (55) 5264 1279",
    "location": {
        "map_url": "http://maps.google.com/maps?daddr=19.4095%2C-99.1688",
        "address": "Iztaccíhuatl #36-D, Col. Condesa. 06700, Condesa"
    },
    "description": "Un ambiente que evoca las expediciones que Charles Darwin realizó a las islas Galápagos. La temática visual de la teoría de la evolución de las especies se posa en este sofisticado bar, cuya decoración envuelve a los visitantes en un ambiente fresco y vanguardista. Grabados de aves, bocetos de especies marinas, manojos de diversas plantas, conchas de mar, elegantes lámparas y papel tapiz victoriano trasladan la imaginación al estudio del científico inglés. La coctelería nutre los sentidos y alegra los pensamientos.",
    "external_urls": [
        "https://www.facebook.com/baltrabar/timeline",
        "https://www.instagram.com/baltrabar/",
        "https://twitter.com/baltrabar",
        "http://baltra.bar/"
    ],
    "url": "http://cdmxtravel.com/es/lugares/bar-baltra.html",
    "destination": "Condesa"
}