{
    "name": "Tous Volcán",
    "labels": [
        "Shopping"
    ],
    "price": "",
    "categories": [
        "Accesorios",
        "Joyería y relojería"
    ],
    "schedule": [
        "10:00-19:00",
        "10:00-19:00",
        "10:00-19:00",
        "10:00-19:00",
        "10:00-19:00",
        "10:00-14:00",
        "Cerrado"
    ],
    "contact": "52 (55) 5520 3235",
    "location": {
        "map_url": "http://maps.google.com/maps?daddr=19.4283%2C-99.2075",
        "address": "Volcán #219, Col. Lomas de Chapultepec. 11000, Polanco-Chapultepec"
    },
    "description": "Marca lifestyle de lujo que combina las últimas tecnologías con técnicas artesanales. Los orígenes de la familia se remontan a 1920. Y gracias a su trabajo, su pasión y el saber escuchar a su clientes, les ha llevado a convertir a Tous en una marca reconocida internacionalmente.",
    "external_urls": [
        "http://blog.tous.com/?_ga=1.243149378.176832978.1439198737",
        "https://www.facebook.com/TousMexico",
        "https://instagram.com/tousjewelry/",
        "https://www.pinterest.com/tousjewelry/",
        "https://twitter.com/tousjewelry",
        "https://www.youtube.com/user/tousjewelry",
        "https://www.tous.com/mx-es/",
        "mailto:volcandf@tous.com"
    ],
    "url": "http://cdmxtravel.com/es/lugares/tous-volcan.html",
    "destination": "Polanco-Chapultepec"
}