{
    "name": "El Real Under",
    "labels": [
        "Vive la noche",
        "MICE"
    ],
    "price": "Desde $200 MXN",
    "categories": [
        "Bar",
        "Centros nocturnos",
        "Espacios de reunión"
    ],
    "schedule": [
        "Cerrado",
        "Cerrado",
        "Cerrado",
        "Cerrado",
        "21:00-03:00",
        "21:00-03:00",
        "Cerrado"
    ],
    "contact": "(55) 5511 5475",
    "location": {
        "map_url": "http://maps.google.com/maps?daddr=19.4085%2C-99.1618",
        "address": "Monterrey #80, Col. Roma. 06700, Roma"
    },
    "description": "Un espacio artístico, cultural y musical que sirve de expresión para jóvenes que se mueven en un ámbito no comercial.\n\nEn este sitio se llevan a cabo talleres, fiestas y conciertos para tribus punk, gótico y dark, entre otras.",
    "external_urls": [
        "https://www.facebook.com/REALUNDER",
        "https://www.instagram.com/therealunder/?hl=es-la",
        "http://theunder.org/real/"
    ],
    "url": "http://cdmxtravel.com/es/lugares/el-real-under.html",
    "destination": "Roma"
}