{
    "name": "Cinemex Pabellón Polanco",
    "labels": [
        "Sé un espectador"
    ],
    "price": "",
    "categories": [
        "Cines"
    ],
    "schedule": [
        "10:00-23:00",
        "10:00-23:00",
        "10:00-23:00",
        "10:00-23:00",
        "10:00-23:00",
        "10:00-23:00",
        "10:00-23:00"
    ],
    "contact": "01 800 710 8888",
    "location": {
        "map_url": "http://maps.google.com/maps?daddr=19.4376%2C-99.2072",
        "address": "Av. Ejército Nacional #980, Col. Chapultepec Morales. 11570, Polanco-Chapultepec"
    },
    "description": "Disfruta de las peliculas de cartelera en esta cadena de cines, no te pierdas los grandes estrenos!\n\nCheca los horarios en la página de internet.",
    "external_urls": [
        "https://www.facebook.com/Cinemex",
        "https://twitter.com/cinemex",
        "https://www.youtube.com/user/CinemexOficial",
        "http://cinemex.com/cine/80/cinemex-pabellon-polanco"
    ],
    "url": "http://cdmxtravel.com/es/lugares/cinemex-pabellon-polanco.html",
    "destination": "Polanco-Chapultepec"
}