{
    "name": "Design Spot",
    "labels": [
        "Shopping"
    ],
    "price": "",
    "categories": [
        "Accesorios",
        "Mobiliario",
        "diseño e interiorismo",
        "Joyería y relojería"
    ],
    "schedule": [
        "11:00-20:00",
        "11:00-20:00",
        "11:00-20:00",
        "11:00-20:00",
        "11:00-20:00",
        "11:00-20:00",
        "11:00-20:00"
    ],
    "contact": "55 5292 6847",
    "location": {
        "map_url": "http://maps.google.com/maps?daddr=19.4128%2C-99.1739",
        "address": "Parral #44, Col. Condesa. 06140, Condesa"
    },
    "description": "Design Spot es una tienda en la que se reúnen diseñadores de muchas partes del mundo, lo que hace posible adquirir accesorios originales de Italia, España, México, Estados Unidos, Holanda, Reino Unido, Dinamarca y Francia. Algunos de sus productos han sido premiados en concursos internacionales de diseño como: Red Dot, el Good Design o el iF, además de que algunos de ellos pertenecen a colecciones permanentes de museos como el MoMA de Nueva York.\n\nOfrecen objetos como: joyería, relojes, lentes y bolsas, gadgets, libretas, entre otros.",
    "external_urls": [
        "https://www.facebook.com/designspotmx/timeline?ref=page_internal",
        "https://www.instagram.com/designspotmx/",
        "https://www.pinterest.com/designspotmx/",
        "https://twitter.com/designspotmx",
        "https://www.youtube.com/channel/UCqhAQJjrbeGXrmAd6rgxUZg",
        "http://designspot.mx/",
        "mailto:hola@designspot.mx"
    ],
    "url": "http://cdmxtravel.com/es/lugares/design-spot.html",
    "destination": "Condesa"
}