{
    "name": "Museo de las Constituciones",
    "labels": [
        "Museos"
    ],
    "price": "Gratuito",
    "categories": [
        "Ciencia e historia",
        "Museos de arte e historia"
    ],
    "schedule": [
        "Cerrado",
        "Cerrado",
        "10:00-17:00",
        "10:00-17:00",
        "10:00-17:00",
        "10:00-17:00",
        "10:00-17:00"
    ],
    "contact": "55 5702 6956 ext. 101",
    "location": {
        "map_url": "http://maps.google.com/maps?daddr=19.4367%2C-99.1293",
        "address": "Carmen #31, Col. Centro. 06010, Centro Histórico"
    },
    "description": "Tiene aspecto de iglesia porque fue el templo y colegio de San Pedro y San Pablo. Fue construido por la Compañía de Jesús entre 1576 y 1603, funcionó como templo durante 164 años. Ahora es un museo que en un principio fue remodelado en 1920 por José Vasconcelos, para que fungiera como sala de conferencias, escuela de gimnasia y canto. Pero fue hasta 2010 cuando el rector de la Universidad Nacional Autónoma de México propuso que este lugar sirviera para el enriquecimiento cultural con base en las legislaciones.\n\nActualmente hay nueve espacios temáticos que muestran y explican desde el movimiento criollo en 1808, hasta la Constitución de 1917, mediante excelente material iconográfico y textos explicativos. La exposición permanente revela el contexto social y político en el que se formuló cada una de las Cartas Magnas, lo ocurrido durante su vigencia y su significado para tiempos posteriores. En el recinto también se encuentra el primer mural moderno hecho en México, El árbol de la ciencia, obra de Roberto Montenegro. Además ofrece talleres de verano para niños en los que éstos aprenden a realizar cortometrajes, obras de teatro, pinturas y más. Lo mejor de este taller es que al finalizar el verano se exponen los trabajos de los pequeños que participaron.\n\nSe organizan visitas guiadas pero es necesario reservar lugar.",
    "external_urls": [
        "https://www.facebook.com/profile.php?id=100008168497380",
        "https://www.instagram.com/museodelasconstituciones/",
        "https://twitter.com/MuseoConstitu",
        "https://www.youtube.com/channel/UCbb0uhM7v8nd7dSFxIUfH_g",
        "http://museodelasconstituciones.unam.mx/Museo/index.php",
        "mailto:museoconstituciones@gmail.com"
    ],
    "url": "http://cdmxtravel.com/es/lugares/museo-de-las-constituciones.html",
    "destination": "Centro Histórico"
}