{
    "name": "Estación Copilco del STC Metro, Línea 3",
    "labels": [
        "Cultura todos los días"
    ],
    "price": "Desde $5 MXN",
    "categories": [
        "Venues"
    ],
    "schedule": [
        "05:00-00:00",
        "05:00-00:00",
        "05:00-00:00",
        "05:00-00:00",
        "05:00-00:00",
        "06:00-00:00",
        "07:00-00:00"
    ],
    "contact": null,
    "location": {
        "map_url": "http://maps.google.com/maps?daddr=19.3358%2C-99.177",
        "address": "Eje 10 Sur s/n, Col. Copilco. 04360, Ciudad Universitaria"
    },
    "description": "El ícono de la estación es una imagen de la cultura olmeca del periodo preclásico medio (1100 a 600 a.D) relacionada con la lluvia y fusionada con una serpiente acuática que da como resultado una especie de dragón celeste, convertido más tarde en el Dios del Agua. \nCopilco en dialecto mexica significa \"En la Corona Real\".",
    "external_urls": [
        "https://metro.cdmx.gob.mx/la-red/linea-3/copilco"
    ],
    "url": "http://cdmxtravel.com/es/lugares/estacion-copilco-del-stc-metro-linea-3.html",
    "destination": "Ciudad Universitaria"
}