{
    "name": "Mercado de Medellín",
    "labels": [
        "Puro sabor local",
        "MICE",
        "Shopping"
    ],
    "price": "",
    "categories": [
        "Mercados y bazares",
        "Artesanías",
        "Espacios de reunión",
        "Gourmet",
        "Comercios centenarios"
    ],
    "schedule": [
        "07:00-20:00",
        "07:00-20:00",
        "07:00-20:00",
        "07:00-20:00",
        "07:00-20:00",
        "07:00-20:00",
        "07:00-20:00"
    ],
    "contact": "(55) 3142 2660",
    "location": {
        "map_url": "http://maps.google.com/maps?daddr=19.4104%2C-99.1634",
        "address": "Medellín #234, Col. Roma Norte. 06760, Roma"
    },
    "description": "Situado en la colonia Roma, el mercado es conocido como la pequeña Habana por los lugareños. Está lleno de sonidos y colores que le dan vida cada día.\n\nFamoso por sus productos de Cuba y Colombia, así como productos específicos de Yucatán y Tabasco; hay puestos de verduras y frutas de muy buena calidad. Tiene una zona de locales de comida con platillos ricos y llenos de sabor, desde antojitos mexicanos, hasta helados cubanos y café colombiano Juan Valdez. También fascina su zona de flores de temporada. Sin duda, una experiencia única para todos los sentidos.",
    "external_urls": [
        "https://www.facebook.com/mercado.medellin/timeline",
        "https://www.tripadvisor.com.mx/Attraction_Review-g150800-d12442220-Reviews-Mercado_de_Medellin-Mexico_City_Central_Mexico_and_Gulf_Coast.html"
    ],
    "url": "http://cdmxtravel.com/es/lugares/mercado-de-medellin.html",
    "destination": "Roma"
}