{
    "name": "Parque España",
    "labels": [
        "Al aire libre",
        "En familia",
        "Diversión y adrenalina",
        "MICE",
        "Por recinto"
    ],
    "price": "Gratuito",
    "categories": [
        "Parques",
        "Jardines",
        "Centros de entretenimiento familiares",
        "Espacios para correr",
        "Espacios de reunión",
        "Con eventos"
    ],
    "schedule": [
        "00:01-23:59",
        "00:01-23:59",
        "00:01-23:59",
        "00:01-23:59",
        "00:01-23:59",
        "00:01-23:59",
        "00:01-23:59"
    ],
    "contact": null,
    "location": {
        "map_url": "http://maps.google.com/maps?daddr=19.4153%2C-99.1712",
        "address": "Av. Parque España s/n, Col. Condesa. 06140, Condesa"
    },
    "description": "El Parque España es una de las áreas verdes que dan vida a la colonia Condesa. Los vecinos acostumbran correr, sacar a pasear a las mascotas, sentarse a tomar un helado, ver los atardeceres o leer el periódico. El parque fue la entrada al desaparecido Hipódromo de la Condesa, ya que ahí se encontraba la Hacienda de la Condesa, una próspera propiedad de la condesa de Miravalle donde se criaba rebaño, se sembraba maíz y magueyes. Fue diseñado por el arquitecto José Luis Cuevas e inaugurado el 21 de septiembre de 1921. En esa ocasión, fue sembrado un ahuehuete por el presidente municipal Herminio Pérez Abreu. Entorno a este lugar han florecido restaurantes y cafés, enriqueciendo el sentido de comunidad de la colonia. Es usual ver niños llenando en parque, disfrutando de correr y jugar por todo el lugar.\n\nSe encuentra justo en el límite de la Condesa y la Roma se encuentra este parque, el cual estaconstruido en lo que anteriormente era el acceso al Hipódromo de la Condesa, -de ahí el nombre de Colonia Condesa- tiene bancos para recortarse, unos pequeños puentes, área de juegos infantiles, y una fuente, la cual se ah convertido en la alberca comunitaria de todos los perros de la zona",
    "external_urls": [
        "https://www.tripadvisor.com.mx/Attraction_Review-g150800-d7790450-Reviews-Parque_Espana-Mexico_City_Central_Mexico_and_Gulf_Coast.html"
    ],
    "url": "http://cdmxtravel.com/es/lugares/parque-espana.html",
    "destination": "Condesa"
}