<?xml version="1.0" encoding="UTF-8" standalone="no"?>
<svg
   xmlns:dc="http://purl.org/dc/elements/1.1/"
   xmlns:cc="http://creativecommons.org/ns#"
   xmlns:rdf="http://www.w3.org/1999/02/22-rdf-syntax-ns#"
   xmlns:svg="http://www.w3.org/2000/svg"
   xmlns="http://www.w3.org/2000/svg"
   xmlns:sodipodi="http://sodipodi.sourceforge.net/DTD/sodipodi-0.dtd"
   xmlns:inkscape="http://www.inkscape.org/namespaces/inkscape"
   id="svg"
   version="1.1"
   width="155.33299"
   height="20.151962"
   viewBox="0 0 155.33299 20.151962"
   sodipodi:docname="arrow2Left.svg"
   inkscape:version="0.92.4 (5da689c313, 2019-01-14)">
  <metadata
     id="metadata10">
    <rdf:RDF>
      <cc:Work
         rdf:about="">
        <dc:format>image/svg+xml</dc:format>
        <dc:type
           rdf:resource="http://purl.org/dc/dcmitype/StillImage" />
        <dc:title></dc:title>
      </cc:Work>
    </rdf:RDF>
  </metadata>
  <defs
     id="defs8" />
  <sodipodi:namedview
     pagecolor="#ffffff"
     bordercolor="#666666"
     borderopacity="1"
     objecttolerance="10"
     gridtolerance="10"
     guidetolerance="10"
     inkscape:pageopacity="0"
     inkscape:pageshadow="2"
     inkscape:window-width="2560"
     inkscape:window-height="1377"
     id="namedview6"
     showgrid="false"
     inkscape:pagecheckerboard="true"
     fit-margin-top="0"
     fit-margin-left="0"
     fit-margin-right="0"
     fit-margin-bottom="0"
     inkscape:zoom="4.0163665"
     inkscape:cx="191.04725"
     inkscape:cy="5.3122823"
     inkscape:window-x="-8"
     inkscape:window-y="-8"
     inkscape:window-maximized="1"
     inkscape:current-layer="svgg" />
  <g
     id="svgg"
     transform="translate(-33,-66.181037)">
    <path
       id="path0"
       d="m 168.333,86.199037 c 0.629,-0.173 0.703,-2.018 0.08,-2.018 -0.136,0 -0.247,-0.113 -0.247,-0.25 0,-0.138 -0.112,-0.25 -0.25,-0.25 -0.137,0 -0.25,-0.113 -0.25,-0.25 0,-0.138 -0.112,-0.25 -0.25,-0.25 -0.139,0 -0.25,-0.148 -0.25,-0.334 0,-0.185 -0.111,-0.333 -0.25,-0.333 -0.137,0 -0.25,-0.112 -0.25,-0.25 0,-0.137 -0.112,-0.25 -0.25,-0.25 -0.137,0 -0.25,-0.112 -0.25,-0.25 0,-0.137 -0.115,-0.25 -0.255,-0.25 -0.14,0 -0.298,-0.112 -0.351,-0.25 -0.053,-0.137 -0.2,-0.25 -0.328,-0.25 -0.128,0 -0.232,-0.112 -0.232,-0.25 0,-0.137 -0.113,-0.25 -0.25,-0.25 -0.138,0 -0.25,-0.112 -0.25,-0.25 0,-0.137 -0.113,-0.25 -0.25,-0.25 -0.138,0 -0.25,-0.071 -0.25,-0.158 0,-0.346 -0.807,-1.009 -1.228,-1.009 -0.279,0 -0.439,-0.091 -0.439,-0.25 0,-0.137 -0.112,-0.25 -0.25,-0.25 -0.137,0 -0.25,-0.112 -0.25,-0.25 0,-0.137 -0.112,-0.25 -0.25,-0.25 -0.137,0 -0.25,-0.112 -0.25,-0.25 0,-0.196 0.231,-0.25 1.083,-0.25 0.852,0 1.084,0.054 1.084,0.25 0,0.138 0.112,0.25 0.25,0.25 0.137,0 0.25,0.113 0.25,0.25 0,0.138 0.112,0.25 0.25,0.25 0.137,0 0.25,0.113 0.25,0.25 0,0.138 0.112,0.25 0.25,0.25 0.137,0 0.25,0.113 0.25,0.25 0,0.139 0.148,0.25 0.333,0.25 0.185,0 0.333,0.111 0.333,0.25 0,0.138 0.113,0.25 0.25,0.25 0.139,0 0.25,0.148 0.25,0.334 0,0.185 0.111,0.333 0.25,0.333 0.138,0 0.25,0.113 0.25,0.25 0,0.138 0.113,0.25 0.25,0.25 0.138,0 0.25,0.113 0.25,0.25 0,0.138 0.113,0.25 0.25,0.25 0.138,0 0.25,0.113 0.25,0.25 0,0.138 0.113,0.25 0.25,0.25 0.138,0 0.25,0.113 0.25,0.25 0,0.139 0.148,0.25 0.334,0.25 0.185,0 0.333,0.111 0.333,0.25 0,0.138 0.113,0.25 0.25,0.25 0.139,0 0.25,0.148 0.25,0.333 0,0.186 0.111,0.334 0.25,0.334 0.138,0 0.25,0.112 0.25,0.25 0,0.137 0.113,0.25 0.25,0.25 0.138,0 0.25,0.112 0.25,0.25 0,0.137 0.113,0.25 0.25,0.25 0.138,0 0.25,0.112 0.25,0.25 0,0.174 0.176,0.25 0.583,0.25 0.408,0 0.584,0.075 0.584,0.25 0,0.2 0.25,0.25 1.25,0.25 1,0 1.25,-0.05 1.25,-0.25 0,-0.138 0.106,-0.25 0.236,-0.25 0.298,0 0.492,-0.84 0.347,-1.5 -0.06,-0.275 -0.216,-0.5 -0.347,-0.5 -0.13,0 -0.236,-0.15 -0.236,-0.334 0,-0.185 -0.111,-0.333 -0.25,-0.333 -0.138,0 -0.25,-0.112 -0.25,-0.25 0,-0.137 -0.077,-0.25 -0.17,-0.25 -0.093,0 -0.493,-0.337 -0.888,-0.75 -0.5,-0.522 -0.854,-0.75 -1.164,-0.75 -0.284,0 -0.445,-0.09 -0.445,-0.25 0,-0.137 -0.112,-0.25 -0.25,-0.25 -0.139,0 -0.25,-0.148 -0.25,-0.333 0,-0.186 -0.111,-0.334 -0.25,-0.334 -0.137,0 -0.25,-0.112 -0.25,-0.25 0,-0.137 -0.112,-0.25 -0.25,-0.25 -0.137,0 -0.25,-0.112 -0.25,-0.25 0,-0.137 -0.112,-0.25 -0.25,-0.25 -0.137,0 -0.25,-0.112 -0.25,-0.25 0,-0.137 -0.112,-0.25 -0.25,-0.25 -0.137,0 -0.25,-0.112 -0.25,-0.25 0,-0.185 0.194,-0.25 0.75,-0.25 0.556,0 0.75,0.065 0.75,0.25 0,0.138 0.113,0.25 0.25,0.25 0.138,0 0.25,0.113 0.25,0.25 0,0.138 0.104,0.25 0.232,0.25 0.128,0 0.276,0.113 0.328,0.25 0.053,0.138 0.211,0.25 0.351,0.25 0.141,0 0.256,0.113 0.256,0.25 0,0.138 0.112,0.25 0.25,0.25 0.137,0 0.25,0.113 0.25,0.25 0,0.138 0.112,0.25 0.25,0.25 0.137,0 0.25,0.084 0.25,0.187 0,0.102 0.291,0.477 0.647,0.833 0.356,0.356 0.731,0.647 0.833,0.647 0.103,0 0.186,0.113 0.186,0.25 0,0.138 0.113,0.25 0.25,0.25 0.138,0 0.25,0.113 0.25,0.25 0,0.138 0.113,0.25 0.25,0.25 0.138,0 0.25,0.113 0.25,0.25 0,0.138 0.113,0.25 0.25,0.25 0.139,0 0.25,0.148 0.25,0.333 0,0.186 0.111,0.334 0.25,0.334 0.138,0 0.25,0.112 0.25,0.25 0,0.137 0.105,0.25 0.233,0.25 0.127,0 0.275,0.112 0.328,0.25 0.056,0.146 0.305,0.25 0.601,0.25 0.338,0 0.505,0.082 0.505,0.25 0,0.137 0.113,0.25 0.25,0.25 0.138,0 0.25,0.112 0.25,0.25 0,0.209 0.343,0.25 2.083,0.25 1.741,0 2.084,0.041 2.084,0.25 0,0.201 0.259,0.25 1.333,0.25 1.074,0 1.333,-0.049 1.333,-0.25 0,-0.138 0.113,-0.25 0.25,-0.25 0.195,0 0.25,-0.223 0.25,-1 0,-0.778 -0.055,-1 -0.25,-1 -0.137,0 -0.25,-0.113 -0.25,-0.25 0,-0.138 -0.112,-0.25 -0.25,-0.25 -0.139,0 -0.25,-0.148 -0.25,-0.334 0,-0.183 -0.104,-0.333 -0.232,-0.333 -0.128,0 -0.275,-0.112 -0.328,-0.25 -0.053,-0.137 -0.211,-0.25 -0.351,-0.25 -0.14,0 -0.255,-0.112 -0.255,-0.25 0,-0.137 -0.113,-0.25 -0.25,-0.25 -0.138,0 -0.25,-0.112 -0.25,-0.25 0,-0.137 -0.113,-0.25 -0.25,-0.25 -0.138,0 -0.25,-0.112 -0.25,-0.25 0,-0.137 -0.113,-0.25 -0.25,-0.25 -0.138,0 -0.25,-0.112 -0.25,-0.25 0,-0.137 -0.113,-0.25 -0.25,-0.25 -0.138,0 -0.25,-0.12 -0.25,-0.266 0,-0.146 -0.15,-0.304 -0.334,-0.352 -0.183,-0.048 -0.333,-0.191 -0.333,-0.318 0,-0.127 -0.112,-0.231 -0.25,-0.231 -0.137,0 -0.25,-0.112 -0.25,-0.25 0,-0.137 -0.112,-0.25 -0.25,-0.25 -0.137,0 -0.25,-0.112 -0.25,-0.25 0,-0.137 -0.112,-0.25 -0.25,-0.25 -0.137,0 -0.25,-0.112 -0.25,-0.25 0,-0.201 0.258,-0.25 1.32,-0.25 1.873,0 1.847,0.021 1.847,-1.434 v -1.232 h -0.483 c -0.561,0 -0.823,-0.425 -0.339,-0.552 0.177,-0.046 0.322,-0.203 0.322,-0.349 0,-0.184 0.153,-0.266 0.5,-0.266 0.333,0 0.5,-0.083 0.5,-0.25 0,-0.137 0.112,-0.25 0.25,-0.25 0.137,0 0.25,-0.112 0.25,-0.25 0,-0.175 0.176,-0.25 0.583,-0.25 0.407,0 0.583,-0.075 0.583,-0.25 0,-0.156 0.158,-0.25 0.422,-0.25 0.232,0 0.465,-0.112 0.518,-0.25 0.053,-0.137 0.2,-0.25 0.328,-0.25 0.128,0 0.232,-0.112 0.232,-0.25 0,-0.137 0.113,-0.25 0.25,-0.25 0.139,0 0.25,-0.148 0.25,-0.333 0,-0.27 0.111,-0.334 0.584,-0.334 h 0.583 v -1.25 -1.25 h -4.25 c -3.667,0 -4.25,0.035 -4.25,0.25 0,0.138 -0.112,0.25 -0.25,0.25 -0.137,0 -0.25,0.113 -0.25,0.25 0,0.167 -0.167,0.25 -0.5,0.25 -0.333,0 -0.5,0.084 -0.5,0.25 0,0.138 -0.115,0.25 -0.255,0.25 -0.141,0 -0.299,0.113 -0.351,0.25 -0.053,0.138 -0.201,0.25 -0.328,0.25 -0.128,0 -0.233,0.113 -0.233,0.25 0,0.138 -0.112,0.25 -0.25,0.25 -0.137,0 -0.25,-0.112 -0.25,-0.25 0,-0.137 0.113,-0.25 0.25,-0.25 0.195,0 0.25,-0.222 0.25,-1 v -1 h -2.333 c -1.963,0 -2.333,0.04 -2.333,0.25 0,0.168 -0.168,0.25 -0.506,0.25 -0.295,0 -0.545,0.104 -0.601,0.25 -0.054,0.143 -0.303,0.25 -0.578,0.25 -0.317,0 -0.482,0.086 -0.482,0.25 0,0.138 -0.112,0.25 -0.25,0.25 -0.185,0 -0.25,-0.194 -0.25,-0.75 0,-0.741 -0.007,-0.75 -0.564,-0.75 -0.424,0 -0.585,-0.083 -0.651,-0.333 -0.067,-0.257 -0.227,-0.333 -0.702,-0.333 -0.474,0 -0.634,0.076 -0.701,0.333 -0.071,0.269 -0.228,0.333 -0.818,0.333 -0.538,0 -0.731,0.066 -0.731,0.25 0,0.139 -0.148,0.25 -0.333,0.25 -0.185,0 -0.333,0.111 -0.333,0.25 0,0.167 -0.167,0.25 -0.5,0.25 -0.334,0 -0.5,0.084 -0.5,0.25 0,0.138 -0.113,0.25 -0.25,0.25 -0.138,0 -0.25,0.113 -0.25,0.25 0,0.155 -0.157,0.25 -0.409,0.25 -0.224,0 -0.468,0.1 -0.541,0.221 -0.074,0.122 -0.265,0.269 -0.425,0.328 -0.161,0.059 -0.292,0.222 -0.292,0.363 0,0.14 -0.112,0.255 -0.25,0.255 -0.137,0 -0.25,0.113 -0.25,0.25 0,0.167 -0.167,0.25 -0.5,0.25 -0.333,0 -0.5,0.083 -0.5,0.25 0,0.138 -0.112,0.25 -0.25,0.25 -0.137,0 -0.25,0.113 -0.25,0.25 0,0.167 -0.167,0.25 -0.505,0.25 -0.296,0 -0.545,0.104 -0.601,0.25 -0.055,0.143 -0.304,0.25 -0.578,0.25 -0.318,0 -0.483,0.085 -0.483,0.25 0,0.138 -0.112,0.25 -0.25,0.25 -0.137,0 -0.25,-0.112 -0.25,-0.25 0,-0.137 0.113,-0.25 0.25,-0.25 0.138,0 0.25,-0.112 0.25,-0.25 0,-0.137 0.113,-0.25 0.25,-0.25 0.138,0 0.25,-0.112 0.25,-0.25 0,-0.167 0.167,-0.25 0.5,-0.25 0.334,0 0.5,-0.083 0.5,-0.25 0,-0.167 0.168,-0.25 0.506,-0.25 0.295,0 0.545,-0.104 0.601,-0.25 0.052,-0.137 0.2,-0.25 0.328,-0.25 0.128,0 0.232,-0.15 0.232,-0.333 0,-0.26 0.111,-0.334 0.5,-0.334 0.333,0 0.5,-0.083 0.5,-0.25 0,-0.137 0.113,-0.25 0.25,-0.25 0.138,0 0.25,-0.112 0.25,-0.25 0,-0.139 0.148,-0.25 0.333,-0.25 0.184,0 0.334,-0.104 0.334,-0.232 0,-0.128 0.112,-0.275 0.25,-0.328 0.179,-0.069 0.25,-0.35 0.25,-1 0,-0.937 -0.13,-1.106 -0.847,-1.106 -0.176,0 -0.32,-0.113 -0.32,-0.25 0,-0.192 -0.214,-0.25 -0.922,-0.25 -0.666,0 -0.948,0.069 -1.018,0.25 -0.074,0.194 -0.404,0.25 -1.483,0.25 -1.01,0 -1.454,0.068 -1.637,0.25 -0.163,0.163 -0.577,0.25 -1.194,0.25 -0.804,0 -0.957,0.049 -1.031,0.333 -0.07,0.269 -0.227,0.333 -0.818,0.333 -0.538,0 -0.73,0.066 -0.73,0.25 0,0.139 -0.148,0.25 -0.334,0.25 -0.185,0 -0.333,0.111 -0.333,0.25 0,0.157 -0.158,0.25 -0.422,0.25 -0.232,0 -0.465,0.113 -0.518,0.25 -0.052,0.138 -0.2,0.25 -0.328,0.25 -0.128,0 -0.232,0.113 -0.232,0.25 0,0.138 -0.112,0.25 -0.25,0.25 -0.137,0 -0.25,0.113 -0.25,0.25 0,0.14 -0.148,0.25 -0.335,0.25 -0.184,0 -0.463,0.15 -0.62,0.334 -0.157,0.183 -0.382,0.333 -0.499,0.333 -0.117,0 -0.213,0.113 -0.213,0.25 0,0.167 -0.166,0.25 -0.5,0.25 -0.333,0 -0.5,0.083 -0.5,0.25 0,0.138 -0.112,0.25 -0.25,0.25 -0.137,0 -0.25,0.113 -0.25,0.25 0,0.167 -0.166,0.25 -0.5,0.25 -0.333,0 -0.5,0.083 -0.5,0.25 0,0.138 -0.115,0.25 -0.255,0.25 -0.14,0 -0.298,0.113 -0.351,0.25 -0.075,0.196 -0.416,0.25 -1.59,0.25 -1.106,0 -1.559,-0.065 -1.744,-0.25 -0.197,-0.196 -0.712,-0.25 -2.405,-0.25 -1.804,0 -2.155,0.041 -2.155,0.25 0,0.193 -0.218,0.251 -0.958,0.252 -1.189,0.003 -1.708,0.135 -1.708,0.434 0,0.436 -9.435,0.33 -9.55,-0.107 -0.087,-0.332 -0.191,-0.336 -7.629,-0.318 -6.726,0.016 -7.558,-0.011 -7.69,-0.247 -0.208,-0.371 -2.429,-0.383 -2.571,-0.014 -0.083,0.217 -1.098,0.25 -7.727,0.25 -6.629,0 -7.644,-0.033 -7.727,-0.25 -0.142,-0.37 -5.795,-0.37 -6.166,0 -0.366,0.366 -5.181,0.366 -5.547,0 -0.356,-0.355 -3.098,-0.355 -3.453,0 -0.212,0.212 -1.066,0.25 -5.594,0.25 -5.163,0 -5.351,0.011 -5.552,0.333 -0.203,0.326 -0.388,0.334 -7.745,0.334 -7.367,0 -7.542,-0.008 -7.716,-0.334 -0.157,-0.293 -0.349,-0.333 -1.589,-0.333 -1.143,0 -1.411,-0.047 -1.411,-0.25 0,-0.167 0.167,-0.25 0.5,-0.25 0.333,0 0.5,-0.083 0.5,-0.25 0,-0.137 0.113,-0.25 0.25,-0.25 0.138,0 0.25,-0.112 0.25,-0.25 0,-0.137 0.113,-0.25 0.25,-0.25 0.138,0 0.25,-0.104 0.25,-0.232 0,-0.128 0.113,-0.276 0.25,-0.328 0.184,-0.071 0.25,-0.362 0.25,-1.101 v -1.006 h -0.5 c -0.333,0 -0.5,-0.083 -0.5,-0.25 0,-0.185 -0.194,-0.25 -0.75,-0.25 -0.556,0 -0.75,0.065 -0.75,0.25 0,0.186 -0.195,0.25 -0.755,0.25 -0.518,0 -0.786,0.079 -0.851,0.25 -0.053,0.138 -0.278,0.25 -0.5,0.25 -0.223,0 -0.448,0.113 -0.5,0.25 -0.07,0.181 -0.356,0.251 -1.037,0.253 -1.171,0.002 -1.69,0.136 -1.69,0.433 0,0.127 -0.113,0.231 -0.25,0.231 -0.138,0 -0.25,0.113 -0.25,0.25 0,0.175 -0.176,0.25 -0.584,0.25 -0.407,0 -0.583,0.075 -0.583,0.25 0,0.2 -0.25,0.25 -1.25,0.25 -1,0 -1.25,0.05 -1.25,0.25 0,0.139 -0.148,0.25 -0.333,0.25 -0.186,0 -0.334,0.111 -0.334,0.25 0,0.2 -0.25,0.25 -1.255,0.25 -0.962,0 -1.278,0.058 -1.351,0.25 -0.053,0.138 -0.282,0.25 -0.51,0.25 -0.275,0 -0.444,0.113 -0.502,0.333 -0.048,0.184 -0.191,0.334 -0.318,0.334 -0.127,0 -0.23,0.112 -0.23,0.25 0,0.137 -0.113,0.25 -0.25,0.25 -0.2,0 -0.25,0.248 -0.25,1.232 0,1.333 0.07,1.434 0.995,1.434 0.263,0 0.511,0.11 0.565,0.25 0.056,0.146 0.306,0.25 0.601,0.25 0.338,0 0.505,0.083 0.505,0.25 0,0.186 0.195,0.25 0.75,0.25 0.556,0 0.75,0.065 0.75,0.25 0,0.205 0.287,0.25 1.584,0.25 1.296,0 1.583,0.046 1.583,0.25 0,0.167 0.167,0.25 0.5,0.25 0.333,0 0.5,0.084 0.5,0.25 0,0.201 0.255,0.25 1.293,0.25 1.113,0 1.323,0.047 1.502,0.334 0.167,0.267 0.388,0.333 1.123,0.333 0.703,0 0.915,0.058 0.915,0.25 0,0.165 0.165,0.25 0.483,0.25 0.274,0 0.523,0.107 0.578,0.25 0.073,0.192 0.389,0.25 1.351,0.25 h 1.255 v -0.482 c 0,-0.275 0.107,-0.524 0.25,-0.578 0.138,-0.053 0.25,-0.288 0.25,-0.523 0,-0.235 -0.112,-0.471 -0.25,-0.523 -0.137,-0.053 -0.25,-0.201 -0.25,-0.328 0,-0.128 -0.112,-0.233 -0.25,-0.233 -0.137,0 -0.25,-0.112 -0.25,-0.25 0,-0.137 -0.112,-0.25 -0.25,-0.25 -0.137,0 -0.25,-0.112 -0.25,-0.25 0,-0.137 -0.112,-0.25 -0.25,-0.25 -0.137,0 -0.25,-0.104 -0.25,-0.232 0,-0.128 0.113,-0.275 0.25,-0.328 0.138,-0.053 0.25,-0.211 0.25,-0.351 0,-0.14 0.113,-0.255 0.25,-0.255 0.138,0 0.25,0.104 0.25,0.232 0,0.417 0.419,0.434 10.529,0.434 9.862,0 10.003,-0.004 10.089,-0.333 0.114,-0.436 15.382,-0.537 15.382,-0.101 0,0.575 3.469,0.672 3.618,0.101 0.115,-0.436 16.382,-0.537 16.382,-0.101 0,0.344 0.383,0.434 1.847,0.434 1.209,0 1.32,-0.028 1.32,-0.333 0,-0.319 0.111,-0.333 2.666,-0.333 2.556,0 2.667,0.014 2.667,0.333 0,0.331 0.111,0.333 16.316,0.333 14.348,0 16.327,0.03 16.411,0.25 0.053,0.138 0.211,0.25 0.351,0.25 0.14,0 0.255,0.113 0.255,0.25 0,0.138 0.113,0.25 0.25,0.25 0.138,0 0.25,0.113 0.25,0.25 0,0.138 0.113,0.25 0.25,0.25 0.138,0 0.25,0.113 0.25,0.25 0,0.138 0.113,0.25 0.25,0.25 0.138,0 0.25,0.113 0.25,0.25 0,0.138 0.113,0.25 0.25,0.25 0.138,0 0.252,0.094 0.253,0.209 0.004,0.254 0.723,0.958 0.979,0.958 0.102,0 0.185,0.113 0.185,0.25 0,0.138 0.113,0.25 0.25,0.25 0.138,0 0.25,0.113 0.25,0.25 0,0.138 0.113,0.25 0.25,0.25 0.138,0 0.25,0.113 0.25,0.25 0,0.167 0.167,0.25 0.5,0.25 0.333,0 0.5,0.083 0.5,0.25 0,0.138 0.113,0.25 0.25,0.25 0.138,0 0.25,0.12 0.25,0.266 0,0.146 0.15,0.304 0.333,0.352 0.184,0.048 0.334,0.191 0.334,0.318 0,0.127 0.112,0.231 0.25,0.231 0.137,0 0.25,0.112 0.25,0.25 0,0.166 0.166,0.25 0.5,0.25 0.333,0 0.5,0.083 0.5,0.25 0,0.166 0.166,0.25 0.5,0.25 0.333,0 0.5,0.083 0.5,0.25 0,0.213 0.463,0.25 3.166,0.25 h 3.167 v -1.068 c 0,-0.986 0.026,-1.061 0.333,-0.981 0.184,0.048 0.334,0.191 0.334,0.318 0,0.127 0.112,0.231 0.25,0.231 0.137,0 0.25,0.112 0.25,0.25 0,0.137 0.112,0.25 0.25,0.25 0.137,0 0.25,0.112 0.25,0.25 0,0.137 0.112,0.25 0.25,0.25 0.137,0 0.25,0.112 0.25,0.25 0,0.174 0.176,0.25 0.583,0.25 0.384,0 0.583,0.078 0.583,0.229 0,0.386 1.662,0.566 2.667,0.289 m -7,-3.352 c 0,-0.185 -0.111,-0.333 -0.25,-0.333 -0.137,0 -0.25,-0.112 -0.25,-0.25 0,-0.137 -0.112,-0.25 -0.25,-0.25 -0.137,0 -0.25,-0.112 -0.25,-0.25 0,-0.137 -0.112,-0.25 -0.25,-0.25 -0.137,0 -0.25,-0.112 -0.25,-0.25 0,-0.139 -0.148,-0.25 -0.333,-0.25 -0.186,0 -0.334,-0.111 -0.334,-0.25 0,-0.137 -0.112,-0.25 -0.25,-0.25 -0.137,0 -0.25,-0.112 -0.25,-0.25 0,-0.167 -0.166,-0.25 -0.5,-0.25 -0.389,0 -0.5,-0.074 -0.5,-0.333 0,-0.186 -0.111,-0.334 -0.25,-0.334 -0.137,0 -0.25,-0.112 -0.25,-0.25 0,-0.137 -0.112,-0.25 -0.25,-0.25 -0.137,0 -0.25,-0.112 -0.25,-0.25 0,-0.139 -0.148,-0.25 -0.333,-0.25 -0.185,0 -0.333,-0.111 -0.333,-0.25 0,-0.166 -0.167,-0.25 -0.5,-0.25 -0.334,0 -0.5,-0.083 -0.5,-0.25 0,-0.189 0.203,-0.25 0.833,-0.25 0.63,0 0.833,0.061 0.833,0.25 0,0.138 0.113,0.25 0.25,0.25 0.138,0 0.25,0.113 0.25,0.25 0,0.138 0.113,0.25 0.25,0.25 0.138,0 0.25,0.113 0.25,0.25 0,0.138 0.113,0.25 0.25,0.25 0.138,0 0.25,0.113 0.25,0.25 0,0.138 0.113,0.25 0.25,0.25 0.138,0 0.25,0.113 0.25,0.25 0,0.138 0.113,0.25 0.25,0.25 0.138,0 0.25,0.12 0.25,0.266 0,0.146 0.15,0.305 0.334,0.353 0.183,0.048 0.333,0.191 0.333,0.317 0,0.127 0.113,0.231 0.25,0.231 0.138,0 0.25,0.113 0.25,0.25 0,0.138 0.113,0.25 0.25,0.25 0.138,0 0.25,0.113 0.25,0.25 0,0.138 0.113,0.25 0.25,0.25 0.138,0 0.25,0.113 0.25,0.25 0,0.138 0.113,0.25 0.25,0.25 0.138,0 0.25,0.107 0.25,0.238 0,0.131 0.131,0.272 0.292,0.314 0.16,0.042 0.048,0.085 -0.25,0.095 -0.437,0.016 -0.542,-0.045 -0.542,-0.314 m 8.5,-8.416 c 0,-0.138 0.113,-0.25 0.25,-0.25 0.138,0 0.25,0.112 0.25,0.25 0,0.137 -0.112,0.25 -0.25,0.25 -0.137,0 -0.25,-0.113 -0.25,-0.25 m 1,-0.584 c 0,-0.244 0.111,-0.333 0.418,-0.333 0.376,0 0.397,0.033 0.21,0.333 -0.115,0.184 -0.303,0.334 -0.418,0.334 -0.116,0 -0.21,-0.15 -0.21,-0.334 m -7.382,0 c 0.048,-0.183 0.222,-0.333 0.386,-0.333 0.216,0 0.274,0.092 0.211,0.333 -0.048,0.184 -0.221,0.334 -0.386,0.334 -0.216,0 -0.274,-0.092 -0.211,-0.334 m 8.382,-0.583 c 0,-0.139 0.148,-0.25 0.333,-0.25 0.186,0 0.334,-0.111 0.334,-0.25 0,-0.137 0.112,-0.25 0.25,-0.25 0.137,0 0.25,-0.112 0.25,-0.25 0,-0.167 0.166,-0.25 0.5,-0.25 0.333,0 0.5,-0.083 0.5,-0.25 0,-0.137 0.112,-0.25 0.25,-0.25 0.137,0 0.25,-0.112 0.25,-0.25 0,-0.168 0.168,-0.25 0.515,-0.25 0.376,0 0.54,-0.091 0.603,-0.333 0.048,-0.184 0.221,-0.334 0.386,-0.334 0.216,0 0.274,0.092 0.211,0.334 -0.048,0.183 -0.191,0.333 -0.318,0.333 -0.127,0 -0.231,0.113 -0.231,0.25 0,0.167 -0.166,0.25 -0.5,0.25 -0.333,0 -0.5,0.083 -0.5,0.25 0,0.139 -0.148,0.25 -0.333,0.25 -0.185,0 -0.333,0.111 -0.333,0.25 0,0.156 -0.158,0.25 -0.422,0.25 -0.232,0 -0.465,0.113 -0.518,0.25 -0.053,0.138 -0.2,0.25 -0.328,0.25 -0.128,0 -0.232,0.113 -0.232,0.25 0,0.139 -0.148,0.25 -0.334,0.25 -0.185,0 -0.333,-0.111 -0.333,-0.25 m -7.333,0 c 0,-0.138 0.147,-0.25 0.328,-0.25 0.223,0 0.297,0.08 0.232,0.25 -0.053,0.138 -0.2,0.25 -0.328,0.25 -0.128,0 -0.232,-0.112 -0.232,-0.25 m 1,-0.5 c 0,-0.139 0.148,-0.25 0.333,-0.25 0.185,0 0.333,-0.111 0.333,-0.25 0,-0.137 0.113,-0.25 0.25,-0.25 0.138,0 0.25,0.113 0.25,0.25 0,0.138 -0.112,0.25 -0.25,0.25 -0.137,0 -0.25,0.113 -0.25,0.25 0,0.139 -0.148,0.25 -0.333,0.25 -0.185,0 -0.333,-0.111 -0.333,-0.25 m 2.106,-1.5 c 0.053,-0.137 0.2,-0.25 0.328,-0.25 0.128,0 0.232,-0.15 0.232,-0.333 0,-0.223 0.111,-0.334 0.334,-0.334 0.222,0 0.333,0.111 0.333,0.334 0,0.222 -0.111,0.333 -0.333,0.333 -0.186,0 -0.334,0.111 -0.334,0.25 0,0.138 -0.147,0.25 -0.328,0.25 -0.223,0 -0.297,-0.08 -0.232,-0.25"
       inkscape:connector-curvature="0"
       style="fill:#ffffff;fill-rule:evenodd;stroke:none"
       sodipodi:nodetypes="cssssssssssscssssssssssssssssssssssssssssssssssssssssssssssscssssscssssssssssssssssscsssssssssssssssssscssssssssssssssscsssssssssscssssssssscscsssssssscssssscccssssssscsssssscssscssssscscsssssssssccsssssssscssssssssssscsssssssscsssscscscssssscssssscssssssssscscsscsccccscccsscscsssssssscscssssscsccsssssssssscscssssscssssssssscssscscscscssssssscsssscscsssssscssssssssscsssssssssscsssssssscscsssssssssccsssssssssssssssssssssssssssssssscsssssssssccccsssccscsccscsccssssssssscscssssssscsssccscsccsssssssccsssssssc" />
    <path
       id="path1"
       d=""
       inkscape:connector-curvature="0"
       style="fill:#080404;fill-rule:evenodd;stroke:none" />
  </g>
</svg>
