"../../../Engine/Content/EngineDebugMaterials/HeatmapGradient.uasset" 0
"../../../Engine/Content/EngineDebugMaterials/BoneWeightMaterial.uasset" 1
"../../../Engine/Content/Functions/Engine_MaterialFunctions01/Opacity/CameraDepthFade.uasset" 2
"../../../Engine/Content/EngineMaterials/T_Default_Material_Grid_M.uasset" 3
"../../../Engine/Content/EngineMaterials/T_Default_Material_Grid_N.uasset" 4
"../../../Engine/Content/EngineMaterials/DefaultMaterial.uasset" 5
"../../../Engine/Content/BasicShapes/Sphere.uasset" 6
"../../../../../Git Projects/SnakeGame/Content/FoodBonusBP.uasset" 7
"../../../Engine/Content/BasicShapes/BasicShapeMaterial.uasset" 8
"../../../../../Git Projects/SnakeGame/Content/FoodBP.uasset" 9
"../../../Engine/Content/EditorMaterials/Cascade/CASC_ModuleEnable.uasset" 10
"../../../Engine/Content/EditorMaterials/Cascade/CASC_ModuleEnable_MAT.uasset" 11
"../../../Engine/Content/EngineMaterials/WorldGridMaterial.uasset" 12
"../../../Engine/Content/BasicShapes/Cube.uasset" 13
"../../../../../Git Projects/SnakeGame/Content/SlowDownBonusBP.uasset" 14
"../../../Engine/Content/VREditor/UI/ArrowMaterial.uasset" 15
"../../../../../Git Projects/SnakeGame/Content/StarterContent/Textures/T_CobbleStone_Rough_D.uasset" 16
"../../../../../Git Projects/SnakeGame/Content/StarterContent/Textures/T_CobbleStone_Rough_N.uasset" 17
"../../../../../Git Projects/SnakeGame/Content/StarterContent/Textures/T_Gradinet_01.uasset" 18
"../../../../../Git Projects/SnakeGame/Content/StarterContent/Textures/T_Rock_Smooth_Granite_D.uasset" 19
"../../../../../Git Projects/SnakeGame/Content/StarterContent/Materials/M_CobbleStone_Rough.uasset" 20
"../../../../../Git Projects/SnakeGame/Content/SmallWallBP.uasset" 21
"../../../Engine/Content/EditorMaterials/Cascade/CASC_ModuleDisable.uasset" 22
"../../../Engine/Content/EditorMaterials/Cascade/CASC_ModuleDisable_MAT.uasset" 23
"../../../../../Git Projects/SnakeGame/Content/SpeedBonusBP.uasset" 24
"../../../Engine/Content/EditorMaterials/WidgetGridVertexColorMaterial.uasset" 25
"../../../Engine/Content/EditorMaterials/WidgetGridVertexColorMaterial_Ma.uasset" 26
"../../../../../Git Projects/SnakeGame/Content/WallBonusBP.uasset" 27
"../../../../../Git Projects/SnakeGame/Content/ArenaBP.uasset" 28
"../../../Engine/Content/MapTemplates/Materials/BasicAsset01.uasset" 29
"../../../Engine/Content/MapTemplates/Materials/BasicAsset03.uasset" 30
"../../../../../Git Projects/SnakeGame/Content/SnakeElemBP.uasset" 31
"../../../../../Git Projects/SnakeGame/Content/SnakeBP.uasset" 32
"../../../../../Git Projects/SnakeGame/Content/PlayerPawnBP.uasset" 33
"../../../../../Git Projects/SnakeGame/Content/SnakeGameModeBP.uasset" 34
"../../../../../Git Projects/SnakeGame/Content/StarterContent/Materials/M_Basic_Wall.uasset" 35
"../../../../../Git Projects/SnakeGame/Content/StarterContent/Architecture/Pillar_50x500.uasset" 36
"../../../../../Git Projects/SnakeGame/Content/StarterContent/Architecture/Wall_400x300.uasset" 37
"../../../../../Git Projects/SnakeGame/Content/StarterContent/Architecture/Wall_400x400.uasset" 38
"../../../../../Git Projects/SnakeGame/Content/StarterContent/Architecture/Wall_500x500.uasset" 39
"../../../../../Git Projects/SnakeGame/Content/StarterContent/Architecture/Wall_Door_400x400.uasset" 40
"../../../../../Git Projects/SnakeGame/Content/StarterContent/Architecture/Wall_Window_400x400.uasset" 41
"../../../../../Git Projects/SnakeGame/Content/StarterContent/Audio/Collapse01.uasset" 42
"../../../../../Git Projects/SnakeGame/Content/StarterContent/Audio/Collapse02.uasset" 43
"../../../../../Git Projects/SnakeGame/Content/StarterContent/Audio/Explosion01.uasset" 44
"../../../../../Git Projects/SnakeGame/Content/StarterContent/Audio/Explosion02.uasset" 45
"../../../../../Git Projects/SnakeGame/Content/StarterContent/Audio/Fire01.uasset" 46
"../../../../../Git Projects/SnakeGame/Content/StarterContent/Audio/Fire_Sparks01.uasset" 47
"../../../../../Git Projects/SnakeGame/Content/StarterContent/Audio/Light01.uasset" 48
"../../../../../Git Projects/SnakeGame/Content/StarterContent/Audio/Light01_Cue.uasset" 49
"../../../../../Git Projects/SnakeGame/Content/StarterContent/Audio/Light02.uasset" 50
"../../../../../Git Projects/SnakeGame/Content/StarterContent/Audio/Light02_Cue.uasset" 51
"../../../../../Git Projects/SnakeGame/Content/StarterContent/Audio/Smoke01.uasset" 52
"../../../../../Git Projects/SnakeGame/Content/StarterContent/Audio/Starter_Birds01.uasset" 53
"../../../../../Git Projects/SnakeGame/Content/StarterContent/Audio/Starter_Music01.uasset" 54
"../../../../../Git Projects/SnakeGame/Content/StarterContent/Audio/Starter_Wind05.uasset" 55
"../../../../../Git Projects/SnakeGame/Content/StarterContent/Audio/Starter_Wind06.uasset" 56
"../../../../../Git Projects/SnakeGame/Content/StarterContent/Audio/Steam01.uasset" 57
"../../../../../Git Projects/SnakeGame/Content/StarterContent/Audio/Explosion_Cue.uasset" 58
"../../../../../Git Projects/SnakeGame/Content/StarterContent/Textures/T_Burst_M.uasset" 59
"../../../../../Git Projects/SnakeGame/Content/StarterContent/Particles/Materials/M_Burst.uasset" 60
"../../../../../Git Projects/SnakeGame/Content/StarterContent/Textures/T_Explosion_SubUV.uasset" 61
"../../../../../Git Projects/SnakeGame/Content/StarterContent/Particles/Materials/M_explosion_subUV.uasset" 62
"../../../../../Git Projects/SnakeGame/Content/StarterContent/Particles/Materials/m_flare_01.uasset" 63
"../../../Engine/Content/Functions/Engine_MaterialFunctions01/Gradient/RadialGradient.uasset" 64
"../../../../../Git Projects/SnakeGame/Content/StarterContent/Particles/Materials/M_radial_ramp.uasset" 65
"../../../../../Git Projects/SnakeGame/Content/StarterContent/Textures/T_Smoke_SubUV.uasset" 66
"../../../../../Git Projects/SnakeGame/Content/StarterContent/Textures/T_Smoke_Tiled_D.uasset" 67
"../../../../../Git Projects/SnakeGame/Content/StarterContent/Particles/Materials/M_smoke_subUV.uasset" 68
"../../../../../Git Projects/SnakeGame/Content/StarterContent/Particles/P_Explosion.uasset" 69
"../../../../../Git Projects/SnakeGame/Content/StarterContent/Blueprints/Blueprint_Effect_Explosion.uasset" 70
"../../../Engine/Content/EditorMeshes/ColorCalibrator/T_ColorGrid.uasset" 71
"../../../../../Git Projects/SnakeGame/Content/StarterContent/Materials/M_ColorGrid_LowSpec.uasset" 72
"../../../../../Git Projects/SnakeGame/Content/StarterContent/Textures/T_Bush_D.uasset" 73
"../../../../../Git Projects/SnakeGame/Content/StarterContent/Textures/T_Bush_N.uasset" 74
"../../../../../Git Projects/SnakeGame/Content/StarterContent/Props/Materials/M_Bush.uasset" 75
"../../../../../Git Projects/SnakeGame/Content/StarterContent/Props/SM_Bush.uasset" 76
"../../../../../Git Projects/SnakeGame/Content/StarterContent/Textures/T_Chair_M.uasset" 77
"../../../../../Git Projects/SnakeGame/Content/StarterContent/Textures/T_Chair_N.uasset" 78
"../../../../../Git Projects/SnakeGame/Content/StarterContent/Props/Materials/M_Chair.uasset" 79
"../../../../../Git Projects/SnakeGame/Content/StarterContent/Props/SM_Couch.uasset" 80
"../../../../../Git Projects/SnakeGame/Content/StarterContent/Materials/M_Glass.uasset" 81
"../../../../../Git Projects/SnakeGame/Content/StarterContent/Textures/T_Door_M.uasset" 82
"../../../../../Git Projects/SnakeGame/Content/StarterContent/Textures/T_Door_N.uasset" 83
"../../../../../Git Projects/SnakeGame/Content/StarterContent/Props/Materials/M_Door.uasset" 84
"../../../../../Git Projects/SnakeGame/Content/StarterContent/Props/SM_Door.uasset" 85
"../../../../../Git Projects/SnakeGame/Content/StarterContent/Props/Materials/M_MaterialSphere.uasset" 86
"../../../../../Git Projects/SnakeGame/Content/StarterContent/Props/Materials/M_MaterialSphere_Plain.uasset" 87
"../../../../../Git Projects/SnakeGame/Content/StarterContent/Props/SM_MatPreviewMesh_02.uasset" 88
"../../../Engine/Content/Functions/Engine_MaterialFunctions02/Utility/BlendAngleCorrectedNormals.uasset" 89
"../../../../../Git Projects/SnakeGame/Content/StarterContent/Textures/T_Detail_Rocky_N.uasset" 90
"../../../../../Git Projects/SnakeGame/Content/StarterContent/Textures/T_Rock_Basalt_D.uasset" 91
"../../../../../Git Projects/SnakeGame/Content/StarterContent/Textures/T_RockMesh_M.uasset" 92
"../../../../../Git Projects/SnakeGame/Content/StarterContent/Textures/T_RockMesh_N.uasset" 93
"../../../../../Git Projects/SnakeGame/Content/StarterContent/Props/Materials/M_Rock.uasset" 94
"../../../../../Git Projects/SnakeGame/Content/StarterContent/Props/SM_Rock.uasset" 95
"../../../../../Git Projects/SnakeGame/Content/StarterContent/Textures/T_Shelf_M.uasset" 96
"../../../../../Git Projects/SnakeGame/Content/StarterContent/Textures/T_Shelf_N.uasset" 97
"../../../../../Git Projects/SnakeGame/Content/StarterContent/Props/Materials/M_Shelf.uasset" 98
"../../../../../Git Projects/SnakeGame/Content/StarterContent/Props/SM_Shelf.uasset" 99
"../../../../../Git Projects/SnakeGame/Content/StarterContent/Materials/M_Basic_Floor.uasset" 100
"../../../../../Git Projects/SnakeGame/Content/StarterContent/Props/SM_Stairs.uasset" 101
"../../../../../Git Projects/SnakeGame/Content/StarterContent/Shapes/Shape_Cone.uasset" 102
"../../../../../Git Projects/SnakeGame/Content/StarterContent/Shapes/Shape_Cylinder.uasset" 103
"../../../../../Git Projects/SnakeGame/Content/StarterContent/Shapes/Shape_NarrowCapsule.uasset" 104
"../../../../../Git Projects/SnakeGame/Content/StarterContent/Shapes/Shape_Pipe.uasset" 105
"../../../../../Git Projects/SnakeGame/Content/StarterContent/Shapes/Shape_Pipe_180.uasset" 106
"../../../../../Git Projects/SnakeGame/Content/StarterContent/Shapes/Shape_Pipe_90.uasset" 107
"../../../../../Git Projects/SnakeGame/Content/StarterContent/Shapes/Shape_Plane.uasset" 108
"../../../../../Git Projects/SnakeGame/Content/StarterContent/Shapes/Shape_Torus.uasset" 109
"../../../../../Git Projects/SnakeGame/Content/StarterContent/Shapes/Shape_Trim.uasset" 110
"../../../../../Git Projects/SnakeGame/Content/StarterContent/Shapes/Shape_Trim_90_In.uasset" 111
"../../../../../Git Projects/SnakeGame/Content/StarterContent/Shapes/Shape_Trim_90_Out.uasset" 112
"../../../../../Git Projects/SnakeGame/Content/StarterContent/Shapes/Shape_TriPyramid.uasset" 113
"../../../../../Git Projects/SnakeGame/Content/StarterContent/Shapes/Shape_Tube.uasset" 114
"../../../../../Git Projects/SnakeGame/Content/StarterContent/Shapes/Shape_Wedge_A.uasset" 115
"../../../../../Git Projects/SnakeGame/Content/StarterContent/Shapes/Shape_Wedge_B.uasset" 116
"../../../../../Git Projects/SnakeGame/Content/StarterContent/Shapes/Shape_WideCapsule.uasset" 117
"../../../Engine/Content/Animation/DefaultAnimCurveCompressionSettings.uasset" 118
"../../../Engine/Content/ArtTools/RenderToTexture/Meshes/S_1_Unit_Plane.uasset" 119
"../../../Engine/Content/BasicShapes/Cone.uasset" 120
"../../../Engine/Content/BasicShapes/Cylinder.uasset" 121
"../../../Engine/Content/BasicShapes/Plane.uasset" 122
"../../../Engine/Content/EditorLandscapeResources/DataLayer.uasset" 123
"../../../Engine/Content/EditorMaterials/GizmoMaterial.uasset" 124
"../../../Engine/Content/EditorMaterials/MAT_Groups_Toggle.uasset" 125
"../../../Engine/Content/EditorMaterials/MAT_Groups_Visibility.uasset" 126
"../../../Engine/Content/EditorMaterials/PreviewShadowIndicator.uasset" 127
"../../../Engine/Content/EditorMaterials/PreviewShadowIndicatorMaterial.uasset" 128
"../../../Engine/Content/EditorMaterials/MatineeGroups/MAT_ColorTrack.uasset" 129
"../../../Engine/Content/EditorMaterials/MatineeGroups/MAT_Groups_Anim.uasset" 130
"../../../Engine/Content/EditorMaterials/MatineeGroups/MAT_Groups_AudioMaster.uasset" 131
"../../../Engine/Content/EditorMaterials/MatineeGroups/MAT_Groups_Director.uasset" 132
"../../../Engine/Content/EditorMaterials/MatineeGroups/MAT_Groups_Event.uasset" 133
"../../../Engine/Content/EditorMaterials/MatineeGroups/MAT_Groups_Fade.uasset" 134
"../../../Engine/Content/EditorMaterials/MatineeGroups/MAT_Groups_Float.uasset" 135
"../../../Engine/Content/EditorMaterials/MatineeGroups/MAT_Groups_Move.uasset" 136
"../../../Engine/Content/EditorMaterials/MatineeGroups/MAT_Groups_Slomo.uasset" 137
"../../../Engine/Content/EditorMaterials/MatineeGroups/MAT_Groups_Sound.uasset" 138
"../../../Engine/Content/EditorMaterials/MatineeGroups/MAT_Groups_Vector.uasset" 139
"../../../Engine/Content/EditorMaterials/ParticleSystems/PSysThumbnail_NoImage.uasset" 140
"../../../Engine/Content/EditorMaterials/ParticleSystems/PSysThumbnail_OOD.uasset" 141
"../../../Engine/Content/EditorMaterials/Camera/CineMat.uasset" 142
"../../../Engine/Content/EditorMaterials/Camera/MI_CineMat_Rig.uasset" 143
"../../../Engine/Content/EditorMeshes/Camera/SM_CraneRig_Arm.uasset" 144
"../../../Engine/Content/EditorMeshes/Camera/SM_CraneRig_Base.uasset" 145
"../../../Engine/Content/EditorMeshes/Camera/SM_CraneRig_Body.uasset" 146
"../../../Engine/Content/EditorMeshes/Camera/SM_CraneRig_Mount.uasset" 147
"../../../Engine/Content/EditorMeshes/Camera/SM_RailRig_Mount.uasset" 148
"../../../Engine/Content/EditorMeshes/Camera/SM_RailRig_Track.uasset" 149
"../../../Engine/Content/EditorResources/BSPVertex.uasset" 150
"../../../Engine/Content/EditorResources/EmptyActor.uasset" 151
"../../../Engine/Content/EditorResources/S_Actor.uasset" 152
"../../../Engine/Content/EditorResources/S_Note.uasset" 153
"../../../Engine/Content/EditorResources/S_Trigger.uasset" 154
"../../../Engine/Content/EditorResources/AudioIcons/S_AudioComponent.uasset" 155
"../../../Engine/Content/EditorResources/AudioIcons/S_AudioComponent_AutoActivate.uasset" 156
"../../../Engine/Content/EditorResources/LightIcons/S_LightError.uasset" 157
"../../../Engine/Content/EditorResources/SequenceRecorder/Countdown.uasset" 158
"../../../Engine/Content/EditorResources/SequenceRecorder/RecordingIndicator.uasset" 159
"../../../Engine/Content/EditorSounds/Notifications/CompileFailed.uasset" 160
"../../../Engine/Content/EditorSounds/Notifications/CompileFailed_Cue.uasset" 161
"../../../Engine/Content/EditorSounds/Notifications/CompileSuccess.uasset" 162
"../../../Engine/Content/EditorSounds/Notifications/CompileStart_Cue.uasset" 163
"../../../Engine/Content/EditorSounds/Notifications/CompileSuccess_Cue.uasset" 164
"../../../Engine/Content/EngineDamageTypes/DmgTypeBP_Environmental.uasset" 165
"../../../Engine/Content/EngineDebugMaterials/ClothMaterial.uasset" 166
"../../../Engine/Content/EngineDebugMaterials/ClothMaterial_WF.uasset" 167
"../../../Engine/Content/EngineDebugMaterials/DebugEditorMaterial.uasset" 168
"../../../Engine/Content/EngineDebugMaterials/DebugMeshMaterial.uasset" 169
"../../../Engine/Content/EngineDebugMaterials/GeomMaterial.uasset" 170
"../../../Engine/Content/EngineDebugMaterials/M_SimpleTranslucent.uasset" 171
"../../../Engine/Content/EngineFonts/Faces/RobotoBold.uasset" 172
"../../../Engine/Content/EngineFonts/Faces/RobotoBoldItalic.uasset" 173
"../../../Engine/Content/EngineFonts/Faces/RobotoItalic.uasset" 174
"../../../Engine/Content/EngineFonts/Faces/RobotoLight.uasset" 175
"../../../Engine/Content/EngineFonts/Faces/RobotoRegular.uasset" 176
"../../../Engine/Content/EngineFonts/Roboto.uasset" 177
"../../../Engine/Content/EngineFonts/Faces/RobotoTiny.uasset" 178
"../../../Engine/Content/EngineFonts/RobotoTiny.uasset" 179
"../../../Engine/Content/EngineMaterials/BaseFlattenDiffuseMap.uasset" 180
"../../../Engine/Content/EngineMaterials/BaseFlattenEmissiveMap.uasset" 181
"../../../Engine/Content/EngineMaterials/BaseFlattenGrayscaleMap.uasset" 182
"../../../Engine/Content/EngineMaterials/BaseFlattenNormalMap.uasset" 183
"../../../Engine/Content/EngineMaterials/BaseFlattenMaterial.uasset" 184
"../../../Engine/Content/EngineMaterials/DefaultBloomKernel.uasset" 185
"../../../Engine/Content/EngineMaterials/DefaultBokeh.uasset" 186
"../../../Engine/Content/EngineMaterials/DefaultDiffuse.uasset" 187
"../../../Engine/Content/EngineMaterials/DefaultDeferredDecalMaterial.uasset" 188
"../../../Engine/Content/EngineMaterials/DefaultLightFunctionMaterial.uasset" 189
"../../../Engine/Content/EngineMaterials/DefaultPhysicalMaterial.uasset" 190
"../../../Engine/Content/Functions/Engine_MaterialFunctions02/Utility/BreakOutFloat2Components.uasset" 191
"../../../Engine/Content/EngineMaterials/DefaultPostProcessMaterial.uasset" 192
"../../../Engine/Content/EngineFonts/RobotoDistanceField.uasset" 193
"../../../Engine/Content/EngineMaterials/DefaultTextMaterialOpaque.uasset" 194
"../../../Engine/Content/EngineMaterials/DefaultWhiteGrid.uasset" 195
"../../../Engine/Content/EngineMaterials/EditorBrushMaterial.uasset" 196
"../../../Engine/Content/EngineMaterials/Good64x64TilingNoiseHighFreq.uasset" 197
"../../../Engine/Content/EngineMaterials/MiniFont.uasset" 198
"../../../Engine/Content/EngineMaterials/InvalidLightmapSettings.uasset" 199
"../../../Engine/Content/EngineMaterials/M_InvalidLightmapSettings.uasset" 200
"../../../Engine/Content/Functions/Engine_MaterialFunctions02/WorldPositionOffset/CameraOffset.uasset" 201
"../../../Engine/Content/EngineMaterials/PhAT_JointLimitMaterial.uasset" 202
"../../../Engine/Content/EngineMaterials/PreintegratedSkinBRDF.uasset" 203
"../../../Engine/Content/EngineMaterials/RemoveSurfaceMaterial.uasset" 204
"../../../Engine/Content/EngineMaterials/WeightMapPlaceholderTexture.uasset" 205
"../../../Engine/Content/EngineResources/WhiteSquareTexture.uasset" 206
"../../../Engine/Content/EngineMaterials/Widget3DPassThrough.uasset" 207
"../../../Engine/Content/EngineMaterials/Widget3DPassThrough_Masked.uasset" 208
"../../../Engine/Content/EngineMaterials/Widget3DPassThrough_Opaque.uasset" 209
"../../../Engine/Content/EngineMaterials/Widget3DPassThrough_Masked_OneSided.uasset" 210
"../../../Engine/Content/EngineMaterials/Widget3DPassThrough_Opaque_OneSided.uasset" 211
"../../../Engine/Content/EngineMaterials/Widget3DPassThrough_Translucent.uasset" 212
"../../../Engine/Content/EngineMaterials/Widget3DPassThrough_Translucent_OneSided.uasset" 213
"../../../Engine/Content/EngineMeshes/Cylinder.uasset" 214
"../../../Engine/Content/EngineMeshes/Sphere.uasset" 215
"../../../Engine/Content/EngineResources/Black.uasset" 216
"../../../Engine/Content/EngineResources/DefaultTexture.uasset" 217
"../../../Engine/Content/EngineResources/DefaultTextureCube.uasset" 218
"../../../Engine/Content/EngineResources/DefaultVolumeTexture2D.uasset" 219
"../../../Engine/Content/EngineResources/DefaultVolumeTexture.uasset" 220
"../../../Engine/Content/EngineResources/GradientTexture0.uasset" 221
"../../../Engine/Content/EngineSounds/Master.uasset" 222
"../../../Engine/Content/Functions/Engine_MaterialFunctions01/Shading/ConvertFromDiffSpec.uasset" 223
"../../../Engine/Content/Functions/Engine_MaterialFunctions01/Shading/PowerToRoughness.uasset" 224
"../../../Engine/Content/Maps/Templates/Thumbnails/Default.uasset" 225
"../../../Engine/Content/Maps/Templates/Thumbnails/VR-Basic.uasset" 226
"../../../Engine/Content/MobileResources/T_MobileControls_texture.uasset" 227
"../../../Engine/Content/MobileResources/T_MobileMenu2.uasset" 228
"../../../Engine/Content/MobileResources/HUD/AnalogHat.uasset" 229
"../../../Engine/Content/MobileResources/HUD/VirtualJoystick_Background.uasset" 230
"../../../Engine/Content/MobileResources/HUD/VirtualJoystick_Thumb.uasset" 231
"../../../Engine/Content/MobileResources/HUD/DefaultVirtualJoysticks.uasset" 232
"../../../Engine/Content/MobileResources/HUD/LeftVirtualJoystickOnly.uasset" 233
"../../../Engine/Content/MobileResources/HUD/MobileHUDButton1_off.uasset" 234
"../../../Engine/Content/MobileResources/HUD/MobileHUDButton1_on.uasset" 235
"../../../Engine/Content/MobileResources/HUD/MobileHUDButton2_off.uasset" 236
"../../../Engine/Content/MobileResources/HUD/MobileHUDButton2_on.uasset" 237
"../../../Engine/Content/MobileResources/HUD/MobileHUDButton3.uasset" 238
"../../../Engine/Content/MobileResources/HUD/MobileHUDButtonFire.uasset" 239
"../../../Engine/Content/MobileResources/HUD/MobileHUDDirectionPad.uasset" 240
"../../../Engine/Content/MobileResources/HUD/MobileHUDDirectionPad2.uasset" 241
"../../../Engine/Content/MobileResources/HUD/MobileHUDDirectionPad3.uasset" 242
"../../../Engine/Content/MobileResources/HUD/MobileHUDDirectionStick.uasset" 243
"../../../Engine/Content/MobileResources/HUD/T_Castle_ThumbstickInner.uasset" 244
"../../../Engine/Content/MobileResources/HUD/T_Castle_ThumbstickOutter.uasset" 245
"../../../Engine/Content/Tutorial/ContentIntroCurve.uasset" 246
"../../../Engine/Content/Tutorial/Basics/LevelEditorAttract.uasset" 247
"../../../Engine/Content/VREditor/LaserPointer/VR_LaserPower_01.uasset" 248
"../../../Engine/Content/VREditor/TransformGizmo/TransformGizmoMaterial.uasset" 249
"../../../Engine/Content/VREditor/TransformGizmo/TranslucentTransformGizmoMaterial.uasset" 250
"../../../Engine/Content/VREditor/TransformGizmo/BoundingBoxCorner.uasset" 251
"../../../Engine/Content/VREditor/TransformGizmo/BoundingBoxEdge.uasset" 252
"../../../Engine/Content/VREditor/TransformGizmo/PlaneTranslationHandle.uasset" 253
"../../../Engine/Content/VREditor/TransformGizmo/Main.uasset" 254
"../../../Engine/Content/VREditor/TransformGizmo/Xray.uasset" 255
"../../../Engine/Content/VREditor/TransformGizmo/SM_Sequencer_Key.uasset" 256
"../../../Engine/Content/VREditor/TransformGizmo/SM_Sequencer_Node.uasset" 257
"../../Plugins/2D/Paper2D/Content/PlaceholderTextures/DummySpriteTexture.uasset" 258
"../../Plugins/2D/Paper2D/Content/DummySprite.uasset" 259
"../../Plugins/2D/Paper2D/Content/DefaultPaperTerrainMaterial.uasset" 260
"../../Plugins/2D/Paper2D/Content/DummySpriteTexture.uasset" 261
"../../Plugins/2D/Paper2D/Content/DefaultSpriteMaterial.uasset" 262
"../../Plugins/2D/Paper2D/Content/MaskedUnlitSpriteMaterial.uasset" 263
"../../Plugins/2D/Paper2D/Content/OpaqueUnlitSpriteMaterial.uasset" 264
"../../Plugins/Runtime/Oculus/OculusVR/Content/OculusMR_RenderTarget.uasset" 265
"../../../Engine/Content/Functions/Engine_MaterialFunctions02/Utility/BreakOutFloat4Components.uasset" 266
"../../../Engine/Content/Functions/Engine_MaterialFunctions02/Utility/MakeFloat2.uasset" 267
"../../../Engine/Content/Functions/Engine_MaterialFunctions02/Utility/MakeFloat3.uasset" 268
"../../Plugins/Runtime/Oculus/OculusVR/Content/Materials/OculusMR_ChromaKey.uasset" 269
"../../Plugins/Runtime/Oculus/OculusVR/Content/Materials/OculusMR_ChromaKey_Lit.uasset" 270
"../../Plugins/Runtime/Oculus/OculusVR/Content/Materials/OculusMR_OpaqueColoredMaterial.uasset" 271
"../../Plugins/Runtime/Oculus/OculusVR/Content/Materials/OculusMR_WhiteMaterial.uasset" 272
"../../Plugins/Runtime/Oculus/OculusVR/Content/Materials/PokeAHoleMaterial.uasset" 273
"../../Plugins/Runtime/Oculus/OculusVR/Content/Textures/GearVRController_AO.uasset" 274
"../../Plugins/Runtime/Oculus/OculusVR/Content/Textures/GearVRController_Color.uasset" 275
"../../Plugins/Runtime/Oculus/OculusVR/Content/Textures/GearVRController_Normal.uasset" 276
"../../Plugins/Runtime/Oculus/OculusVR/Content/Materials/GearVRControllerMaterial.uasset" 277
"../../Plugins/Runtime/Oculus/OculusVR/Content/Meshes/GearVrController.uasset" 278
"../../Plugins/Runtime/Oculus/OculusVR/Content/Textures/touchController_albedo.uasset" 279
"../../Plugins/Runtime/Oculus/OculusVR/Content/Textures/touchController_controlmap.uasset" 280
"../../Plugins/Runtime/Oculus/OculusVR/Content/Materials/touchController_mat.uasset" 281
"../../Plugins/Runtime/Oculus/OculusVR/Content/Meshes/LeftTouchController.uasset" 282
"../../Plugins/Runtime/Oculus/OculusVR/Content/Meshes/RiftHMD.uasset" 283
"../../Plugins/Runtime/Oculus/OculusVR/Content/Meshes/RightTouchController.uasset" 284
"../../../../../Git Projects/SnakeGame/Content/StarterContent/Blueprints/Assets/FogBrightnessLUT.uasset" 285
"../../../../../Git Projects/SnakeGame/Content/StarterContent/Blueprints/Assets/SunlightColorLUT.uasset" 286
"../../../../../Git Projects/SnakeGame/Content/StarterContent/Blueprints/Assets/M_LightStage_Arrows.uasset" 287
"../../../Engine/Content/MapTemplates/Sky/DaylightAmbientCubemap.uasset" 288
"../../../../../Git Projects/SnakeGame/Content/StarterContent/Blueprints/Assets/M_LightStage_Skybox_Master.uasset" 289
"../../../../../Git Projects/SnakeGame/Content/StarterContent/Blueprints/Assets/M_LightStage_Skybox_Black.uasset" 290
"../../../../../Git Projects/SnakeGame/Content/StarterContent/Blueprints/Assets/M_LightStage_Skybox_HDRI.uasset" 291
"../../../Engine/Content/EditorMaterials/Thumbnails/SkySphereMaterial.uasset" 292
"../../../../../Git Projects/SnakeGame/Content/StarterContent/Blueprints/Assets/Skybox.uasset" 293
"../../../../../Git Projects/SnakeGame/Content/StarterContent/Blueprints/Assets/SM_Arrows.uasset" 294
"../../../../../Git Projects/SnakeGame/Content/StarterContent/HDRI/HDRI_Epic_Courtyard_Daylight.uasset" 295
"../../../../../Git Projects/SnakeGame/Content/StarterContent/Blueprints/BP_LightStudio.uasset" 296
"../../../../../Git Projects/SnakeGame/Content/StarterContent/Maps/Advanced_Lighting_BuiltData.uasset" 297
"../../../../../Git Projects/SnakeGame/Content/StarterContent/Materials/M_AssetPlatform.uasset" 298
"../../../Engine/Content/EditorMeshes/ColorCalibrator/M_ChromeBall.uasset" 299
"../../../Engine/Content/EditorMeshes/ColorCalibrator/M_ClearCoat.uasset" 300
"../../../Engine/Content/EditorMeshes/ColorCalibrator/M_ClearCoatBlack.uasset" 301
"../../../Engine/Content/EditorMeshes/ColorCalibrator/Color_checker.uasset" 302
"../../../Engine/Content/EditorMeshes/ColorCalibrator/M_ColorGrid.uasset" 303
"../../../Engine/Content/EditorMeshes/ColorCalibrator/M_GreyBall.uasset" 304
"../../../Engine/Content/EditorMeshes/ColorCalibrator/SM_ColorCalibrator.uasset" 305
"../../../../../Git Projects/SnakeGame/Content/StarterContent/Architecture/SM_AssetPlatform.uasset" 306
"../../../../../Git Projects/SnakeGame/Content/StarterContent/Maps/Advanced_Lighting.umap" 307
"../../../Engine/Content/EditorBlueprintResources/StandardMacros.uasset" 308
"../../../Engine/Content/EngineSky/C_Sky_Cloud_Color.uasset" 309
"../../../Engine/Content/EngineSky/C_Sky_Horizon_Color.uasset" 310
"../../../Engine/Content/EngineSky/C_Sky_Zenith_Color.uasset" 311
"../../../Engine/Content/EngineSky/T_Sky_Blue.uasset" 312
"../../../Engine/Content/EngineSky/T_Sky_Clouds_M.uasset" 313
"../../../Engine/Content/EngineSky/T_Sky_Stars.uasset" 314
"../../../Engine/Content/EngineSky/M_Sky_Panning_Clouds2.uasset" 315
"../../../Engine/Content/EngineSky/SM_SkySphere.uasset" 316
"../../../Engine/Content/EngineSky/BP_Sky_Sphere.uasset" 317
"../../../../../Git Projects/SnakeGame/Content/StarterContent/Textures/T_MacroVariation.uasset" 318
"../../../../../Git Projects/SnakeGame/Content/StarterContent/Textures/T_Metal_Copper_D.uasset" 319
"../../../../../Git Projects/SnakeGame/Content/StarterContent/Textures/T_Metal_Gold_N.uasset" 320
"../../../../../Git Projects/SnakeGame/Content/StarterContent/Materials/M_Metal_Copper.uasset" 321
"../../../../../Git Projects/SnakeGame/Content/WallBP.uasset" 322
"../../../../../Git Projects/SnakeGame/Content/StarterContent/Maps/Main_BuiltData.uasset" 323
"../../../../../Git Projects/SnakeGame/Content/StarterContent/Architecture/Floor_400x400.uasset" 324
"../../../../../Git Projects/SnakeGame/Content/StarterContent/Audio/Starter_Background_Cue.uasset" 325
"../../../../../Git Projects/SnakeGame/Content/UI/WBP_HUD.uasset" 326
"../../../../../Git Projects/SnakeGame/Content/StarterContent/Maps/Main.umap" 327
"../../../../../Git Projects/SnakeGame/Content/Textures/background.uasset" 328
"../../../../../Git Projects/SnakeGame/Content/Textures/play.uasset" 329
"../../../../../Git Projects/SnakeGame/Content/Textures/Quit.uasset" 330
"../../../../../Git Projects/SnakeGame/Content/Textures/Snake_Logo.uasset" 331
"../../../../../Git Projects/SnakeGame/Content/UI/WBP_Menu.uasset" 332
"../../../../../Git Projects/SnakeGame/Content/StarterContent/Maps/Menu.umap" 333
"../../../../../Git Projects/SnakeGame/Content/StarterContent/Audio/Fire01_Cue.uasset" 334
"../../../../../Git Projects/SnakeGame/Content/StarterContent/Textures/T_Fire_SubUV.uasset" 335
"../../../../../Git Projects/SnakeGame/Content/StarterContent/Textures/T_Fire_Tiled_D.uasset" 336
"../../../../../Git Projects/SnakeGame/Content/StarterContent/Particles/Materials/M_Fire_SubUV.uasset" 337
"../../../../../Git Projects/SnakeGame/Content/StarterContent/Textures/T_Water_N.uasset" 338
"../../../../../Git Projects/SnakeGame/Content/StarterContent/Particles/Materials/M_Heat_Distortion.uasset" 339
"../../../../../Git Projects/SnakeGame/Content/StarterContent/Particles/Materials/M_Radial_Gradient.uasset" 340
"../../../../../Git Projects/SnakeGame/Content/StarterContent/Particles/P_Fire.uasset" 341
"../../../../../Git Projects/SnakeGame/Content/StarterContent/Blueprints/Blueprint_Effect_Fire.uasset" 342
"../../../../../Git Projects/SnakeGame/Content/StarterContent/Audio/Smoke01_Cue.uasset" 343
"../../../../../Git Projects/SnakeGame/Content/StarterContent/Particles/P_Smoke.uasset" 344
"../../../../../Git Projects/SnakeGame/Content/StarterContent/Blueprints/Blueprint_Effect_Smoke.uasset" 345
"../../../../../Git Projects/SnakeGame/Content/StarterContent/Audio/Fire_Sparks01_Cue.uasset" 346
"../../../../../Git Projects/SnakeGame/Content/StarterContent/Textures/T_Spark_Core.uasset" 347
"../../../../../Git Projects/SnakeGame/Content/StarterContent/Particles/Materials/M_Spark.uasset" 348
"../../../../../Git Projects/SnakeGame/Content/StarterContent/Particles/P_Sparks.uasset" 349
"../../../../../Git Projects/SnakeGame/Content/StarterContent/Blueprints/Blueprint_Effect_Sparks.uasset" 350
"../../../../../Git Projects/SnakeGame/Content/StarterContent/Audio/Steam01_Cue.uasset" 351
"../../../../../Git Projects/SnakeGame/Content/StarterContent/Particles/P_Steam_Lit.uasset" 352
"../../../../../Git Projects/SnakeGame/Content/StarterContent/Blueprints/Blueprint_Effect_Steam.uasset" 353
"../../../../../Git Projects/SnakeGame/Content/StarterContent/Textures/T_Lamp_M.uasset" 354
"../../../../../Git Projects/SnakeGame/Content/StarterContent/Textures/T_Lamp_N.uasset" 355
"../../../../../Git Projects/SnakeGame/Content/StarterContent/Props/Materials/M_Lamp.uasset" 356
"../../../../../Git Projects/SnakeGame/Content/StarterContent/Props/SM_Lamp_Ceiling.uasset" 357
"../../../../../Git Projects/SnakeGame/Content/StarterContent/Blueprints/Blueprint_CeilingLight.uasset" 358
"../../../../../Git Projects/SnakeGame/Content/StarterContent/Props/SM_Lamp_Wall.uasset" 359
"../../../../../Git Projects/SnakeGame/Content/StarterContent/Blueprints/Blueprint_WallSconce.uasset" 360
"../../../../../Git Projects/SnakeGame/Content/StarterContent/Maps/StarterMap_BuiltData.uasset" 361
"../../../Engine/Content/Functions/Engine_MaterialFunctions03/Procedurals/ComputeFilterWidth.uasset" 362
"../../../Engine/Content/EngineMaterials/AntiAliasedTextMaterialTranslucent.uasset" 363
"../../../../../Git Projects/SnakeGame/Content/StarterContent/Textures/T_Brick_Clay_Beveled_D.uasset" 364
"../../../../../Git Projects/SnakeGame/Content/StarterContent/Textures/T_Brick_Clay_Beveled_M.uasset" 365
"../../../../../Git Projects/SnakeGame/Content/StarterContent/Textures/T_Brick_Clay_Beveled_N.uasset" 366
"../../../../../Git Projects/SnakeGame/Content/StarterContent/Materials/M_Brick_Clay_Beveled.uasset" 367
"../../../../../Git Projects/SnakeGame/Content/StarterContent/Textures/T_Brick_Clay_New_D.uasset" 368
"../../../../../Git Projects/SnakeGame/Content/StarterContent/Textures/T_Brick_Clay_New_M.uasset" 369
"../../../../../Git Projects/SnakeGame/Content/StarterContent/Textures/T_Brick_Clay_New_N.uasset" 370
"../../../../../Git Projects/SnakeGame/Content/StarterContent/Materials/M_Brick_Clay_New.uasset" 371
"../../../../../Git Projects/SnakeGame/Content/StarterContent/Textures/T_Brick_Clay_Old_D.uasset" 372
"../../../../../Git Projects/SnakeGame/Content/StarterContent/Textures/T_Brick_Clay_Old_N.uasset" 373
"../../../../../Git Projects/SnakeGame/Content/StarterContent/Textures/T_Perlin_Noise_M.uasset" 374
"../../../../../Git Projects/SnakeGame/Content/StarterContent/Materials/M_Brick_Clay_Old.uasset" 375
"../../../../../Git Projects/SnakeGame/Content/StarterContent/Textures/T_Brick_Cut_Stone_D.uasset" 376
"../../../../../Git Projects/SnakeGame/Content/StarterContent/Textures/T_Brick_Cut_Stone_N.uasset" 377
"../../../../../Git Projects/SnakeGame/Content/StarterContent/Materials/M_Brick_Cut_Stone.uasset" 378
"../../../../../Git Projects/SnakeGame/Content/StarterContent/Textures/T_Brick_Hewn_Stone_D.uasset" 379
"../../../../../Git Projects/SnakeGame/Content/StarterContent/Textures/T_Brick_Hewn_Stone_M.uasset" 380
"../../../../../Git Projects/SnakeGame/Content/StarterContent/Textures/T_Brick_Hewn_Stone_N.uasset" 381
"../../../../../Git Projects/SnakeGame/Content/StarterContent/Materials/M_Brick_Hewn_Stone.uasset" 382
"../../../../../Git Projects/SnakeGame/Content/StarterContent/Textures/T_Ceramic_Tile_M.uasset" 383
"../../../../../Git Projects/SnakeGame/Content/StarterContent/Textures/T_Ceramic_Tile_N.uasset" 384
"../../../../../Git Projects/SnakeGame/Content/StarterContent/Textures/T_Rock_Marble_Polished_D.uasset" 385
"../../../../../Git Projects/SnakeGame/Content/StarterContent/Materials/M_Ceramic_Tile_Checker.uasset" 386
"../../../../../Git Projects/SnakeGame/Content/StarterContent/Textures/T_CobbleStone_Pebble_D.uasset" 387
"../../../../../Git Projects/SnakeGame/Content/StarterContent/Textures/T_CobbleStone_Pebble_M.uasset" 388
"../../../../../Git Projects/SnakeGame/Content/StarterContent/Textures/T_CobbleStone_Pebble_N.uasset" 389
"../../../../../Git Projects/SnakeGame/Content/StarterContent/Materials/M_CobbleStone_Pebble.uasset" 390
"../../../../../Git Projects/SnakeGame/Content/StarterContent/Textures/T_CobbleStone_Smooth_D.uasset" 391
"../../../../../Git Projects/SnakeGame/Content/StarterContent/Textures/T_CobbleStone_Smooth_M.uasset" 392
"../../../../../Git Projects/SnakeGame/Content/StarterContent/Textures/T_CobbleStone_Smooth_N.uasset" 393
"../../../../../Git Projects/SnakeGame/Content/StarterContent/Materials/M_CobbleStone_Smooth.uasset" 394
"../../../../../Git Projects/SnakeGame/Content/StarterContent/Textures/T_Concrete_Grime_D.uasset" 395
"../../../../../Git Projects/SnakeGame/Content/StarterContent/Textures/T_Metal_Rust_N.uasset" 396
"../../../../../Git Projects/SnakeGame/Content/StarterContent/Materials/M_Concrete_Grime.uasset" 397
"../../../../../Git Projects/SnakeGame/Content/StarterContent/Textures/T_Concrete_Panels_D.uasset" 398
"../../../../../Git Projects/SnakeGame/Content/StarterContent/Textures/T_Concrete_Panels_N.uasset" 399
"../../../../../Git Projects/SnakeGame/Content/StarterContent/Materials/M_Concrete_Panels.uasset" 400
"../../../../../Git Projects/SnakeGame/Content/StarterContent/Textures/T_Concrete_Poured_D.uasset" 401
"../../../../../Git Projects/SnakeGame/Content/StarterContent/Textures/T_Concrete_Poured_N.uasset" 402
"../../../../../Git Projects/SnakeGame/Content/StarterContent/Materials/M_Concrete_Poured.uasset" 403
"../../../../../Git Projects/SnakeGame/Content/StarterContent/Textures/T_Concrete_Tiles_D.uasset" 404
"../../../../../Git Projects/SnakeGame/Content/StarterContent/Textures/T_Concrete_Tiles_M.uasset" 405
"../../../../../Git Projects/SnakeGame/Content/StarterContent/Textures/T_Concrete_Tiles_N.uasset" 406
"../../../../../Git Projects/SnakeGame/Content/StarterContent/Textures/T_Concrete_Tiles_Variation_M.uasset" 407
"../../../../../Git Projects/SnakeGame/Content/StarterContent/Materials/M_Concrete_Tiles.uasset" 408
"../../../../../Git Projects/SnakeGame/Content/StarterContent/Textures/T_Ground_Grass_D.uasset" 409
"../../../../../Git Projects/SnakeGame/Content/StarterContent/Textures/T_Ground_Grass_N.uasset" 410
"../../../../../Git Projects/SnakeGame/Content/StarterContent/Materials/M_Ground_Grass.uasset" 411
"../../../../../Git Projects/SnakeGame/Content/StarterContent/Textures/T_Ground_Gravel_D.uasset" 412
"../../../../../Git Projects/SnakeGame/Content/StarterContent/Textures/T_Ground_Gravel_N.uasset" 413
"../../../../../Git Projects/SnakeGame/Content/StarterContent/Materials/M_Ground_Gravel.uasset" 414
"../../../../../Git Projects/SnakeGame/Content/StarterContent/Textures/T_ground_Moss_D.uasset" 415
"../../../../../Git Projects/SnakeGame/Content/StarterContent/Textures/T_Ground_Moss_N.uasset" 416
"../../../../../Git Projects/SnakeGame/Content/StarterContent/Materials/M_Ground_Moss.uasset" 417
"../../../../../Git Projects/SnakeGame/Content/StarterContent/Materials/M_Metal_Brushed_Nickel.uasset" 418
"../../../../../Git Projects/SnakeGame/Content/StarterContent/Textures/T_Metal_Aluminum_D.uasset" 419
"../../../../../Git Projects/SnakeGame/Content/StarterContent/Materials/M_Metal_Burnished_Steel.uasset" 420
"../../../../../Git Projects/SnakeGame/Content/StarterContent/Materials/M_Metal_Chrome.uasset" 421
"../../../../../Git Projects/SnakeGame/Content/StarterContent/Textures/T_Metal_Gold_D.uasset" 422
"../../../../../Git Projects/SnakeGame/Content/StarterContent/Materials/M_Metal_Gold.uasset" 423
"../../../../../Git Projects/SnakeGame/Content/StarterContent/Textures/T_Metal_Rust_D.uasset" 424
"../../../../../Git Projects/SnakeGame/Content/StarterContent/Materials/M_Metal_Rust.uasset" 425
"../../../../../Git Projects/SnakeGame/Content/StarterContent/Textures/T_Metal_Steel_D.uasset" 426
"../../../../../Git Projects/SnakeGame/Content/StarterContent/Textures/T_Metal_Steel_N.uasset" 427
"../../../../../Git Projects/SnakeGame/Content/StarterContent/Materials/M_Metal_Steel.uasset" 428
"../../../../../Git Projects/SnakeGame/Content/StarterContent/Textures/T_Rock_Basalt_N.uasset" 429
"../../../../../Git Projects/SnakeGame/Content/StarterContent/Materials/M_Rock_Basalt.uasset" 430
"../../../../../Git Projects/SnakeGame/Content/StarterContent/Materials/M_Rock_Marble_Polished.uasset" 431
"../../../../../Git Projects/SnakeGame/Content/StarterContent/Textures/T_Rock_Sandstone_D.uasset" 432
"../../../../../Git Projects/SnakeGame/Content/StarterContent/Textures/T_Rock_Sandstone_N.uasset" 433
"../../../../../Git Projects/SnakeGame/Content/StarterContent/Materials/M_Rock_Sandstone.uasset" 434
"../../../../../Git Projects/SnakeGame/Content/StarterContent/Textures/T_Rock_Slate_D.uasset" 435
"../../../../../Git Projects/SnakeGame/Content/StarterContent/Textures/T_Rock_Slate_N.uasset" 436
"../../../../../Git Projects/SnakeGame/Content/StarterContent/Materials/M_Rock_Slate.uasset" 437
"../../../../../Git Projects/SnakeGame/Content/StarterContent/Textures/T_Checker_Noise_M.uasset" 438
"../../../../../Git Projects/SnakeGame/Content/StarterContent/Textures/T_Single_Tile_N.uasset" 439
"../../../../../Git Projects/SnakeGame/Content/StarterContent/Textures/T_Tech_Dot_M.uasset" 440
"../../../../../Git Projects/SnakeGame/Content/StarterContent/Textures/T_Tech_Dot_N.uasset" 441
"../../../../../Git Projects/SnakeGame/Content/StarterContent/Materials/M_Tech_Checker_Dot.uasset" 442
"../../../../../Git Projects/SnakeGame/Content/StarterContent/Textures/T_Tech_Hex_Tile_M.uasset" 443
"../../../../../Git Projects/SnakeGame/Content/StarterContent/Textures/T_Tech_Hex_Tile_N.uasset" 444
"../../../../../Git Projects/SnakeGame/Content/StarterContent/Materials/M_Tech_Hex_Tile.uasset" 445
"../../../../../Git Projects/SnakeGame/Content/StarterContent/Materials/M_Tech_Hex_Tile_Pulse.uasset" 446
"../../../../../Git Projects/SnakeGame/Content/StarterContent/Textures/T_Tech_Panel_M.uasset" 447
"../../../../../Git Projects/SnakeGame/Content/StarterContent/Textures/T_Tech_Panel_N.uasset" 448
"../../../../../Git Projects/SnakeGame/Content/StarterContent/Materials/M_Tech_Panel.uasset" 449
"../../../../../Git Projects/SnakeGame/Content/StarterContent/Materials/M_Water_Lake.uasset" 450
"../../../../../Git Projects/SnakeGame/Content/StarterContent/Textures/T_Water_M.uasset" 451
"../../../../../Git Projects/SnakeGame/Content/StarterContent/Materials/M_Water_Ocean.uasset" 452
"../../../../../Git Projects/SnakeGame/Content/StarterContent/Textures/T_Wood_Floor_Walnut_D.uasset" 453
"../../../../../Git Projects/SnakeGame/Content/StarterContent/Textures/T_Wood_Floor_Walnut_M.uasset" 454
"../../../../../Git Projects/SnakeGame/Content/StarterContent/Textures/T_Wood_Floor_Walnut_N.uasset" 455
"../../../../../Git Projects/SnakeGame/Content/StarterContent/Materials/M_Wood_Floor_Walnut_Polished.uasset" 456
"../../../Engine/Content/Functions/Engine_MaterialFunctions01/Opacity/AlphaOffset.uasset" 457
"../../../../../Git Projects/SnakeGame/Content/StarterContent/Materials/M_Wood_Floor_Walnut_Worn.uasset" 458
"../../../../../Git Projects/SnakeGame/Content/StarterContent/Textures/T_Wood_Oak_D.uasset" 459
"../../../../../Git Projects/SnakeGame/Content/StarterContent/Textures/T_Wood_Oak_N.uasset" 460
"../../../../../Git Projects/SnakeGame/Content/StarterContent/Materials/M_Wood_Oak.uasset" 461
"../../../../../Git Projects/SnakeGame/Content/StarterContent/Textures/T_Wood_Pine_D.uasset" 462
"../../../../../Git Projects/SnakeGame/Content/StarterContent/Textures/T_Wood_Pine_N.uasset" 463
"../../../../../Git Projects/SnakeGame/Content/StarterContent/Materials/M_Wood_Pine.uasset" 464
"../../../../../Git Projects/SnakeGame/Content/StarterContent/Textures/T_Wood_Walnut_D.uasset" 465
"../../../../../Git Projects/SnakeGame/Content/StarterContent/Textures/T_Wood_Walnut_N.uasset" 466
"../../../../../Git Projects/SnakeGame/Content/StarterContent/Materials/M_Wood_Walnut.uasset" 467
"../../../../../Git Projects/SnakeGame/Content/StarterContent/Architecture/Wall_400x200.uasset" 468
"../../../../../Git Projects/SnakeGame/Content/StarterContent/Architecture/Wall_Door_400x300.uasset" 469
"../../../../../Git Projects/SnakeGame/Content/StarterContent/Architecture/Wall_Window_400x300.uasset" 470
"../../../../../Git Projects/SnakeGame/Content/StarterContent/Audio/Collapse_Cue.uasset" 471
"../../../../../Git Projects/SnakeGame/Content/StarterContent/Audio/Starter_Music_Cue.uasset" 472
"../../../../../Git Projects/SnakeGame/Content/StarterContent/Textures/T_Dust_Particle_D.uasset" 473
"../../../../../Git Projects/SnakeGame/Content/StarterContent/Particles/Materials/M_Dust_Particle.uasset" 474
"../../../../../Git Projects/SnakeGame/Content/StarterContent/Particles/P_Ambient_Dust.uasset" 475
"../../../../../Git Projects/SnakeGame/Content/StarterContent/Props/MaterialSphere.uasset" 476
"../../../../../Git Projects/SnakeGame/Content/StarterContent/Props/SM_Chair.uasset" 477
"../../../../../Git Projects/SnakeGame/Content/StarterContent/Textures/T_Frame_M.uasset" 478
"../../../../../Git Projects/SnakeGame/Content/StarterContent/Textures/T_Frame_N.uasset" 479
"../../../../../Git Projects/SnakeGame/Content/StarterContent/Props/Materials/M_Frame.uasset" 480
"../../../../../Git Projects/SnakeGame/Content/StarterContent/Props/SM_CornerFrame.uasset" 481
"../../../../../Git Projects/SnakeGame/Content/StarterContent/Props/SM_DoorFrame.uasset" 482
"../../../../../Git Projects/SnakeGame/Content/StarterContent/Props/SM_GlassWindow.uasset" 483
"../../../../../Git Projects/SnakeGame/Content/StarterContent/Props/SM_PillarFrame.uasset" 484
"../../../../../Git Projects/SnakeGame/Content/StarterContent/Props/SM_PillarFrame300.uasset" 485
"../../../../../Git Projects/SnakeGame/Content/StarterContent/Textures/T_Statue_M.uasset" 486
"../../../../../Git Projects/SnakeGame/Content/StarterContent/Textures/T_Statue_N.uasset" 487
"../../../../../Git Projects/SnakeGame/Content/StarterContent/Props/Materials/M_Statue.uasset" 488
"../../../../../Git Projects/SnakeGame/Content/StarterContent/Props/Materials/M_StatueGlass.uasset" 489
"../../../../../Git Projects/SnakeGame/Content/StarterContent/Props/SM_Statue.uasset" 490
"../../../../../Git Projects/SnakeGame/Content/StarterContent/Textures/T_TableRound_M.uasset" 491
"../../../../../Git Projects/SnakeGame/Content/StarterContent/Textures/T_TableRound_N.uasset" 492
"../../../../../Git Projects/SnakeGame/Content/StarterContent/Props/Materials/M_TableRound.uasset" 493
"../../../../../Git Projects/SnakeGame/Content/StarterContent/Props/SM_TableRound.uasset" 494
"../../../../../Git Projects/SnakeGame/Content/StarterContent/Props/SM_WindowFrame.uasset" 495
"../../../../../Git Projects/SnakeGame/Content/StarterContent/Shapes/Shape_Cube.uasset" 496
"../../../../../Git Projects/SnakeGame/Content/StarterContent/Shapes/Shape_QuadPyramid.uasset" 497
"../../../../../Git Projects/SnakeGame/Content/StarterContent/Shapes/Shape_Sphere.uasset" 498
"../../../../../Git Projects/SnakeGame/Content/StarterContent/Maps/StarterMap.umap" 499
"../../../Engine/Content/Maps/Entry_BuiltData.uasset" 500
"../../../Engine/Content/Maps/Entry.umap" 501
