^D:\GIT PROJECTS\HOMEWORK_19\HOMEWORK_19\DEBUG\HOMEWORK_19.OBJ
D:\GIT PROJECTS\HOMEWORK_19\DEBUG\HOMEWORK_19.EXE
D:\GIT PROJECTS\HOMEWORK_19\HOMEWORK_19\DEBUG\HOMEWORK_19.ILK
D:\GIT PROJECTS\HOMEWORK_19\DEBUG\HOMEWORK_19.PDB
