^D:\GIT PROJECTS\HOMEWORK_19\HOMEWORK_19\HOMEWORK_19.CPP
D:\GIT PROJECTS\HOMEWORK_19\HOMEWORK_19\DEBUG\VC142.PDB
D:\GIT PROJECTS\HOMEWORK_19\HOMEWORK_19\DEBUG\VC142.IDB
D:\GIT PROJECTS\HOMEWORK_19\HOMEWORK_19\DEBUG\HOMEWORK_19.OBJ
