<?xml version="1.0" encoding="utf-8"?>
<!-- Generator: Adobe Illustrator 24.0.1, SVG Export Plug-In . SVG Version: 6.00 Build 0)  -->
<svg version="1.1" id="Слой_1" xmlns="http://www.w3.org/2000/svg" xmlns:xlink="http://www.w3.org/1999/xlink" x="0px" y="0px"
	 viewBox="0 0 384 383.2" style="enable-background:new 0 0 384 383.2;" xml:space="preserve">
<style type="text/css">
	.st0{fill:#32B3FE;}
	.st1{fill:#FFFFFF;}
</style>
<title>telegram_icon</title>
<g>
	<path class="st0" d="M284.8,383.6H99.2C44.4,383.6,0,339.2,0,284.4V98.8C0,44,44.4-0.4,99.2-0.4h185.6C339.6-0.4,384,44,384,98.8
		v185.6C384,339.2,339.6,383.6,284.8,383.6z"/>
	<g>
		<path class="st0" d="M298.5,383.2c5.5-1.3,11.1-2.1,16.4-3.8c37-12,59.7-37,67.6-75.2c0.4-1.9,1-3.7,1.5-5.5V104l0-18.7
			c-1-4.4-1.9-8.8-3-13.2c-9.1-36.9-41.9-66.4-78.8-70.9c0.1,0.1,0.2,0.1,0.2,0.2c-0.1-0.1-0.2-0.1-0.2-0.2C298.2,0.8,294.1,0,290,0
			C225.2,0,160.3,0,95.5,0C56.6,0,21.2,23.8,7,59.9c-3,7.5-4.2,15.8-6.2,23.7c-0.2,0.8-0.5,1.6-0.7,2.5v211.8
			c0.8,3.8,1.6,7.7,2.6,11.5c9.3,38.6,40.3,66.9,80.3,73c0.9,0.2,1.8,0.5,2.7,0.9L298.5,383.2z"/>
		<g>
			<path class="st1" d="M292.4,108.6c-7.2-8.2-14-9.8-24.3-5.6c-4.4,1.8-8.7,3.6-13.1,5.4v0c-0.7,0.3-1.4,0.7-2,0.9L59.7,188.9
				c-6.7,2.8-9.8,7.1-9.4,12.8s4.1,9.4,11.2,11.2c13.4,3.4,26.9,6.6,40.3,10.1c12.4,3.3,23.5,1.2,34.2-5.8
				c30.4-20.1,61-39.8,91.6-59.7c0.9-0.6,1.9-1.6,2.9-1.7c1.3-0.1,2.5,0.3,3.5,1.1c0.6,0.6,0.4,2.4-0.1,3.3
				c-0.8,1.1-1.7,2.1-2.8,2.9l-69.2,65.2c-7.3,6.9-6.8,14.7,1.4,20.7c10.4,7.7,20.8,15.4,31.2,23.2c0,0,0,0,0,0
				c0.9,0.6,1.9,1.2,2.8,1.8c14.1,10.4,28.1,20.8,42.2,31c12,8.7,26.8,2.5,29.2-12c0.8-4.5,1.5-9.1,2.1-13.7
				c4.6-29.3,9.1-58.6,13.7-87.9c0,0,0,0,0,0c3.1-20.2,6.2-40.3,9.2-60.5C294.8,123.5,297.1,115.9,292.4,108.6"/>
		</g>
	</g>
</g>
</svg>
