<?xml version="1.0" encoding="utf-8"?>
<!-- Generator: Adobe Illustrator 24.0.1, SVG Export Plug-In . SVG Version: 6.00 Build 0)  -->
<svg version="1.1" id="Слой_1" xmlns="http://www.w3.org/2000/svg" xmlns:xlink="http://www.w3.org/1999/xlink" x="0px" y="0px"
	 viewBox="0 0 57.5 97" style="enable-background:new 0 0 57.5 97;" xml:space="preserve">
<style type="text/css">
	.st0{fill-rule:evenodd;clip-rule:evenodd;fill:#18CFAB;}
</style>
<path class="st0" d="M15.2,35l0-15.8c0-1.8,0.7-3.5,1.9-4.8c1.4-1.4,3.4-2.2,5.5-2.2c1.6,0,3.2,0.5,4.4,1.4c1.5,1.1,2.4,2.8,2.6,4.7
	c0,0,0.8,8.3,1.6,15.7c5.3-3.2,8.9-9,8.9-15.7C40.2,8.1,32.2,0,22.2,0c-9.9,0-18,8.1-18,18.2C4.2,25.7,8.8,32.2,15.2,35z M16,94.8
	c0,1.2,1,2.2,2.1,2.2h31.7c1.2,0,2.1-1,2.1-2.2v-5H16V94.8z M54.2,51c2,0.6,3.3,2.5,3.3,4.6l0,17.3c0,2.6-0.7,5.1-2,7.3l-3.6,6.2
	h-36C5.9,76.2,0.9,65.2,0.1,60.5c-0.5-3.2,1.7-5.4,4.1-5.4c1.4,0,2.9,0.7,4,2.3C8.6,58,9,58.6,9.4,59.2c3.2,4.6,6.4,4.7,7.9,4.8
	l0.1,0h0c0,0,0.1,0,0.1,0h0c0.5-0.1,0.9-0.5,0.9-1l0-43.8c0-2.5,2.1-3.8,4.2-3.8c1.8,0,3.6,1,3.8,3.2c0,0,2.8,27.1,2.8,27.2v0h0
	c0.8-0.7,2-1.1,3.5-1.1c0.5,0,1.1,0.1,1.7,0.2C36.3,45.2,48.3,49.1,54.2,51z"/>
</svg>
