<?xml version="1.0" encoding="utf-8"?>
<!-- Generator: Adobe Illustrator 24.0.1, SVG Export Plug-In . SVG Version: 6.00 Build 0)  -->
<svg version="1.1" id="Слой_1" xmlns="http://www.w3.org/2000/svg" xmlns:xlink="http://www.w3.org/1999/xlink" x="0px" y="0px"
	 viewBox="0 0 493.57 216.35" style="enable-background:new 0 0 493.57 216.35;" xml:space="preserve">
<style type="text/css">
	.st0{fill:#4A2C47;}
	.st1{fill:#64486F;}
	.st2{fill:#45516B;}
	.st3{fill:#546B80;}
	.st4{fill:#795A86;}
	.st5{fill:#D28A0E;}
	.st6{fill:#6A485A;}
	.st7{fill:#86568A;}
	.st8{fill:#7A5D88;}
	.st9{fill:#384259;}
	.st10{fill:#59426B;}
	.st11{fill:#837E7F;}
	.st12{fill:#D69213;}
	.st13{fill:#746984;}
	.st14{fill:#946720;}
	.st15{fill:#685070;}
	.st16{fill:#744B79;}
	.st17{fill:#462E55;}
	.st18{fill:#BF9637;}
	.st19{fill:#55374E;}
	.st20{fill:#394C60;}
	.st21{fill:#6D7D9D;}
	.st22{fill:#5B2B5E;}
	.st23{fill:#BB8815;}
	.st24{fill:#573A50;}
	.st25{fill:#82581E;}
	.st26{fill:#A69DB1;}
	.st27{fill:#D5B10B;}
</style>
<g>
	<g>
		<path class="st0" d="M226.54,196.39c-0.72,1.2-1.44,2.41-2.16,3.61c-0.33,0-0.67,0-1,0c-0.54-2.49-1.55-4.99-1.54-7.48
			c0.07-13.73,0.29-27.46,0.67-41.18c0.1-3.43,0.98-6.83,1.5-10.24c0.45-0.02,0.89-0.03,1.34-0.05c0.12,1.56,0.23,3.11,0.29,3.94
			c7.05,0,13.4,0,19.75,0c1.16-0.17,2.32-0.33,3.48-0.5c0.06,0.26,0.12,0.52,0.18,0.79c-1.88,0.58-3.77,1.17-5.65,1.75
			c-4.69,0.05-9.43-0.25-14.04,0.4c-1.21,0.17-1.99,3.34-2.96,5.14c1.47,0.79,2.98,2.31,4.4,2.22c4.22-0.26,8.41-1.16,12.61-1.81
			c6.1,0,12.21,0,18.31,0c0,0.18,0.01,0.37,0.01,0.55c-7.43,0.84-14.86,1.68-22.29,2.52c-4.21,0.39-8.42,0.78-12.72,1.18
			c0,2.77,0,4.98,0,6.8c4.8,0,9.25,0,13.7,0c-0.03,0.32-0.05,0.63-0.07,0.95c-3.87,0.6-7.86,0.83-11.55,2
			c-1.19,0.38-1.6,3.21-2.37,4.92c1.4,0.62,2.85,1.84,4.2,1.74c3.24-0.22,6.44-1.06,9.65-1.64c-0.59,1.02-1.19,2.03-1.78,3.05
			c-3.9,0.42-7.79,0.85-11.77,1.28c0,3,0,5.54,0,7.53c2.24,0.54,4.01,0.96,5.78,1.38c0.05,0.31-0.06,0.56-0.33,0.73
			c-4.65-0.68-6.42,1.42-5.83,5.94C226.54,193.4,226.48,194.9,226.54,196.39z"/>
		<path class="st1" d="M225.35,141.05c-0.45,0.02-0.89,0.03-1.34,0.05c-3.15-0.23-6.3-0.45-9.45-0.69c-1.93-0.14-3.87-0.3-5.8-0.45
			c-3.3-0.2-6.6-0.32-9.89-0.6c-8.39-0.71-16.78-1.49-25.16-2.24c-5.23-1.42-10.46-2.85-15.7-4.27
			c-11.21-3.95-22.42-7.91-33.63-11.86c-0.62-0.34-1.24-0.68-1.85-1.01c-4.69-2.02-9.38-4.03-13.25-5.7
			c-6.34,7.58-12.4,15.28-18.98,22.51c-3.97,4.37-8.6,8.19-13.25,11.86c-1.53,1.2-4.05,1.15-6.12,1.67
			c2.44-7.22,4.89-14.44,7.33-21.66c-0.82-0.27-1.64-0.55-2.46-0.82c-5.36,2.41-10.7,4.89-16.11,7.18c-1,0.42-2.32,0.09-3.49,0.1
			c1.38-1.81,2.79-3.6,4.12-5.45c5.11-7.12,10.24-14.22,15.26-21.4c2.23-3.19,4.31-6.51,6.21-9.9c0.32-0.56-0.59-1.81-0.93-2.74
			c2.1,0.47,4.51,0.45,6.26,1.51c9.11,5.48,17.76,11.78,27.14,16.72c7.14,3.77,14.99,6.36,22.74,8.74
			c12.7,3.9,25.48,7.67,38.42,10.61c8.78,1.99,17.89,2.6,26.88,3.59c6.57,0.73,13.18,1.41,19.78,1.52
			c10.74,0.18,21.49-0.11,32.24-0.21c-2.97,0.96-5.95,1.92-8.92,2.88C238.72,141.01,232.03,141.03,225.35,141.05z"/>
		<path class="st2" d="M124.38,120.98c11.21,3.95,22.42,7.91,33.63,11.86c-3.84,13.73-7.68,27.46-11.53,41.19
			c-7.65-1.96-15.4-3.62-22.94-5.94c-11.52-3.54-11.2-3.65-7.72-15.17C119.01,142.37,121.55,131.63,124.38,120.98z M133.1,154.93
			c2.71-3.46,5.39-5.5,6.08-8.08c0.98-3.66-2.38-5.1-5.42-5.69c-2.5-0.48-6.62,3.85-5.89,6.71
			C128.43,150.03,130.65,151.75,133.1,154.93z"/>
		<path class="st3" d="M486.96,85.15c0.11,0.94,0.21,1.87,0.32,2.81c-2.24,1.19-4.47,2.39-6.71,3.58c-1.53-1.84-2.57-4.3-5.94-2.91
			c-0.98,0.41-3.02-0.47-3.94-1.4c-5.44-5.46-5.38-5.52-13.4-6.95c2.88,2.01,4.67,3.79,2.01,4.81c1.1,1.75,2.12,3.36,3.14,4.96
			c2.46,3,4.93,6.01,7.39,9.01c-3.29,2.34-6.58,4.68-9.88,7.02c-2.32-2.58-4.65-5.15-7.08-7.85c3.31-2.53,5.78-4.41,8.25-6.29
			c-0.21-0.36-0.42-0.72-0.63-1.08c-2.87,1.32-5.74,2.65-9.12,4.21c-1.16-2.14-2.2-4.06-3.31-6.13c3.15-1.68,5.76-3.07,8.36-4.45
			c-0.24-0.51-0.48-1.03-0.72-1.54c-2.81,1.3-5.61,2.6-7.29,3.38c-1.64-1.05-2.72-1.74-3.79-2.43c2.58-2.31,5.17-4.62,7.75-6.93
			c3.56-1.5,7.13-3.01,10.69-4.51c-0.2-0.52-0.41-1.04-0.61-1.56c-1.7,0.37-3.39,0.73-5.09,1.1c1.16-1.21,2.31-2.42,3.57-3.74
			c-0.43-0.93-0.96-2.06-1.49-3.19c3.02-1.7,6.03-3.41,9.05-5.11c4.65,6.47,9.29,12.96,13.98,19.42
			C483.9,81.35,485.46,83.23,486.96,85.15z"/>
		<path class="st4" d="M63.43,82.12c-3.87,2.41-7.66,4.95-11.62,7.2c-8.34,4.74-16.66,9.53-25.21,13.88
			c-2.92,1.48-6.47,3.16-9.74,0.12c1.35-1.41,2.91-2.68,4.02-4.27c4.98-7.12,9.8-14.37,14.76-21.51c3.17-4.57,6.5-9.03,9.76-13.54
			C51.41,70.04,57.42,76.08,63.43,82.12z M39.31,80.98c-0.18,2.86,0.35,5.58,3.74,4.81c1.67-0.38,3.72-2.56,4.12-4.27
			c0.62-2.63-0.88-4.57-4.16-4.65C39.85,76.8,38.92,78.27,39.31,80.98z"/>
		<path class="st5" d="M375.47,145.95c-4.12-2.8-8.24-5.6-12.57-8.55c-0.3,1.86-0.6,3.71-0.91,5.57c-1.87,1.68-3.74,3.35-5.62,5.02
			l0,0c0.35-3.78-2.12-5.53-5.01-7c1.38-2.09,2.97-4.07,4.07-6.3c0.68-1.38,0.63-3.12,0.91-4.7c1.63-1.37,3.26-2.74,4.89-4.11
			c0.92-0.18,1.83-0.35,2.75-0.53c-0.01-0.27-0.02-0.54-0.03-0.81c-0.84-0.19-1.68-0.39-2.52-0.58c-0.46-3.22,1.84-3.03,3.88-3.15
			c2.4-0.06,4.82,0.02,7.16-0.38c0.26-0.04,0.07-2.82,0.06-4.32c-0.01-1.62-0.06-3.25-0.09-4.87c0.62-0.11,1.23-0.22,1.85-0.33
			c1.16,0.31,2.33,0.62,3.49,0.94c4.99,7.61,8,15.9,8.64,25.02c-0.35,1.03-0.71,2.05-1.06,3.08c-1.68,1.35-3.35,2.69-5.03,4.04
			C378.72,144.65,377.09,145.3,375.47,145.95z M372.54,135.51c1.73-2.46,3.22-3.8,3.57-5.4c0.17-0.77-1.82-2.01-2.83-3.04
			c-1.28,1.27-2.97,2.35-3.66,3.89C369.32,131.64,371.02,133.23,372.54,135.51z"/>
		<path class="st6" d="M245.41,141c2.97-0.96,5.95-1.92,8.92-2.88c1.15-0.1,2.29-0.19,3.44-0.29c0.86-0.2,1.71-0.39,2.57-0.59
			c0.74,1.91,1.48,3.82,2.22,5.73c-1.4,0.32-2.8,0.64-4.2,0.97c-1.64,0-3.28,0-4.92,0c0.01,0.35,0.02,0.7,0.03,1.05
			c1.63,0,3.26,0,4.89,0c1.44-0.47,2.89-0.94,4.33-1.41c-0.09,8.47-0.18,16.94-0.26,25.41c-6.09,0.83-12.18,3.14-18.26-0.02
			c-1.1,0.74-2.21,1.47-3.31,2.21c-0.17-2.06-0.34-4.12-0.51-6.18c0.02-0.32,0.05-0.63,0.07-0.95c0.65-0.01,1.3-0.03,1.96-0.04
			c1.99-0.36,3.97-0.72,5.96-1.08c-0.04-0.31-0.09-0.62-0.13-0.93c-1.61,0-3.22,0-4.83,0c-1.31-1.98-2.63-3.96-3.94-5.94
			c7.43-0.84,14.86-1.68,22.29-2.52c0-0.18-0.01-0.37-0.01-0.55c-6.1,0-12.21,0-18.31,0c0-1.98,0-3.97,0-5.95
			c1.88-0.58,3.77-1.17,5.65-1.75c-0.06-0.26-0.12-0.52-0.18-0.79c-1.16,0.17-2.32,0.33-3.48,0.5
			C245.4,143.66,245.4,142.33,245.41,141z"/>
		<path class="st2" d="M459.45,65.07c0.53,1.13,1.06,2.26,1.49,3.19c-1.26,1.32-2.42,2.53-3.57,3.74c-1.66,0.99-3.33,1.98-4.99,2.97
			c-1.61,0.79-3.36,1.38-4.8,2.41c-1.88,1.34-3.54,2.81-5.38,0.11c-1.98-2.89,0.67-3.88,2.32-4.9c2.7-1.68,5.63-3,8.47-4.47
			c-0.24-0.52-0.48-1.03-0.73-1.55c-3.06,1.36-6.14,2.67-9.16,4.09c-1.88,0.88-3.69,2.05-4.75-0.95c1.48-1.56,3.16-2.97,4.39-4.7
			c2.61-3.66,4.98-7.48,7.44-11.23c0,0-0.02,0.04-0.02,0.04c0.38-0.32,0.77-0.64,1.15-0.96c0.3-0.31,0.61-0.61,0.91-0.92
			c2.13-1.7,4.26-3.41,6.39-5.11c2.9,3.72,5.81,7.45,8.71,11.17c-3.34,2.31-6.67,4.62-10.01,6.94c-0.86,0.27-1.73,0.53-2.59,0.8
			c0.18,0.35,0.37,0.69,0.55,1.04c0.71-0.57,1.43-1.15,2.14-1.72C458.09,65.06,458.77,65.07,459.45,65.07z"/>
		<path class="st7" d="M423.52,97.96c0.35,11.7,0.7,23.39,1.05,35.09c-1.14-1.15-2.27-2.31-3.42-3.45
			c-4.95-4.93-8.6-11.36-15.83-13.63c0,0-0.04-0.35-0.04-0.35c0-2.5,1.1-3.57,3.47-4.96c2.94-1.72,8.45-1.86,7.65-7.63
			c0,0,0.01-0.02,0.01-0.02C418.77,101.33,421.15,99.64,423.52,97.96z"/>
		<path class="st8" d="M315.11,139.96c-1.02,12.01-2,24.03-3.14,36.03c-0.13,1.37-1.14,2.66-1.74,3.98
			c-3.35-5.69-6.79-11.33-9.99-17.1c-0.99-1.78-1.35-3.92-1.99-5.9c0.71-1.03,1.42-2.05,2.13-3.08c5.12-0.17,7.35-2.88,6.95-7.9
			C309.92,143.98,312.51,141.97,315.11,139.96z"/>
		<path class="st9" d="M124.38,120.98c-2.83,10.66-5.37,21.4-8.55,31.94c-3.48,11.52-3.8,11.64,7.72,15.17
			c7.54,2.32,15.29,3.98,22.94,5.94c-1.65,0.85-3.55,2.7-4.93,2.38c-9.79-2.34-19.49-5.07-29.18-7.81
			c-3.75-1.06-4.68-3.77-3.69-7.41c1.38-5.1,2.31-10.35,4.04-15.33c3.03-8.72,6.51-17.28,9.81-25.9
			C123.14,120.3,123.76,120.64,124.38,120.98z"/>
		<path class="st10" d="M300.37,153.89c-0.71,1.03-1.42,2.05-2.13,3.08c-3.26-5.68-6.52-11.37-9.79-17.05
			c1.54-0.08,3.08-0.16,3.97-0.2c0-3.04,0-5.34,0-7.64l0.03-0.05c4.67-0.64,9.33-1.29,14-1.91c2.54-0.34,5.09-0.74,7.64-0.87
			c0.42-0.02,0.91,1.23,1.36,1.89c-0.04,0.95-0.09,1.9-0.13,2.85c-5.92,0.76-8.68,4.66-9.96,10.02c-1.86,0.35-4.25,0.13-5.42,1.23
			c-1.09,1.01-1.17,3.42-1.15,5.21C298.81,151.61,299.81,152.75,300.37,153.89z"/>
		<path class="st11" d="M374.3,110.93c-0.62,0.11-1.23,0.22-1.85,0.33c-2.04,0.82-4.08,1.64-6.12,2.46
			c-4.76,1.39-9.52,2.77-14.27,4.16c8.31-4.12,16.71-8.06,24.89-12.41c8.63-4.58,17.3-9.18,25.51-14.45
			c9.34-6,18.2-12.76,27.26-19.18c0.89,0.66,1.78,1.32,2.66,1.98c-2.74,1.86-5.59,3.6-8.18,5.66c-1,0.8-1.39,2.35-2.06,3.55
			c-9.18,2.09-16.12,7.86-22.91,13.9c-2.05,1.65-4.09,3.31-6.14,4.96c-5.36,2.63-10.73,5.27-16.09,7.91
			C376.1,110.18,375.2,110.55,374.3,110.93z"/>
		<path class="st12" d="M356.38,148c1.87-1.67,3.74-3.35,5.62-5.02c-1.94,9.26-3.87,18.52-5.81,27.77
			c-0.78,0.06-1.56,0.12-2.33,0.18c-3.55-9.39-6.51-18.99-8.83-28.82c2.12-0.37,4.23-0.74,6.35-1.12
			C354.25,142.46,356.73,144.22,356.38,148c-0.96,0.17-2.27,0.03-2.8,0.6c-0.91,0.97-1.68,2.37-1.77,3.64
			c-0.03,0.49,2.46,1.85,2.95,1.53c1.12-0.73,1.89-2.2,2.43-3.52C357.42,149.71,356.68,148.77,356.38,148z"/>
		<path class="st13" d="M63.43,82.12C57.42,76.08,51.41,70.04,45.39,64c-0.96-0.99-1.91-1.98-2.87-2.97
			c-4.41-6.77-8.65-13.67-13.28-20.29c-4.08-5.83-8.61-11.36-12.94-17.02c0.28-0.3,0.55-0.61,0.83-0.91
			c0.97,0.79,2.14,1.44,2.88,2.4c7.39,9.61,14.43,19.5,22.12,28.85c7.26,8.81,15,17.25,22.9,25.5c3.86,4.03,8.57,7.24,12.82,10.91
			c0.77,0.67,1.14,1.79,1.7,2.71c-0.29,0.31-0.59,0.62-0.88,0.93C73.59,90.12,68.51,86.12,63.43,82.12z"/>
		<path class="st14" d="M352.06,117.88c4.76-1.39,9.52-2.77,14.27-4.16c-0.33,2.37-0.66,4.74-1,7.11c-2.05,0.12-4.34-0.07-3.88,3.15
			c-0.07,0.64-0.14,1.28-0.21,1.91c-1.63,1.37-3.26,2.74-4.89,4.11c-2.32,0.24-4.64,0.48-7.37,0.77c-0.36,0.68-0.97,1.86-1.56,2.98
			c-1.84-1.07-3.36-1.95-4.89-2.84c-0.4-2.72-0.79-5.43-1.19-8.15c2.71-1.19,5.41-2.38,8.12-3.57c0.69-0.4,1.38-0.79,2.07-1.19
			C351.7,117.88,351.87,117.83,352.06,117.88z"/>
		<path class="st15" d="M399.23,96.93c6.78-6.04,13.73-11.81,22.91-13.9c0.43,3.33,0.86,6.67,1.29,10c-4.53-0.88-8.25,4.4-7.03,9.98
			c0,0-0.01,0.02-0.01,0.02c-4.02,0.97-7.72,2.05-9.76-3.55C405.61,96.69,402.34,95.98,399.23,96.93z"/>
		<path class="st14" d="M206.29,147.01c-1.56,2.69-3.11,5.39-4.67,8.08c-7.09-0.69-14.17-1.4-21.26-2.08
			c-4.96-0.48-6.2-2.28-5.14-7.98C185.54,145.7,195.91,146.35,206.29,147.01z"/>
		<path class="st16" d="M399.23,96.93c3.1-0.95,6.38-0.24,7.39,2.55c2.04,5.6,5.75,4.52,9.76,3.55c0.81,5.77-4.71,5.91-7.65,7.63
			c-2.37,1.39-3.47,2.45-3.47,4.96c-4.06-4.57-8.12-9.15-12.18-13.72C395.14,100.24,397.19,98.58,399.23,96.93z"/>
		<path class="st1" d="M42.52,61.03c0.96,0.99,1.91,1.98,2.87,2.97c-3.26,4.51-6.58,8.97-9.76,13.54
			c-4.96,7.14-9.77,14.39-14.76,21.51c-1.11,1.58-2.67,2.85-4.02,4.27c-1.64-4.79,0.84-8.21,3.82-11.45
			c0.88-0.96,2.41-1.74,2.63-2.81c1.76-8.64,8.98-13.75,13.25-20.75C38.17,65.66,40.51,63.44,42.52,61.03z"/>
		<path class="st17" d="M288.45,139.92c3.26,5.68,6.53,11.37,9.79,17.05c0.65,1.98,1,4.11,1.99,5.9c3.21,5.77,6.65,11.41,9.99,17.1
			c-1.25,2.94-2.92,3.04-4.4,0.33c-4.41-8.06-8.96-16.06-12.91-24.35c-3.22-6.78-5.65-13.93-8.43-20.92
			C285.81,136.67,287.13,138.29,288.45,139.92z"/>
		<path class="st14" d="M175.02,160.93c0.09-1.99,0.17-3.99,0.26-5.98c8.44,0.71,16.87,1.42,25.31,2.12
			c-1.63,2.73-3.26,5.46-4.88,8.18c-2.13-0.08-4.35,0.18-6.38-0.31C184.51,163.8,179.78,162.29,175.02,160.93z"/>
		<path class="st17" d="M80.86,95.63c0.34,0.93,1.25,2.18,0.93,2.74c-1.91,3.39-3.98,6.71-6.21,9.9
			c-5.02,7.18-10.15,14.28-15.26,21.4c-1.33,1.85-2.75,3.63-4.12,5.45c-0.23-1.19-1.05-2.74-0.58-3.5
			c3.3-5.42,6.88-10.66,10.33-15.99c3.05-4.71,5.88-9.56,9.11-14.13C76.62,99.28,78.91,97.57,80.86,95.63z"/>
		<path class="st18" d="M200.59,157.08c-8.44-0.71-16.87-1.41-25.31-2.12c-3.27-5.07-3.63-10.7-0.9-13.82c0,0.63,0,1.25,0.01,1.88
			c-0.07,0.14-0.14,0.29-0.21,0.43c0.06-0.15,0.13-0.3,0.19-0.44c11.28,0.35,22.57,0.69,33.85,1.04c-0.64,0.99-1.29,1.99-1.93,2.98
			c-10.37-0.66-20.74-1.32-31.07-1.97c-1.05,5.7,0.18,7.5,5.14,7.98c7.09,0.68,14.17,1.39,21.26,2.08
			C201.27,155.76,200.93,156.42,200.59,157.08z"/>
		<path class="st19" d="M244.17,168.96c6.08,3.16,12.17,0.85,18.26,0.02c0.01,1.02,0.03,2.04,0.04,3.06
			c-3.96,0.41-7.93,0.83-12.95,1.35c1.63,2.49,2.62,4,3.29,5.01c3.64-0.54,6.53-0.96,9.42-1.39c-0.04,0.98-0.09,1.96-0.13,2.95
			c-2.49,0.15-4.98,0.29-8.82,0.52c2.96,3.87,5.14,6.72,7.32,9.56c-0.44,1.29-0.89,2.59-1.33,3.88c-1.15-0.74-2.79-1.21-3.36-2.27
			C251.87,184.16,248.05,176.54,244.17,168.96z"/>
		<path class="st14" d="M174.38,143.01c0-0.63,0-1.25-0.01-1.88c-0.22-1.34-0.45-2.68-0.67-4.02c8.39,0.75,16.77,1.53,25.16,2.24
			c3.29,0.28,6.59,0.41,9.89,0.6c-0.18,1.36-0.36,2.71-0.54,4.07c-11.28-0.34-22.57-0.69-33.85-1.04L174.38,143.01z"/>
		<path class="st20" d="M444.62,83.92c1.08,0.69,2.15,1.38,3.79,2.43c1.68-0.78,4.48-2.08,7.29-3.38c0.24,0.51,0.48,1.03,0.72,1.54
			c-2.6,1.39-5.21,2.77-8.36,4.45c1.11,2.06,2.15,3.98,3.31,6.13c3.38-1.56,6.25-2.88,9.12-4.21c0.21,0.36,0.42,0.72,0.63,1.08
			c-2.47,1.88-4.93,3.76-8.25,6.29c2.43,2.7,4.76,5.27,7.08,7.85c-3,3.06-5.75,2.36-7.49-1.1c-3.51-7-6.67-14.18-9.97-21.29
			C443.2,83.77,443.91,83.84,444.62,83.92z"/>
		<path class="st21" d="M462.43,90.06c-1.02-1.61-2.03-3.22-3.14-4.96c2.67-1.02,0.87-2.8-2.01-4.81c8.02,1.43,7.96,1.5,13.4,6.95
			c0.92,0.92,2.96,1.8,3.94,1.4c3.37-1.4,4.41,1.07,5.94,2.91c-2.4,1.75-4.79,3.5-7.19,5.25c-2.31-2.89-4.61-5.78-6.7-8.4
			C464.82,89.12,463.63,89.59,462.43,90.06z"/>
		<path class="st22" d="M405.31,115.96c7.23,2.27,10.88,8.71,15.83,13.63c1.15,1.14,2.28,2.3,3.42,3.45
			c-0.4,1.31-0.61,2.75-1.33,3.83c-0.2,0.3-2.42-0.09-2.94-0.76C415.2,129.47,410.28,122.7,405.31,115.96z"/>
		<path class="st23" d="M342.54,130.91c1.52,0.88,3.04,1.77,4.89,2.84c0.59-1.12,1.2-2.3,1.56-2.98c2.73-0.28,5.05-0.52,7.37-0.77
			c-0.28,1.58-0.23,3.32-0.91,4.7c-1.1,2.23-2.69,4.21-4.07,6.3c-2.12,0.37-4.23,0.74-6.35,1.12
			C344.19,138.38,343.36,134.65,342.54,130.91z"/>
		<path class="st12" d="M385.37,139.96c0.35-1.03,0.71-2.05,1.06-3.08c1.31,4.47,3.04,8.87,3.77,13.43
			c0.49,3.04-2.01,4.16-4.59,2.64c-3.53-2.08-6.78-4.64-10.15-7c1.62-0.65,3.25-1.31,4.87-1.96c1.63,0.67,3.71,2.33,4.81,1.83
			C388.32,144.4,386.89,142.01,385.37,139.96z"/>
		<path class="st24" d="M240.35,164.98c0.17,2.06,0.34,4.12,0.51,6.18c-0.19,0.28-0.38,0.56-0.58,0.84
			c-3.21,0.59-6.41,1.42-9.65,1.64c-1.35,0.09-2.8-1.12-4.2-1.74c0.77-1.71,1.18-4.55,2.37-4.92
			C232.49,165.81,236.48,165.58,240.35,164.98z"/>
		<path class="st9" d="M444.62,83.92c-0.71-0.07-1.42-0.15-2.12-0.22c-2.07-3.86-4.13-7.72-6.2-11.58c0.68-0.8,1.37-1.6,2.05-2.4
			c1.06,2.99,2.87,1.83,4.75,0.95c3.03-1.42,6.1-2.73,9.16-4.09c0.24,0.52,0.48,1.03,0.73,1.55c-2.83,1.47-5.76,2.79-8.47,4.47
			c-1.65,1.03-4.3,2.01-2.32,4.9c1.84,2.69,3.51,1.22,5.38-0.11c1.44-1.03,3.19-1.62,4.8-2.4c0,0.67,0,1.34-0.01,2.01
			C449.79,79.3,447.2,81.61,444.62,83.92z"/>
		<path class="st4" d="M315.46,131.14c-0.46-0.66-0.94-1.91-1.36-1.89c-2.56,0.13-5.1,0.53-7.64,0.87c-4.67,0.63-9.33,1.27-14,1.91
			c0.32-0.65,0.65-1.3,0.97-1.94c10.61-2.24,21.22-4.48,31.83-6.72c0.04,0.81,0.07,1.63,0.11,2.44c-1.56,0.47-3.27,0.68-4.65,1.46
			C318.83,128.33,317.2,129.83,315.46,131.14z"/>
		<path class="st24" d="M232.51,185.25c-1.77-0.42-3.55-0.85-5.78-1.38c0-1.99,0-4.54,0-7.53c3.98-0.43,7.88-0.86,11.77-1.28
			C236.5,178.45,234.51,181.85,232.51,185.25z"/>
		<path class="st25" d="M179.38,186.98c-1.23-2.24-3.17-4.37-3.54-6.74c-0.83-5.31-0.88-10.74-1.25-16.12
			c1.62,0.91,3.25,1.82,4.87,2.74c-0.04,2-0.09,4-0.13,6c-0.84,0.24-1.69,0.47-3.25,0.91c1.54,1.03,2.42,1.62,3.31,2.21
			C179.38,179.65,179.38,183.31,179.38,186.98z"/>
		<path class="st14" d="M179.33,172.86c0.04-2,0.09-4,0.13-6c4.68,0.71,9.37,1.42,14.05,2.12c-1.33,2.04-2.66,4.07-3.99,6.11
			C186.12,174.35,182.72,173.6,179.33,172.86z"/>
		<path class="st13" d="M325.36,125.81c-0.04-0.81-0.07-1.63-0.11-2.44c8.03-1.74,16.07-3.48,24.1-5.21
			c0.04,0.34,0.08,0.69,0.12,1.03c-2.71,1.19-5.41,2.38-8.12,3.57C336.02,123.78,330.69,124.79,325.36,125.81z"/>
		<path class="st13" d="M438.35,69.72c-0.68,0.8-1.37,1.6-2.05,2.4c-1.3,0.57-2.61,1.13-3.91,1.7c-0.89-0.66-1.77-1.32-2.66-1.98
			c0.65-0.63,1.29-1.26,1.94-1.9c0.55-0.43,1.09-0.87,1.64-1.3c4.26-3.83,8.51-7.66,12.78-11.47c1.32-1.18,2.73-2.26,4.09-3.38
			c-2.47,3.75-4.84,7.58-7.44,11.23C441.5,66.75,439.82,68.16,438.35,69.72z"/>
		<path class="st1" d="M305.36,144.02c1.28-5.37,4.04-9.27,9.96-10.02c-0.07,1.99-0.14,3.98-0.21,5.96
			c-2.6,2.01-5.19,4.02-7.79,6.03C306.67,145.34,306.02,144.68,305.36,144.02z"/>
		<path class="st1" d="M466.65,31.35c4.43-7.44,8.85-14.89,13.28-22.33c0.63,0.38,1.26,0.77,1.89,1.15
			c-4.58,7.35-9.15,14.71-13.73,22.06C467.61,31.94,467.13,31.64,466.65,31.35z"/>
		<path class="st18" d="M193.51,168.98c-4.68-0.71-9.37-1.41-14.05-2.12c-1.62-0.91-3.25-1.83-4.87-2.74
			c0.14-1.06,0.29-2.13,0.43-3.19c4.76,1.36,9.49,2.87,14.3,4.02c2.04,0.49,4.25,0.23,6.38,0.31
			C194.97,166.5,194.24,167.74,193.51,168.98z"/>
		<path class="st26" d="M462.43,90.06c1.2-0.47,2.39-0.94,4.24-1.67c2.09,2.62,4.4,5.51,6.7,8.4c-1.18,0.76-2.36,1.52-3.55,2.28
			C467.36,96.06,464.9,93.06,462.43,90.06z"/>
		<path class="st24" d="M75.79,127.83c0.82,0.27,1.64,0.55,2.46,0.82c-2.44,7.22-4.89,14.44-7.33,21.66
			c0.58-4.21,0.93-8.47,1.8-12.62C73.42,134.33,74.74,131.11,75.79,127.83z"/>
		<path class="st6" d="M262.23,177.02c-2.89,0.43-5.78,0.85-9.42,1.39c-0.66-1.01-1.65-2.52-3.29-5.01
			c5.03-0.53,8.99-0.94,12.95-1.35C262.39,173.7,262.31,175.36,262.23,177.02z"/>
		<path class="st14" d="M179.38,186.98c0-3.67,0-7.33,0-11c2.74,0.69,5.49,1.38,8.23,2.07C184.86,181.03,182.12,184,179.38,186.98z"
			/>
		<path class="st26" d="M293.42,130.09c-0.32,0.65-0.65,1.3-0.97,1.94c0,0-0.03,0.05-0.03,0.05c-2.76,0.7-5.52,1.39-8.28,2.09
			c-4.35,0.58-8.7,1.15-13.05,1.73c-0.09-0.66-0.17-1.32-0.26-1.98C278.36,132.65,285.89,131.37,293.42,130.09z"/>
		<path class="st15" d="M260.6,190.04c-2.18-2.85-4.36-5.69-7.32-9.56c3.85-0.22,6.34-0.37,8.82-0.52
			C261.6,183.33,261.1,186.68,260.6,190.04z"/>
		<path class="st4" d="M284.14,134.18c2.76-0.7,5.52-1.39,8.28-2.09c0,2.3,0,4.6,0,7.64c-0.89,0.05-2.43,0.12-3.97,0.2
			c-1.32-1.63-2.64-3.26-3.97-4.89C284.32,134.77,284.21,134.48,284.14,134.18z"/>
		<path class="st16" d="M416.4,103.01c-1.21-5.58,2.51-10.86,7.03-9.98c0.03,1.64,0.06,3.29,0.08,4.93
			C421.15,99.64,418.77,101.33,416.4,103.01z"/>
		<path class="st13" d="M458.62,46.83c-2.13,1.7-4.26,3.41-6.39,5.11c3.08-4.9,6.15-9.79,9.23-14.69c0.49,0.3,0.97,0.6,1.46,0.9
			C461.48,41.04,460.05,43.94,458.62,46.83z"/>
		<path class="st18" d="M187.61,178.05c-2.74-0.69-5.49-1.38-8.23-2.07c-0.88-0.59-1.77-1.18-3.31-2.21
			c1.57-0.44,2.41-0.67,3.25-0.91c3.4,0.74,6.8,1.49,10.19,2.23C188.88,176.08,188.24,177.06,187.61,178.05z"/>
		<path class="st24" d="M226.54,196.39c-0.05-1.49,0.01-2.99-0.19-4.46c-0.59-4.52,1.18-6.62,5.83-5.94
			C230.3,189.45,228.42,192.92,226.54,196.39z"/>
		<path class="st9" d="M459.45,65.07c-0.68-0.01-1.35-0.01-2.03-0.02l-0.1-0.12c3.34-2.31,6.67-4.62,10.01-6.94
			c0.39,0.65,0.78,1.31,1.17,1.96C465.48,61.67,462.46,63.37,459.45,65.07z"/>
		<path class="st19" d="M262.69,143.57c-1.44,0.47-2.89,0.94-4.33,1.41c0-0.35,0-0.7,0-1.05c1.4-0.32,2.8-0.64,4.2-0.97
			C262.8,143.13,262.84,143.33,262.69,143.57z"/>
		<path class="st23" d="M374.3,110.93c0.9-0.37,1.8-0.75,2.7-1.13c0.26,0.69,0.53,1.37,0.79,2.06
			C376.63,111.55,375.47,111.24,374.3,110.93z"/>
		<path class="st1" d="M260.34,137.24c-0.86,0.2-1.71,0.39-2.57,0.59C258.63,137.63,259.48,137.44,260.34,137.24z"/>
		<path class="st11" d="M349.47,119.19c-0.04-0.34-0.08-0.69-0.12-1.03c0.73-0.05,1.46-0.1,2.19-0.15
			C350.86,118.4,350.17,118.79,349.47,119.19z"/>
		<path class="st15" d="M433.3,68.64c-0.55,0.43-1.1,0.87-1.64,1.3C432.21,69.51,432.76,69.07,433.3,68.64z"/>
		<path class="st13" d="M451.31,52.86c-0.38,0.32-0.77,0.64-1.15,0.96C450.54,53.5,450.93,53.18,451.31,52.86z"/>
		<path class="st19" d="M243.4,147.02c0,1.98,0,3.97,0,5.95c-4.2,0.65-8.38,1.54-12.61,1.81c-1.41,0.09-2.93-1.43-4.4-2.22
			c0.98-1.79,1.75-4.97,2.96-5.14C233.97,146.77,238.71,147.08,243.4,147.02z"/>
		<path class="st24" d="M239.44,156.05c1.31,1.98,2.63,3.96,3.94,5.94c-0.33,0.67-0.67,1.34-1,2c-0.65,0.01-1.31,0.03-1.96,0.04
			c-4.45,0-8.91,0-13.7,0c0-1.82,0-4.04,0-6.8C231.02,156.83,235.23,156.44,239.44,156.05z"/>
		<path class="st19" d="M245.41,141c0,1.33-0.01,2.66-0.01,3.99c-6.35,0-12.7,0-19.75,0c-0.06-0.82-0.18-2.38-0.29-3.94
			C232.03,141.03,238.72,141.01,245.41,141z"/>
		<path class="st21" d="M133.1,154.93c-2.45-3.18-4.67-4.9-5.22-7.06c-0.73-2.86,3.39-7.2,5.89-6.71c3.04,0.59,6.4,2.03,5.42,5.69
			C138.49,149.43,135.81,151.48,133.1,154.93z"/>
		<path class="st20" d="M452.37,76.98c0-0.67,0-1.34,0.01-2.01c1.66-0.99,3.33-1.98,4.99-2.97c1.7-0.37,3.39-0.73,5.09-1.1
			c0.2,0.52,0.41,1.04,0.61,1.56C459.5,73.97,455.93,75.48,452.37,76.98z"/>
		<path class="st26" d="M39.31,80.98c-0.39-2.71,0.54-4.18,3.7-4.11c3.28,0.07,4.77,2.02,4.16,4.65c-0.4,1.71-2.45,3.89-4.12,4.27
			C39.66,86.56,39.13,83.84,39.31,80.98z"/>
		<path class="st23" d="M365.33,120.83c0.33-2.37,0.66-4.74,1-7.11c2.04-0.82,4.08-1.65,6.12-2.47c0.03,1.63,0.08,3.25,0.1,4.87
			c0.01,1.51,0.2,4.28-0.06,4.32C370.15,120.85,367.73,120.77,365.33,120.83z"/>
		<path class="st27" d="M372.54,135.51c-1.52-2.28-3.22-3.87-2.91-4.56c0.69-1.53,2.38-2.62,3.66-3.89c1.01,1.03,3,2.27,2.83,3.04
			C375.77,131.7,374.27,133.05,372.54,135.51z"/>
		<path class="st27" d="M385.37,139.96c1.52,2.05,2.94,4.44-0.22,5.86c-1.11,0.5-3.18-1.16-4.81-1.83
			C382.02,142.65,383.7,141.3,385.37,139.96z"/>
		<path class="st23" d="M361.24,125.89c0.07-0.64,0.14-1.27,0.21-1.91c0.84,0.19,1.68,0.39,2.52,0.58c0.01,0.27,0.02,0.54,0.03,0.81
			C363.08,125.53,362.16,125.71,361.24,125.89z"/>
		<path class="st0" d="M242.38,163.99c0.33-0.67,0.67-1.34,1-2c1.61,0,3.22,0,4.83,0c0.04,0.31,0.09,0.62,0.13,0.93
			C246.35,163.27,244.37,163.63,242.38,163.99z"/>
		<path class="st0" d="M258.36,143.93c0,0.35,0,0.7,0,1.05c-1.63,0-3.26,0-4.89,0c-0.01-0.35-0.02-0.7-0.03-1.05
			C255.08,143.93,256.72,143.93,258.36,143.93z"/>
		<path class="st9" d="M457.42,65.06c-0.71,0.57-1.43,1.15-2.14,1.72c-0.18-0.35-0.37-0.69-0.55-1.04c0.86-0.27,1.73-0.53,2.59-0.8
			C457.32,64.94,457.42,65.06,457.42,65.06z"/>
		<path class="st17" d="M305.36,144.02c0.65,0.66,1.31,1.32,1.96,1.97c0.39,5.02-1.83,7.73-6.95,7.9c-0.56-1.15-1.56-2.28-1.58-3.43
			c-0.02-1.79,0.06-4.2,1.15-5.21C301.11,144.16,303.5,144.37,305.36,144.02z"/>
		<path class="st27" d="M356.38,148c0.3,0.76,1.04,1.71,0.82,2.26c-0.54,1.32-1.31,2.78-2.43,3.52c-0.49,0.32-2.98-1.04-2.95-1.53
			c0.09-1.27,0.86-2.67,1.77-3.64C354.11,148.03,355.42,148.18,356.38,148C356.37,148,356.38,148,356.38,148z"/>
		<path class="st14" d="M174.37,142.99c-0.06,0.15-0.13,0.3-0.19,0.44c0.07-0.14,0.14-0.29,0.21-0.43
			C174.38,143.01,174.37,142.99,174.37,142.99z"/>
	</g>
</g>
</svg>
