<?xml version="1.0" encoding="utf-8"?>
<!-- Generator: Adobe Illustrator 24.0.1, SVG Export Plug-In . SVG Version: 6.00 Build 0)  -->
<svg version="1.1" id="Слой_1" xmlns="http://www.w3.org/2000/svg" xmlns:xlink="http://www.w3.org/1999/xlink" x="0px" y="0px"
	 viewBox="0 0 93 75" style="enable-background:new 0 0 93 75;" xml:space="preserve">
<style type="text/css">
	.st0{fill-rule:evenodd;clip-rule:evenodd;fill:#FFFFFF;}
</style>
<path class="st0" d="M74.3,0L62.1,18.4L49.4,0H74.3z M60.1,22.6H32.9L46.5,74L60.1,22.6z M33.9,19.6h25.3L46.5,1.2L33.9,19.6z
	 M31,18.4L43.7,0H18.8L31,18.4z M43.6,75L29.8,22.6H0L43.6,75z M0,19.6h28.1L15.9,1.2L0,19.6z M77.1,1.2L64.9,19.6H93L77.1,1.2z
	 M63.2,22.6L49.4,75L93,22.6H63.2z"/>
</svg>
