<?xml version="1.0" encoding="utf-8"?>
<!-- Generator: Adobe Illustrator 24.0.1, SVG Export Plug-In . SVG Version: 6.00 Build 0)  -->
<svg version="1.1" id="Слой_1" xmlns="http://www.w3.org/2000/svg" xmlns:xlink="http://www.w3.org/1999/xlink" x="0px" y="0px"
	 viewBox="0 0 354.91 424.86" style="enable-background:new 0 0 354.91 424.86;" xml:space="preserve">
<style type="text/css">
	.st0{fill:#54547F;}
	.st1{fill:#5C5C86;}
	.st2{fill:#585781;}
	.st3{fill:#5D5C85;}
	.st4{fill:#5D5D87;}
	.st5{fill:#585882;}
	.st6{fill:#54507A;}
	.st7{fill:#64648D;}
	.st8{fill:#6F6E97;}
	.st9{fill:#585782;}
	.st10{fill:#52527D;}
	.st11{fill:#5E5D87;}
	.st12{fill:#605E88;}
	.st13{fill:#615F8B;}
	.st14{fill:#565681;}
	.st15{fill:#65648E;}
	.st16{fill:#9695C8;}
	.st17{fill:#74759F;}
	.st18{fill:#8484BF;}
	.st19{fill:#6A6991;}
	.st20{fill:#8D8DC4;}
	.st21{fill:#E75C63;}
	.st22{fill:#F08287;}
	.st23{fill:#DD5056;}
	.st24{fill:#6A5B80;}
	.st25{fill:#9593BE;}
	.st26{fill:#E8CEAC;}
	.st27{fill:#350806;}
	.st28{fill:#D8CBAF;}
</style>
<path class="st0" d="M19.75,404.51c-9.89-24.03-4.64-46.69,6.29-68.81c1.02-2.07,2.21-4.05,3.31-6.08
	c2.88,4.34,2.88,8.25-0.54,12.64c-1.97,2.54-4.83,5.87-1.55,9.75c0.39,0.46,0.11,1.56,0.02,2.35c-0.49,4.39-1.02,8.77-1.53,13.15
	c0,0.67,0,1.33,0,2c2.95,3.66,5.89,7.31,8.84,10.97c-4.14,6.29-8.36,12.53-12.35,18.91c-0.91,1.45-1.02,3.4-1.49,5.13
	C20.42,404.51,20.08,404.51,19.75,404.51z"/>
<path class="st1" d="M317.4,69.5c0.96,11.98,1.92,23.95,2.87,35.93c-4.83,4.77-13.4,4.81-15.87,12.73c-0.42,1.35-2.2,2.75-3.65,3.23
	c-7.95,2.63-14.27,8.93-23.2,9.58c-3.88,0.29-8.02,2.15-11.31,4.39c-5.8,3.95-11.04,8.74-16.51,13.17c-4.99,1.67-9.98,3.33-14.97,5
	c-0.09-3.82-2.06-6.23-5.5-7.76c-1.02-0.45-1.74-1.58-2.6-2.4c0.18-8.33,0.37-16.67,0.55-25c6.94,1.79,7.44,1.09,9.79-5.58
	c1.9-5.4,4.84-10.46,7.69-15.47c0.77-1.35,2.93-1.88,4.4-2.87c2.93-1.97,5.81-4,8.72-6.01c0.91-0.63,1.76-1.67,2.75-1.83
	c3.33-0.55,4.22-2.76,5.49-5.56c1.17-2.58,3.96-5.81,6.41-6.17c6.9-1.03,13.57-1.19,20.55-3.79
	C300.33,68.35,309.21,69.85,317.4,69.5z"/>
<path class="st2" d="M176.23,359.47c-1.59-0.73-3.18-1.48-4.78-2.19c-1.05-0.47-2.47-0.59-3.12-1.37
	c-3.13-3.79-7.22-7.33-8.77-11.74c-1.95-5.55-3.37-12.21-2.11-17.73c1.98-8.67,2.62-18.37,10.07-25.02
	c1.41,0.36,2.83,0.73,4.24,1.09c-2.11,3.92-4.23,7.84-6.13,11.36c1.82,1.6,2.97,2.61,4.11,3.62c-2.91-0.25-4.35,0.66-3.87,3.98
	c0.43,2.92,0.23,5.94,0.45,8.9c0.11,1.51,0.03,3.48,0.92,4.42c4.14,4.41,8.59,8.53,13.65,13.46c0.6-1.84,1.23-3.8,1.86-5.75
	c0.67,0,1.33-0.01,2-0.01c0.79,1.32,1.27,3.15,2.44,3.86c6.5,3.99,13.61,3.22,20.67,2.03c0.72-0.12,1.26-1.24,1.89-1.9
	c1.33-0.33,2.67-0.67,4-1c3.23-1.03,6.49-1.97,9.64-3.21c0.42-0.16,0.25-1.83,0.36-2.79c1.23-0.64,2.45-1.28,4.12-2.14
	c-1.53-1.17-2.63-2-3.73-2.84c-0.02-0.49-0.04-0.97-0.07-1.46c1.44-0.09,2.88-0.14,4.32-0.27c2.74-0.24,5.7,0.03,8.13-0.97
	c1.64-0.67,2.53-3.16,3.75-4.84c3.37-4.64,7.09-9.08,9.97-14.01c1.87-3.2,3.13-7.15-0.48-10.47c-0.33-2.32-0.65-4.65-0.98-6.97
	c1.56-0.34,3.12-0.68,4.67-1.03c4.59,6.39,4.08,13.99,5.03,21.24c0.1,0.78,0.08,1.93-0.39,2.39c-4.36,4.26-1.69,8.05,0.63,11.89
	c-0.12,1.38-0.24,2.76-0.26,3c-2.58,1.34-4.25,2.21-5.92,3.08c-0.76,1-1.41,2.11-2.31,2.98c-1.99,1.91-4.12,3.68-6.15,5.55
	c-1,0.92-2.32,1.76-2.78,2.92c-3.19,8.08-10.82,11.34-17.73,13.38c-4.15,1.22-8.59,3.35-13.01,3.43c-5.94,0.1-11.9-1.07-17.87-1.55
	c-1.33-0.11-2.72,0.44-4.08,0.69C184.49,362.15,180.36,360.81,176.23,359.47z"/>
<path class="st3" d="M119.98,333.62c-3.08,1.59-6.15,3.19-9.23,4.78c-1.1-1.69-2.04-3.51-3.33-5.04c-2.76-3.24-7.66-6.05-8.15-9.53
	c-0.86-6.24-4.65-10.76-7.66-15.14c-2.8-4.08-3.98-7.59-3.88-12.12c0.09-3.92,0.22-7.86-0.15-11.75c-0.11-1.18-1.84-2.21-2.82-3.31
	c-0.31-0.9-0.61-1.81-0.92-2.71c-0.54,0-1.08-0.01-1.63-0.01c-0.48,2.57-0.97,5.14-1.45,7.72c-0.64-1.86-1.28-3.73-2.1-6.1
	c-0.83,1.01-1.47,1.45-1.58,1.99c-1.17,5.97-2.11,11.99-3.43,17.92c-0.56,2.5-1.25,5.48-2.95,7.13c-3.99,3.87-3.17,11.16-9.73,13.19
	c-0.8,0.25-1.41,3.11-1.11,4.56c1.64,8.11-4.2,11.28-9.13,15.11c-1.74-1.11-3.19-2.03-4.64-2.94c-0.59,0.25-1.18,0.49-1.77,0.74
	c0.69,3.84,1.25,7.7,2.11,11.5c0.53,2.3,2,4.45,2.22,6.75c0.38,3.96,0.1,7.99,0.1,11.99c-0.16,0.22-0.38,0.32-0.66,0.28
	c-0.44,0.24-0.87,0.48-1.31,0.72c-0.86,0.35-1.71,0.7-2.57,1.05c-4.45-9.39-5.22-19.4-4.33-29.5c0.39-4.45,1.1-9.56,3.57-13
	c5.46-7.61,2.27-14.94,1.12-22.48c8.23-11.95,15.55-24.69,28.09-32.97c1.15,0.3,2.29,0.59,3.4,0.88c0.16-3.58,0.3-6.62,0.44-9.65
	c0.21,0.06,0.42,0.11,0.62,0.17c0.93,3.12,1.86,6.24,2.78,9.36c0.5-0.14,1-0.28,1.5-0.42c0.26-3.24,0.51-6.48,0.81-10.23
	c3.38,2.91,0.44,9.02,6.5,8.94c1.37,0.93,2.74,1.86,4.11,2.79c0.24-0.23,0.48-0.46,0.73-0.7c-0.93-1.37-1.87-2.74-2.8-4.11
	c1.34-1,2.68-1.99,4.02-2.99c0.61,1.13,1.18,2.28,1.84,3.39c1.71,2.88,3.45,5.74,5.18,8.6l-0.01,0.04
	c-1.11-0.58-2.21-1.15-3.97-2.06c-3.02,11.4-5.6,22.13-0.52,33.15c1.72,3.73,3.77,6.97,6.39,10.3
	C108.31,325.82,113.77,329.97,119.98,333.62z"/>
<path class="st4" d="M323.54,168.49c-3.17,8.69-6.34,17.37-9.51,26.06c-3.88,0.24-7.21-0.08-10-3.73
	c-5.38-7.02-13.51-8.83-21.78-10.4c-8.14-1.55-16.32-3.28-24.15-5.92c-7.68-2.59-14.99-6.21-23.36-5.98c-0.35,0-0.7,0-1.04,0
	c-0.33,0.01-0.65,0.01-0.98,0.01c-0.99-0.67-1.98-1.33-2.97-2c-0.66-0.01-1.32-0.02-1.98-0.02c-1-0.66-2.01-1.33-3.01-1.99l0,0
	c-0.67-0.66-1.34-1.32-2.01-1.98c-0.33-0.01-0.67-0.01-1-0.02c-1-2-1.99-4-2.99-6.01c7.61,4.04,15.86,4.95,24.09,6
	c0.15-0.55,0.3-1.11,0.45-1.66c-2.29-0.71-4.59-1.42-6.82-2.11c0.09-0.38,0.1-0.66,0.16-0.67c11.7-1.75,23.4-3.48,35.1-5.19
	c0.31-0.04,0.64,0.13,0.97,0.17c3.57,0.49,7.13,1.04,10.71,1.44c3.99,0.45,8.05,0.52,11.99,1.23c2.98,0.54,5.83,1.79,8.71,2.82
	c1.35,0.48,3.02,0.84,3.88,1.83C312.13,165.18,317.52,167.38,323.54,168.49z M246.36,162.04c0.01,0.28,0.01,0.55,0.02,0.83
	c0.9,0,1.81,0,2.71,0c-0.01-0.28-0.02-0.55-0.02-0.83C248.16,162.04,247.26,162.04,246.36,162.04z"/>
<path class="st0" d="M229.41,110.42c5.21-11.96,9.04-24.54,17.58-34.91c21.1-25.62,46.48-44.97,78.66-54.5
	c4.41-1.31,9.05-1.83,15.12-3.02c-4.89,7.01-8.92,12.78-12.95,18.55c-4.55-0.99-9.61-4.33-12.41,2.71
	c-0.11,0.27-0.47,0.48-0.76,0.63c-7,3.61-14.02,7.16-21,10.8c-8.69,4.53-17.28,9.11-24.14,16.46c-8.79,9.42-17.99,18.46-26.93,27.74
	c-0.6,0.62-0.47,1.88-0.88,2.74C239.03,103.26,235.32,107.91,229.41,110.42z"/>
<path class="st5" d="M229.41,110.42c5.92-2.52,9.63-7.16,12.28-12.79c0.41-0.87,0.29-2.12,0.88-2.74
	c8.95-9.27,18.14-18.32,26.93-27.74c6.86-7.35,15.45-11.93,24.14-16.46c6.98-3.64,14-7.2,21-10.8c0.29-0.15,0.65-0.36,0.76-0.63
	c2.81-7.05,7.87-3.7,12.41-2.71c-2.5,7.05-5,14.11-7.5,21.16c-2.08,0.82-4.17,1.64-6.25,2.46c1.48,1.44,2.97,2.87,4.45,4.31
	c-0.37,1.68-0.74,3.35-1.12,5.03c-8.19,0.35-17.07-1.15-24.38,1.57c-6.98,2.61-13.65,2.77-20.55,3.79
	c-2.46,0.37-5.25,3.59-6.41,6.17c-1.27,2.81-2.16,5.02-5.49,5.56c-0.99,0.16-1.84,1.2-2.75,1.83c-2.9,2.01-5.79,4.04-8.72,6.01
	c-1.47,0.99-3.63,1.52-4.4,2.87c-2.85,5-5.79,10.07-7.69,15.47c-2.35,6.67-2.85,7.37-9.79,5.58c-0.09-0.34,0.01-0.61,0.28-0.82
	c0.41-0.34,0.82-0.69,1.23-1.03c-0.1-1.05-0.19-2.1-0.29-3.15C228.77,112.39,229.09,111.4,229.41,110.42z"/>
<path class="st6" d="M171.76,302.52c-1.41-0.36-2.83-0.73-4.24-1.09c-0.26-0.64-0.51-1.28-0.77-1.92c-0.67-2-1.33-4-2-6
	c1.84-5.17-2.41-7.97-4.53-11.59c0-4.59,0-9.19,0-14.1c-0.5-0.06-1.34-0.17-2.91-0.36c2.66-5.6,5.41-10.68,10.34-14.3
	c-0.32,4.95,0.4,9.25,5.27,9.76c-0.44,2.52-0.79,4.55-1.15,6.59c-0.02,0.98-0.05,1.97-0.07,2.95c-0.12,0.67-0.24,1.35-0.36,2.02
	c-2.43,1.99-2.34,4.01-0.07,6.06c0.12,1.01,0.23,2.02,0.35,3.02c0.19,0.65,0.37,1.31,0.56,1.96c0.56,1.27,1.12,2.55,1.67,3.82
	c0.56,0.75,1.12,1.5,1.68,2.25c0.18-0.04,0.36-0.08,0.54-0.14c0.3,0.89,0.59,1.78,0.89,2.68c0.6,0.78,1.2,1.56,1.8,2.34
	c10.9,11.16,24.98,11.58,39.18,11.63c12.04,0.14,22.07-4.41,30.34-13.04c0.16,0.15,0.32,0.31,0.48,0.46
	c0.33,2.32,0.65,4.65,0.98,6.97c-2.89-0.33-3.86,0.87-4.13,3.84c-0.44,4.85-4.49,8.66-7.88,8.19c-2.93,3.34-6.61,4.46-10.94,3.82
	c-1.43-0.21-2.88-0.33-4.32-0.36c-5.74-0.12-11.48-0.18-17.22-0.31c-0.44-0.01-0.87-0.46-1.32-0.68c-1.75-0.82-3.51-1.62-5.14-2.38
	c-1.35,1.57-2.38,2.76-3.72,4.31c-1.87-1.73-3.39-3.22-5-4.59c-1.75-1.5-4.33-4.48-5.28-4.05c-4.81,2.19-6.12-2.47-9.02-3.81
	C174.43,305.17,173.1,303.85,171.76,302.52z"/>
<path class="st7" d="M249.75,148.52c5.47-4.44,10.71-9.22,16.51-13.17c3.28-2.24,7.42-4.11,11.31-4.39
	c8.93-0.66,15.25-6.95,23.2-9.58c1.45-0.48,3.23-1.88,3.65-3.23c2.46-7.91,11.04-7.95,15.87-12.73c3.21,7.98,6.41,15.96,9.62,23.95
	c-7.51,0.38-15.01-0.25-22.36,2.83c-6.84,2.86-7.65,3.26-5.78,10.26c-8.68,0.7-17.4,1.12-26.04,2.18
	c-7.37,0.9-14.65,2.54-21.97,3.85C252.41,148.51,251.08,148.52,249.75,148.52z"/>
<path class="st8" d="M227.76,166.5c0.66,0.01,1.32,0.02,1.98,0.02c0.99,0.67,1.98,1.33,2.97,2c0.33,0.01,0.65,0.01,0.98-0.01
	c0.35,0.34,0.7,0.68,1.05,1.02l-0.02-0.02c0.52,1,0.88,2.14,1.59,2.99c14.38,17.14,16.63,35.92,7.85,56.3
	c-0.77,1.78-1,3.79-1.49,5.69c-0.99,1.33-1.98,2.66-2.96,3.99c-2.03,0.43-4.39,1.73-6,1.1c-2.58-1-4.66-3.29-6.95-5.03
	c9.17-14.22,10.91-29.64,7.07-45.82c-2.46-10.37-10.36-17.14-16.98-24.72c-3.04-3.48-6.64-6.67-6.19-11.96
	c0.75-3.28,1.5-6.55,2.25-9.83c1.61-0.44,3.23-0.88,4.84-1.32c-0.66,1.83-1.1,3.77-2,5.46c-3.38,6.32-0.89,13.2,5.99,16.15
	c0.33,0,0.67,0.01,1,0.02c0.67,0.66,1.34,1.32,2.01,1.98c0,0,0,0,0,0C225.75,165.17,226.76,165.84,227.76,166.5z"/>
<path class="st9" d="M239.72,238.48c0.99-1.33,1.98-2.66,2.96-3.99c3.28-1.47,6.57-2.93,9.49-4.24c-0.87-2.72-2.55-5.18-2.13-7.22
	c0.87-4.3,2.96-8.34,4.32-12.57c1.29-4,2.33-8.08,3.37-12.15c0.56-2.22,0.89-4.5,1.4-7.17c2.49,1.51,3.94,2.52,5.5,3.3
	c4.23,2.13,9.04,3.49,12.64,6.38c6.52,5.24,12.38,11.31,18.37,17.18c1.07,1.05,1.43,2.82,2.12,4.26
	c-22.2-2.71-40.4,6.91-57.88,18.76C239.82,240.18,239.77,239.33,239.72,238.48z"/>
<path class="st10" d="M297.76,222.27c-0.69-1.44-1.05-3.21-2.12-4.26c-5.99-5.87-11.85-11.94-18.37-17.18
	c-3.6-2.89-8.41-4.25-12.64-6.38c-1.56-0.79-3.01-1.8-5.5-3.3c-0.51,2.67-0.83,4.95-1.4,7.17c-1.04,4.07-2.08,8.15-3.37,12.15
	c-1.36,4.22-3.44,8.26-4.32,12.57c-0.41,2.04,1.26,4.5,2.13,7.22c-2.92,1.31-6.21,2.77-9.49,4.24c0.48-1.9,0.72-3.91,1.48-5.69
	c8.78-20.37,6.52-39.16-7.85-56.3c-0.71-0.85-1.07-1.98-1.59-2.99c2,0.66,4.12,1.07,5.97,2.01c7.72,3.91,15.37,7.98,23.04,11.99
	c6.72,4.83,13.54,9.53,20.14,14.51c6.34,4.79,12.68,9.62,18.59,14.91c3.83,3.43,6.89,7.73,10.3,11.64
	C307.77,223.82,302.76,223.04,297.76,222.27z"/>
<path class="st11" d="M239.72,238.48c0.05,0.85,0.11,1.7,0.16,2.56c0.23,1.23,0.04,2.86,0.77,3.63c4.82,5.08,10.33,9.62,12.17,16.85
	c-1.81-0.84-3.63-1.69-6.33-2.94c-1.21,2.57-2.47,5.25-3.73,7.93c-0.32,0.26-0.63,0.53-0.95,0.79c-0.91,0.12-1.81,0.25-2.72,0.37
	c-3.15-1.41-4.53,1.1-6.26,2.83c-0.74-2.3-1.49-4.6-2.23-6.9c2.17-0.76,4.8-1.01,6.38-2.43c1.72-1.55,3.94-4.72,3.38-6.25
	c-2.18-5.95-5.24-11.63-11.61-14.41c-1.29-0.67-2.53-1.52-3.89-1.96c-2.75-0.89-5.55-1.67-8.37-2.28c-3.54-0.77-7.1-1.45-10.68-1.92
	c-3.33-0.44-6.71-0.56-10.06-0.82c-2.89-3.74-5.8-7.46-8.65-11.22c-12.33-16.26-5.9-31.4,6.4-43.31c0.48-0.46,1.45-0.41,2.19-0.6
	c-0.14,1.32-0.27,2.64-0.41,3.97c-0.86,2.38-1.72,4.75-2.58,7.13c-3.43,12.99,1.45,33.46,12.42,40.02c1.09-3.42,2.2-6.88,3.31-10.34
	c0.31,0.09,0.61,0.18,0.92,0.27c0.32,1.53,0.64,3.05,1.02,4.88c1.53-1.24,2.7-2.19,4.44-3.59c0,2.91,0.14,5.06-0.03,7.18
	c-0.25,2.96,1.2,3.86,3.84,3.62c2.72,1.02,5.43,2.03,8.15,3.05c2.29,1.74,4.37,4.02,6.95,5.03
	C235.33,240.2,237.69,238.91,239.72,238.48z"/>
<path class="st12" d="M48.74,368.34c0-4,0.28-8.02-0.1-11.99c-0.22-2.3-1.69-4.44-2.22-6.75c-0.87-3.8-1.43-7.66-2.11-11.5
	c0.59-0.25,1.18-0.49,1.77-0.74c1.45,0.92,2.89,1.84,4.64,2.94c4.93-3.84,10.77-7.01,9.13-15.11c-0.29-1.45,0.32-4.31,1.11-4.56
	c6.57-2.03,5.74-9.32,9.73-13.19c1.7-1.65,2.39-4.62,2.95-7.13c1.32-5.93,2.26-11.95,3.43-17.92c0.11-0.54,0.75-0.98,1.58-1.99
	c0.82,2.37,1.46,4.24,2.1,6.1c-1.16,10.97-2.28,21.94-3.49,32.9c-0.42,3.76-0.52,7.68-1.72,11.2c-1.58,4.63-4.81,8.35-7.81,12.29
	c-3.19,4.19-6.47,7.71-10.43,11.1c-3.68,3.16-2.9,7.93,0.6,9.8C54.86,365.32,51.8,366.83,48.74,368.34z"/>
<path class="st13" d="M119.98,333.62c-6.21-3.66-11.66-7.81-16.32-13.72c-2.62-3.33-4.67-6.57-6.39-10.3
	c-5.08-11.02-2.49-21.75,0.52-33.15c1.75,0.91,2.86,1.49,3.97,2.06c2.34,3.66,4.68,7.31,7.02,10.97c-0.41,1.37-1.59,3.5-1.1,4
	c3.9,4,6.38,8.53,7.05,14.12c0.14,1.18,1.22,2.28,1.96,3.35c4.39,6.33,8.82,12.64,13.23,18.96
	C126.59,331.15,123.29,332.39,119.98,333.62z"/>
<path class="st0" d="M108.77,289.48c-2.34-3.66-4.68-7.31-7.02-10.97c0,0,0.01-0.04,0.01-0.03c1.12,0.64,2.33,1.16,3.34,1.94
	c4.45,3.42,8.4,7.83,13.34,10.21c11.92,5.73,24.16,10.94,37.96,9.99c2.72-0.19,5.49,0.49,8.24,0.76
	c-6.04,7.28-10.41,15.27-11.1,24.96c-0.05,0.75-1.18,1.42-1.81,2.13c-0.28-0.58-0.42-1.34-0.87-1.71
	c-8-6.59-16.23-12.92-24.01-19.76C120.56,301.46,114.78,295.34,108.77,289.48z"/>
<path class="st12" d="M130.74,191.56c5.77-3.04,11.35-1.33,16.75,0.96c12.03,5.09,21.12,13.81,28.18,24.51
	c4.26,6.46,7.45,13.62,11.13,20.46c-1.03,0.7-2.57,1.18-3,2.15c-1.66,3.72-3.01,7.58-4.39,11.42c-1.22,3.4-3.1,4.01-5.82,1.58
	c-0.85-0.76-1.58-1.64-2.36-2.47c-0.14-0.91-0.28-1.82-0.43-2.73c-1.36-2.02-2.72-4.04-4.25-6.31c1.37-0.21,2.64-0.4,4.43-0.68
	c-2.86-3.06-5.25-5.62-7.64-8.19c0.24-0.36,0.48-0.71,0.71-1.07c3.24,1.43,6.47,2.87,9.71,4.3c0.11,0.07,0.22,0.14,0.34,0.2
	c-0.12-0.06-0.25-0.11-0.37-0.17c-2.57-5.13-4.51-10.73-7.86-15.29c-4.44-6.06-9.97-11.31-15.03-16.91
	c-2.26-1.67-4.52-3.35-6.78-5.02C139.62,196.06,135.18,193.81,130.74,191.56z"/>
<path class="st14" d="M249.75,148.52c1.33-0.01,2.67-0.01,4-0.02c0.97,0.61,1.94,1.76,2.9,1.74c4.11-0.06,8.21-0.5,12.32-0.73
	c4.28-0.24,8.56-0.43,12.84-0.58c3.67-0.13,7.34-0.24,11.01-0.24c1.45,0,2.92,0.21,4.33,0.54c3.03,0.73,6.08,1.46,9.03,2.46
	c2.07,0.7,4.02,1.79,5.95,2.83c4.97,2.68,12.62,0.62,14.77,8.3c-1.12,1.89-2.24,3.77-3.36,5.66c-6.01-1.11-11.41-3.32-15.56-8.12
	c-0.86-0.99-2.53-1.35-3.88-1.83c-2.88-1.02-5.73-2.28-8.71-2.82c-3.94-0.71-7.99-0.78-11.99-1.23c-3.58-0.4-7.14-0.95-10.71-1.44
	c-0.33-0.04-0.66-0.22-0.97-0.17c-11.7,1.71-23.4,3.44-35.1,5.19c-0.06,0.01-0.07,0.29-0.16,0.67c2.23,0.69,4.53,1.4,6.82,2.11
	c-0.15,0.55-0.3,1.11-0.45,1.66c-8.23-1.05-16.48-1.97-24.09-6c-0.14-1.5-0.28-3-0.48-5.17c1.68,1.12,2.72,1.82,3.85,2.58
	c0.75-0.89,1.45-1.72,1.75-2.08c1.12,1.18,2.14,3.13,3.14,3.12c2.59-0.02,5.18-0.9,7.76-1.43
	C239.77,151.86,244.76,150.19,249.75,148.52z"/>
<path class="st15" d="M57.91,363.81c-3.51-1.87-4.29-6.64-0.6-9.8c3.95-3.4,7.24-6.91,10.43-11.1c3-3.94,6.23-7.66,7.81-12.29
	c1.2-3.52,1.3-7.44,1.72-11.2c1.21-10.96,2.33-21.93,3.49-32.9c0.48-2.57,0.97-5.14,1.45-7.72c0.54,0,1.08,0.01,1.63,0.01
	c0.31,0.9,0.61,1.81,0.92,2.71c-0.32,9.34-0.64,18.68-0.96,28.02c-0.01,2.99-0.02,5.98-0.03,8.97c-0.67,2.5-1.59,4.96-1.97,7.5
	c-1.31,8.91-2.51,17.83-3.55,26.77c-0.15,1.25,0.39,3.02,1.27,3.86c3.4,3.25,2.19,5.37-1.33,7.19
	C71.42,363.81,64.67,363.81,57.91,363.81z"/>
<path class="st16" d="M130.74,191.56c4.44,2.25,8.88,4.5,13.32,6.75c-0.43,1.35-1.25,2.7-1.21,4.03c0.43,13.49,4.27,26.13,9.86,38.3
	c-10.87-3.4-30.23-21.52-29.24-35.33C123.89,199.35,125.58,194.7,130.74,191.56z"/>
<path class="st7" d="M263.74,183.52c-7.67-4.01-15.32-8.08-23.04-11.99c-1.86-0.94-3.98-1.36-5.97-2.01c0,0,0.02,0.02,0.02,0.02
	c0-0.34,0-0.68,0-1.01c8.37-0.22,15.68,3.39,23.36,5.98c7.83,2.64,16.01,4.38,24.15,5.92c8.27,1.57,16.39,3.37,21.78,10.4
	c2.8,3.65,6.12,3.97,10,3.73c-0.44,5.65-0.89,11.3-1.33,16.96c-4.21-2.73-9.11-4.81-12.49-8.34c-6.27-6.56-12.58-12.47-22.02-13.83
	c-1.17-0.17-2.11-1.57-3.31-2.01C271.21,185.95,267.46,184.77,263.74,183.52z"/>
<path class="st10" d="M326.89,162.84c-2.15-7.69-9.8-5.62-14.77-8.3c-1.93-1.04-3.88-2.13-5.95-2.83c-2.95-1-6-1.73-9.03-2.46
	c-1.41-0.34-2.88-0.54-4.33-0.54c-3.67,0-7.34,0.11-11.01,0.24c-4.28,0.15-8.57,0.34-12.84,0.58c-4.11,0.23-8.21,0.67-12.32,0.73
	c-0.96,0.01-1.93-1.13-2.9-1.74c7.32-1.31,14.6-2.95,21.97-3.85c8.64-1.06,17.36-1.48,26.04-2.18c13.3,0.36,26.6,0.72,39.9,1.08
	c-0.09,1.28,0.33,3-0.34,3.76C336.64,152.59,331.73,157.68,326.89,162.84z"/>
<path class="st16" d="M195.27,182.35c0.14-1.32,0.28-2.64,0.41-3.97c0,0-0.01,0.1-0.01,0.1c0.69-0.79,1.39-1.59,2.08-2.38
	c7.6-3.46,15.69-0.51,18.91,7.38c5.15,12.6,6.54,25.67,3.81,39.08c-1.57-1.02-3.14-2.05-4.71-3.07c-1.36-3.31-2.05-7.15-4.2-9.83
	c-6.34-7.9-10.69-15.86-13.16-25.61C198.21,183.26,196.36,182.9,195.27,182.35z"/>
<path class="st10" d="M83.76,318.5c0.01-2.99,0.02-5.98,0.03-8.97c5.47,1,7.11,3.51,7.99,11.73c0.18,1.69,0.66,3.53,1.58,4.92
	c3.69,5.57,7.61,11,11.45,16.47c-5.68,8.5-11.36,17-17.06,25.48c-0.18,0.27-0.7,0.32-1.06,0.47c0-1.33,0.08-2.67,0-3.99
	C85.72,349.24,84.74,333.87,83.76,318.5z"/>
<path class="st17" d="M160.22,281.92c2.13,3.62,6.37,6.42,4.53,11.59c-8,0.67-16.16,2.8-23.52-2.57c-0.48-0.35-1.28-0.25-1.91-0.42
	c-3.77-1.02-7.58-1.92-11.3-3.13c-4.94-1.61-9.75-3.64-14.72-5.15c-5.4-1.63-11.51-10.62-10.47-15.88
	C119.81,279.52,138.88,284.91,160.22,281.92z"/>
<path class="st8" d="M102.84,266.37c-1.05,5.26,5.07,14.25,10.47,15.88c4.97,1.51,9.78,3.54,14.72,5.15
	c3.71,1.21,7.52,2.11,11.3,3.13c0.63,0.17,1.43,0.07,1.91,0.42c7.36,5.36,15.52,3.24,23.52,2.57c0.67,2,1.33,4,2,6
	c-0.7,0.62-1.4,1.24-2.1,1.87c-2.75-0.28-5.52-0.95-8.24-0.76c-13.8,0.94-26.04-4.26-37.96-9.99c-4.94-2.38-8.89-6.79-13.34-10.21
	c-1.01-0.78-2.22-1.3-3.34-1.94c-1.73-2.87-3.47-5.72-5.18-8.6c-0.65-1.1-1.23-2.26-1.84-3.39c1.7-2.1,3.41-4.2,5.11-6.3
	C100.86,262.25,101.85,264.31,102.84,266.37z"/>
<path class="st15" d="M108.77,289.48c6.01,5.86,11.79,11.99,18.1,17.52c7.79,6.83,16.01,13.17,24.01,19.76
	c0.45,0.37,0.59,1.13,0.87,1.71c-7.28,0.48-14.57,0.97-21.85,1.45c-4.41-6.32-8.83-12.63-13.23-18.96
	c-0.74-1.07-1.82-2.17-1.96-3.35c-0.67-5.6-3.15-10.12-7.05-14.12C107.18,292.98,108.36,290.85,108.77,289.48z"/>
<path class="st18" d="M173.76,235.49c-3.24-1.43-6.47-2.87-9.71-4.3c-0.24,0.36-0.48,0.71-0.71,1.07c2.39,2.57,4.79,5.13,7.64,8.19
	c-1.79,0.28-3.06,0.47-4.43,0.68c1.53,2.27,2.89,4.29,4.25,6.31c-4.68-1.71-9.35-3.43-14.03-5.14c-1.05-4.91-1.78-9.92-3.23-14.71
	c-2.41-7.96-2.99-16.04-2.7-24.25c5.06,5.6,10.59,10.85,15.03,16.91c3.34,4.56,5.29,10.16,7.86,15.29L173.76,235.49z"/>
<path class="st5" d="M44.56,305.42c1.15,7.53,4.35,14.87-1.12,22.48c-2.47,3.44-3.18,8.55-3.57,13c-0.89,10.1-0.12,20.11,4.33,29.5
	c-0.52,0.69-1.03,1.39-1.55,2.08c-5.64-0.99-11.27-1.97-16.91-2.96c0-0.67,0-1.33,0-2c3.11-0.99,5.91-2.28,6.21-6.12
	c0.46-5.86,0.82-11.72,1.43-17.57c0.33-3.16,0.38-6.63,1.78-9.33c2.94-5.69,4.51-11.18,1.46-17.23
	C39.28,313.32,41.92,309.37,44.56,305.42z"/>
<path class="st19" d="M341.66,143.55c-13.3-0.36-26.6-0.72-39.9-1.08c-1.87-7.01-1.06-7.4,5.78-10.26
	c7.35-3.08,14.85-2.44,22.36-2.83c0,0-0.11,0-0.11,0c0.37,0.4,0.74,0.8,1.11,1.2C334.49,134.9,338.07,139.23,341.66,143.55z"/>
<path class="st18" d="M215.77,219.48c1.57,1.02,3.14,2.05,4.71,3.07c-0.05,0.67-0.1,1.34-0.15,2.01c-0.17,0.34-0.35,0.69-0.53,1.04
	c-0.39,1.97-0.79,3.94-1.18,5.9c-2.64,0.24-4.09-0.65-3.84-3.62c0.18-2.12,0.03-4.27,0.03-7.18c-1.74,1.41-2.9,2.35-4.44,3.59
	c-0.38-1.83-0.7-3.36-1.02-4.88c-0.31-0.09-0.61-0.18-0.92-0.27c-1.11,3.46-2.22,6.92-3.31,10.34
	c-10.97-6.56-15.85-27.03-12.42-40.02c3.89,3.31,5.49,7.86,7.12,12.5c0.98,2.78,2.38,5.53,4.11,7.91c1.72,2.36,3.95,4.42,6.22,6.3
	C211.8,217.55,213.88,218.4,215.77,219.48z"/>
<path class="st6" d="M195.75,233.51c3.36,0.26,6.73,0.38,10.06,0.82c3.58,0.47,7.15,1.16,10.68,1.92c2.83,0.61,5.62,1.39,8.37,2.28
	c1.37,0.44,2.6,1.29,3.89,1.96c0.24,1.73,0.48,3.47,0.72,5.2c-4-3.55-7.93-7.19-13.79-7.19c-4.7,0-7.33,3.23-5.89,7.26
	c1.98,3.97,3.96,7.93,5.94,11.9c-0.55,1.06-1.11,2.12-1.65,3.19c-1.61,3.19-3.21,6.37-4.81,9.56c-1.23-0.27-2.46-0.54-3.76-0.83
	c0.52-1.27,0.88-2.14,1.24-3.02c1.1-2.83,3.22-5.71,3.1-8.49c-0.42-9.47-12.56-22-24.03-15.25c0.97-2.04,1.95-4.08,2.92-6.12
	C191.09,235.66,193.42,234.58,195.75,233.51z"/>
<path class="st19" d="M263.74,183.52c3.72,1.25,7.48,2.43,11.16,3.8c1.19,0.44,2.13,1.84,3.31,2.01
	c9.44,1.36,15.74,7.28,22.02,13.83c3.38,3.53,8.27,5.61,12.49,8.34c0.82,4.45,1.64,8.91,2.54,13.79c-0.9-0.26-1.69-0.48-2.48-0.71
	c-3.41-3.91-6.47-8.21-10.3-11.64c-5.91-5.29-12.25-10.12-18.59-14.91C277.28,193.05,270.46,188.35,263.74,183.52z"/>
<path class="st18" d="M283.96,312.8c-1.04,2.41-1.33,4.4,2.19,3.74c1.06,7.26-4.8,9.25-8.74,12.19c-5.15,3.84-8.9,8.08-9.8,14.71
	c-0.24,1.78-2.22,3.32-3.4,4.97c-1.44-1.32-2.89-2.63-4.33-3.95c1.77-5.27,2.76-11,5.5-15.71
	C269.6,321.5,275.15,315.06,283.96,312.8z"/>
<path class="st5" d="M104.81,342.66c-3.83-5.48-7.75-10.9-11.45-16.47c-0.92-1.39-1.4-3.23-1.58-4.92
	c-0.89-8.22-2.53-10.73-7.99-11.73c0.32-9.34,0.64-18.68,0.96-28.02c0.99,1.1,2.71,2.13,2.82,3.31c0.37,3.89,0.24,7.83,0.15,11.75
	c-0.11,4.53,1.08,8.04,3.88,12.12c3.01,4.39,6.8,8.9,7.66,15.14c0.48,3.48,5.39,6.29,8.15,9.53c1.3,1.52,2.23,3.35,3.33,5.04
	C108.77,339.82,106.79,341.24,104.81,342.66z"/>
<path class="st15" d="M176.23,359.47c4.13,1.34,8.26,2.68,12.39,4.02c0.35,2.68,0.7,5.35,1.04,8.03
	c-7.81,0.6-11.72,5.52-10.07,12.98c0.83,3.77,2.05,7.45,3.09,11.16c-1,0.46-2.01,0.92-2.85,1.3c-2.46-8.56-4.98-16.98-7.27-25.46
	C171.3,366.84,171.37,362.37,176.23,359.47z"/>
<path class="st2" d="M188.76,236.73c-0.97,2.04-1.95,4.08-2.92,6.12c-5.17,6.09-2.47,12.12,0.11,18.16c0.6,0.83,1.2,1.67,1.8,2.5
	l0,0c0.21,2.8-1.25,2.47-3.37,2.21c-4.01-0.48-8.23-0.82-10.67,3.64l-0.11,0.12c-0.61,0.01-1.23,0.02-1.84,0.03
	c0.35-2.04,0.71-4.08,1.15-6.59c-4.87-0.51-5.6-4.81-5.27-9.76c1.19-1,2.39-1.99,3.58-2.99c0.78,0.83,1.51,1.71,2.36,2.47
	c2.72,2.43,4.61,1.82,5.82-1.58c1.37-3.84,2.73-7.7,4.39-11.42c0.43-0.97,1.97-1.45,3-2.15
	C187.45,237.23,188.11,236.98,188.76,236.73z"/>
<path class="st14" d="M36.63,317.27c3.04,6.05,1.48,11.54-1.46,17.23c-1.4,2.7-1.45,6.17-1.78,9.33
	c-0.61,5.84-0.97,11.71-1.43,17.57c-0.3,3.84-3.1,5.14-6.21,6.12c0.52-4.38,1.04-8.77,1.53-13.15c0.09-0.79,0.37-1.89-0.02-2.35
	c-3.28-3.88-0.42-7.21,1.55-9.75c3.41-4.39,3.42-8.29,0.54-12.64C31.78,325.5,34.2,321.38,36.63,317.27z"/>
<path class="st20" d="M150.85,203.33c-0.29,8.22,0.3,16.29,2.7,24.25c1.45,4.79,2.18,9.8,3.23,14.71c-1.36-0.55-2.71-1.1-4.07-1.65
	c-5.59-12.18-9.43-24.81-9.86-38.3c-0.04-1.33,0.78-2.69,1.21-4.03C146.33,199.98,148.59,201.65,150.85,203.33z"/>
<path class="st13" d="M283.96,312.8c-8.82,2.26-14.36,8.7-18.59,15.96c-2.74,4.71-3.73,10.44-5.5,15.71
	c-2.44-2.79-4.88-5.59-7.32-8.38c1.67-0.87,3.33-1.73,5.92-3.08c0.02-0.24,0.14-1.62,0.26-3c0.68-1.98,1.41-3.94,2.04-5.94
	c3.25-10.23,12.98-15.48,22.96-12.39c0.11,0.31,0.22,0.63,0.34,0.94L283.96,312.8z"/>
<path class="st14" d="M182.68,395.67c-1.04-3.72-2.26-7.4-3.09-11.16c-1.64-7.46,2.27-12.39,10.07-12.98
	c2.8,6.66,3.02,13.53,1.02,20.35C189.57,395.72,187.16,398.22,182.68,395.67z"/>
<path class="st19" d="M234.78,153.52c-2.59,0.54-5.17,1.42-7.76,1.43c-1,0.01-2.02-1.94-3.14-3.12c-0.3,0.36-1,1.19-1.75,2.08
	c-1.13-0.75-2.17-1.45-3.85-2.58c0.2,2.17,0.34,3.67,0.48,5.17c1,2,1.99,4,2.99,6.01c-6.88-2.95-9.37-9.84-5.99-16.15
	c0.91-1.69,1.35-3.63,2-5.46c1.32,0.37,2.64,0.74,3.96,1.11c1.65,0.46,3.31,0.91,4.96,1.36c0.86,0.82,1.58,1.95,2.6,2.4
	C232.72,147.29,234.68,149.7,234.78,153.52z"/>
<path class="st8" d="M88.7,271.49c-6.05,0.08-3.12-6.04-6.49-8.94c-0.3,3.75-0.55,6.99-0.81,10.23c-0.5,0.14-1,0.28-1.5,0.42
	c-0.93-3.12-1.86-6.24-2.78-9.36c-0.21-0.06-0.42-0.11-0.62-0.17c-0.14,3.04-0.28,6.07-0.44,9.65c-1.11-0.29-2.25-0.58-3.4-0.88
	c-1.63-8.94,1.25-13.87,9.48-17.12c4.87-1.92,8.31,0.08,11.56,3.28c-0.94,0.64-1.89,1.28-2.83,1.92c-1.01-0.17-2.46-0.86-2.94-0.44
	c-2.13,1.88-1.54,7.11,0.84,9.4l0.01,0C88.74,270.16,88.72,270.83,88.7,271.49z"/>
<path class="st19" d="M83.76,318.5c0.98,15.37,1.96,30.75,2.92,46.12c0.08,1.33,0.01,2.66,0,3.99c-2.83-1.6-5.67-3.2-8.5-4.8
	c3.52-1.82,4.73-3.93,1.33-7.18c-0.88-0.84-1.42-2.61-1.27-3.86c1.05-8.94,2.24-17.87,3.55-26.77
	C82.17,323.45,83.09,320.99,83.76,318.5z"/>
<path class="st14" d="M25.75,369.51c5.64,0.99,11.27,1.97,16.91,2.96c-2.69,2.67-5.38,5.34-8.06,8.01
	C31.65,376.82,28.7,373.17,25.75,369.51z"/>
<path class="st13" d="M212.92,142.22c-0.75,3.28-1.5,6.55-2.25,9.83c-4.87-6.17-5.07-14.04,0-18.94
	C211.47,136.34,212.19,139.28,212.92,142.22z"/>
<path class="st2" d="M242.76,266.49c1.26-2.68,2.52-5.36,3.73-7.93c2.7,1.25,4.51,2.1,6.33,2.94c0,0,0.17,0.21,0.17,0.21
	s-0.1,0.25-0.1,0.25c0.25,0.51,0.5,1.02,0.75,1.53c2.9,3.06-2.79,2.79-1.96,5.05c-0.97,0.32-1.95,0.64-2.92,0.96c0,0,0,0,0,0
	C248.2,265.61,245.14,266.74,242.76,266.49z"/>
<path class="st17" d="M90.86,260.53c0.94-0.64,1.89-1.28,2.83-1.92c2.06,0.53,4.11,1.05,6.17,1.57c-1.7,2.1-3.41,4.2-5.11,6.3
	c-1.34,1-2.68,1.99-4.02,2.99c-0.66,0.01-1.31,0.02-1.97,0.02c0,0-0.01,0-0.01,0C87.02,265.94,88.59,263.15,90.86,260.53z"/>
<path class="st2" d="M254.65,273.54c1.39,4.71,2.77,9.42,4.17,14.16c-2.33,0.97-3.53,1.47-4.73,1.97c0.08-3.13,0.33-6.27,0.16-9.38
	c-0.07-1.28-1.04-2.51-1.6-3.77c-0.31-1-0.61-2-0.92-2.99C252.71,273.52,253.68,273.53,254.65,273.54z"/>
<path class="st6" d="M252.66,276.51c0.56,1.25,1.53,2.49,1.6,3.77c0.17,3.12-0.08,6.25-0.16,9.38c-0.22,1.61-0.43,3.23-0.65,4.84
	c-1.56,0.34-3.12,0.68-4.67,1.03c-0.16-0.15-0.32-0.31-0.48-0.46C249.75,288.88,251.2,282.7,252.66,276.51z"/>
<path class="st1" d="M318.52,64.47c-1.48-1.44-2.97-2.87-4.45-4.31c2.08-0.82,4.17-1.64,6.25-2.46
	C319.72,59.96,319.12,62.22,318.52,64.47z"/>
<path class="st6" d="M254.65,273.54c-0.97-0.01-1.94-0.01-2.91-0.02c-0.99-1.34-1.99-2.68-2.98-4.01c0.97-0.32,1.95-0.64,2.92-0.96
	C252.67,270.2,253.66,271.87,254.65,273.54z"/>
<path class="st0" d="M228.45,113.37c0.1,1.05,0.19,2.1,0.29,3.15c-0.34,0-0.68,0-1.01,0C227.97,115.46,228.21,114.42,228.45,113.37z
	"/>
<path class="st11" d="M197.75,176.1c-0.69,0.79-1.39,1.59-2.08,2.38C196.37,177.68,197.06,176.89,197.75,176.1z"/>
<path class="st16" d="M219.8,225.6c0.18-0.35,0.35-0.69,0.53-1.04C220.15,224.91,219.97,225.26,219.8,225.6z"/>
<path class="st18" d="M284.06,312.64c-0.11-0.31-0.22-0.63-0.34-0.94C283.83,312.01,283.95,312.33,284.06,312.64z"/>
<path class="st7" d="M330.9,130.58c-0.37-0.4-0.74-0.8-1.11-1.2C330.16,129.78,330.53,130.18,330.9,130.58z"/>
<path class="st1" d="M227.73,116.51c0.34,0,0.68,0,1.01,0c-0.41,0.34-0.82,0.69-1.23,1.03C227.59,117.2,227.66,116.86,227.73,116.51
	z"/>
<path class="st11" d="M253.64,263.49c-0.25-0.51-0.5-1.02-0.75-1.53C253.14,262.47,253.39,262.98,253.64,263.49z"/>
<path class="st12" d="M46.78,369.34c0.44-0.24,0.87-0.48,1.31-0.72C47.65,368.85,47.21,369.1,46.78,369.34z"/>
<path class="st13" d="M171.76,302.52c1.34,1.33,2.67,2.65,4.01,3.98c-0.36,0.95-0.91,1.88-1.05,2.86c-0.23,1.63,0.32,3.59-0.39,4.9
	c-2.4,4.37-2.27,4.81,2.93,5.16c0,3.88,4.84,10.71,8.03,11.82c2.98,1.03,5.8,2.53,8.75,3.66c1.03,0.4,2.25,0.52,3.37,0.45
	c3.45-0.2,6.9-0.55,10.35-0.85c-0.11,1.1-0.21,2.21-0.4,4.15c-4.62-2.94-5.71-0.01-6.1,2.85c-2.67,2.06-5.7-6.42-7.49,1.01
	c-3,0-6,0-9,0c-0.67,0-1.33,0.01-2,0.01c-1.45-2.63-2.27-6.36-4.49-7.64c-3.83-2.2-4.82-4.81-4.63-8.77
	c0.06-1.27-1.09-2.6-1.69-3.89c-0.73-1.57-1.47-3.14-2.2-4.71c-1.15-1.01-2.29-2.02-4.11-3.62
	C167.53,310.36,169.65,306.44,171.76,302.52z"/>
<path class="st4" d="M237.73,314.54c3.39,0.47,7.44-3.34,7.88-8.19c0.27-2.97,1.25-4.17,4.13-3.84c3.61,3.32,2.35,7.27,0.48,10.47
	c-2.88,4.93-6.6,9.37-9.97,14.01c-1.22,1.68-2.11,4.17-3.75,4.84c-2.43,1-5.39,0.73-8.13,0.97c-1.44,0.13-2.88,0.18-4.32,0.27
	c0.02,0.49,0.04,0.97,0.07,1.46c1.1,0.84,2.2,1.68,3.73,2.84c-1.67,0.87-2.89,1.51-4.12,2.14c-2-1-4-2-6-3c1.33-3,2.66-6,4-9
	c5-0.09,8.87-5.99,14.67-2.71C236.86,321.32,237.3,317.93,237.73,314.54z"/>
<path class="st1" d="M169.74,317.5c0.73,1.57,1.47,3.14,2.2,4.71c0.6,1.3,1.75,2.62,1.69,3.89c-0.19,3.96,0.8,6.57,4.63,8.77
	c2.23,1.28,3.04,5.01,4.49,7.64c-0.63,1.95-1.26,3.9-1.86,5.75c-5.06-4.93-9.51-9.05-13.65-13.46c-0.88-0.94-0.8-2.91-0.92-4.42
	c-0.22-2.96-0.02-5.98-0.45-8.9C165.39,318.17,166.83,317.25,169.74,317.5z"/>
<path class="st4" d="M193.75,342.51c1.8-7.43,4.82,1.05,7.49-1.01c0.4-2.86,1.48-5.78,6.1-2.85c0.19-1.94,0.29-3.04,0.4-4.15
	c1-0.67,2-1.34,3-2c2,2,4,4,6,6.01c-1,2.33-2,4.67-3,7c-1.33,0.33-2.67,0.67-4,1C204.42,345.18,199.08,343.84,193.75,342.51z"/>
<path class="st1" d="M193.75,342.51c5.33,1.33,10.67,2.67,16,4c-0.63,0.66-1.17,1.78-1.89,1.9c-7.06,1.19-14.18,1.96-20.67-2.03
	c-1.16-0.72-1.64-2.55-2.44-3.86C187.75,342.51,190.75,342.51,193.75,342.51z"/>
<path class="st1" d="M213.75,345.51c1-2.33,2-4.67,3-7c0.33-0.67,0.67-1.33,1-2c2,1,4,2,6,3c-0.1,0.97,0.06,2.63-0.36,2.79
	C220.24,343.54,216.98,344.48,213.75,345.51z"/>
<path class="st0" d="M88.76,269.5c0.66-0.01,1.31-0.02,1.97-0.02c0.93,1.37,1.87,2.74,2.8,4.11c-0.24,0.23-0.48,0.46-0.73,0.7
	c-1.37-0.93-2.74-1.86-4.11-2.79C88.72,270.83,88.74,270.16,88.76,269.5z"/>
<path class="st14" d="M246.36,162.04c0.9,0,1.8,0,2.7,0c0.01,0.28,0.02,0.55,0.02,0.83c-0.9,0-1.81,0-2.71,0
	C246.37,162.59,246.36,162.31,246.36,162.04z"/>
<path class="st19" d="M227.76,166.5c-1-0.66-2.01-1.33-3.01-1.99C225.75,165.17,226.76,165.84,227.76,166.5z"/>
<path class="st19" d="M232.72,168.52c-0.99-0.67-1.98-1.33-2.97-2C230.74,167.19,231.73,167.86,232.72,168.52z"/>
<path class="st19" d="M224.75,164.51c-0.67-0.66-1.34-1.32-2.01-1.98C223.41,163.19,224.08,163.85,224.75,164.51z"/>
<path class="st10" d="M234.74,168.52c0,0.34,0,0.68,0,1.01c-0.35-0.34-0.7-0.68-1.05-1.02
	C234.04,168.52,234.39,168.52,234.74,168.52z"/>
<path class="st21" d="M248.76,269.5c0.99,1.34,1.99,2.68,2.98,4.01c0.31,1,0.61,2,0.92,2.99c-1.46,6.19-2.91,12.37-4.37,18.56
	c-8.28,8.62-18.3,13.18-30.35,13.04c0.15-0.63,0.64-1.43,0.41-1.86c-3.49-6.75-8.87-11.72-16.14-13.59
	c-5.97-1.54-12.33-1.57-18.51-2.26c0.86-4.44,4.13-5.58,8.04-5.86c0.81,0.02,1.62,0.05,2.43,0.07c3.64,0.07,7.72-0.9,10.82,0.42
	c7.8,3.34,14.74,0.05,21.83-1.71c3.25-0.81,6.12-2.12,9.17,0.13c6-3.27,6.5-9.54,8.26-15.12
	C245.75,268.72,247.25,269.11,248.76,269.5L248.76,269.5z"/>
<path class="st15" d="M210.75,332.5c-1,0.67-2,1.34-3,2c-3.45,0.29-6.89,0.64-10.35,0.85c-1.12,0.07-2.33-0.05-3.37-0.45
	c-2.95-1.14-5.76-2.64-8.75-3.66c-3.19-1.1-8.03-7.93-8.03-11.82c-5.19-0.36-5.32-0.79-2.93-5.16c0.72-1.31,0.16-3.27,0.39-4.9
	c0.14-0.98,0.68-1.91,1.05-2.86c2.9,1.34,4.21,6,9.02,3.81c0.95-0.43,3.53,2.55,5.28,4.05c1.61,1.38,3.13,2.87,5,4.59
	c1.34-1.56,2.37-2.75,3.72-4.31c1.63,0.75,3.39,1.56,5.14,2.38c0.45,0.21,0.88,0.66,1.32,0.68c5.74,0.13,11.48,0.19,17.22,0.31
	c1.44,0.03,2.89,0.15,4.32,0.36c4.33,0.64,8.01-0.49,10.94-3.82c-0.44,3.39-0.87,6.79-1.32,10.26c-5.8-3.28-9.67,2.62-14.67,2.71
	c-4.8-2.43-8.1-1.08-10,3.92C211.59,331.85,211.09,332.15,210.75,332.5z"/>
<path class="st22" d="M183.71,290.4c6.18,0.7,12.54,0.73,18.51,2.26c7.26,1.87,12.65,6.84,16.14,13.59
	c0.22,0.43-0.26,1.23-0.41,1.86c-14.19-0.06-28.28-0.47-39.18-11.63c-0.6-0.78-1.2-1.56-1.8-2.34c-0.3-0.89-0.59-1.78-0.89-2.68
	C178.62,291.1,181.16,290.75,183.71,290.4z"/>
<path class="st23" d="M183.71,290.4c-2.55,0.35-5.09,0.71-7.64,1.06c-0.18,0.05-0.36,0.1-0.54,0.14c-0.56-0.75-1.12-1.5-1.68-2.25
	c-0.56-1.27-1.12-2.55-1.67-3.82c-0.19-0.65-0.38-1.31-0.56-1.96c-0.12-1.01-0.23-2.02-0.35-3.02c0.03-2.02,0.05-4.04,0.07-6.06
	c0.12-0.67,0.24-1.35,0.36-2.02c0.64-0.99,1.27-1.99,1.91-2.98c0,0,0.11-0.12,0.11-0.12c4.31-0.3,8.62-0.6,12.93-0.91
	c1.7,5.36,3.4,10.72,5.1,16.08C187.84,284.81,184.57,285.95,183.71,290.4z"/>
<path class="st24" d="M171.34,274.48c-0.02,2.02-0.05,4.04-0.07,6.06C169,278.49,168.92,276.47,171.34,274.48z"/>
<path class="st24" d="M173.61,269.48c-0.64,0.99-1.27,1.99-1.91,2.98c0.02-0.98,0.05-1.97,0.07-2.95
	C172.39,269.5,173,269.49,173.61,269.48z"/>
<path class="st24" d="M171.62,283.57c0.19,0.65,0.38,1.31,0.56,1.96C171.99,284.87,171.8,284.22,171.62,283.57z"/>
<path class="st24" d="M176.96,294.13c0.6,0.78,1.2,1.56,1.8,2.34C178.17,295.69,177.56,294.91,176.96,294.13z"/>
<path class="st24" d="M173.85,289.35c0.56,0.75,1.12,1.5,1.68,2.25C174.97,290.85,174.41,290.1,173.85,289.35z"/>
<path class="st25" d="M209.28,270.42c1.6-3.19,3.21-6.38,4.81-9.56c0.54-1.07,1.1-2.13,1.65-3.19c2.05,0.7,4.11,1.4,6.16,2.1
	c2.29,0.64,4.59,1.29,6.88,1.93c-0.01,0.61-0.01,1.22-0.02,1.83c-1.57,0.53-4.17,0.72-4.48,1.66c-0.5,1.55,0.48,3.58,0.84,5.4
	c0.77-0.01,1.53-0.01,2.3-0.02c0.44-2.36,0.87-4.72,1.31-7.09c0.62,0.03,1.25,0.07,1.87,0.1c0.74,2.3,1.49,4.6,2.23,6.9
	c-0.13,0.55-0.25,1.09-0.38,1.64c-4.45,1.07-8.98,1.93-13.35,3.27C213.12,277.25,211.41,276.53,209.28,270.42z M216.78,263.47
	c-1.01,2.03-2.07,3.32-1.79,3.76c1.16,1.85,2.72,3.44,4.14,5.13c0.75-0.7,2.25-1.81,2.13-2.04
	C220.13,268.26,218.73,266.35,216.78,263.47z"/>
<path class="st20" d="M215.77,219.48c-1.89-1.08-3.97-1.93-5.62-3.3c-2.27-1.87-4.5-3.93-6.22-6.3c-1.73-2.38-3.13-5.13-4.11-7.91
	c-1.63-4.64-3.23-9.19-7.12-12.5c0.86-2.38,1.72-4.75,2.58-7.13c1.08,0.55,2.93,0.92,3.13,1.7c2.47,9.76,6.82,17.71,13.16,25.61
	C213.71,212.33,214.41,216.17,215.77,219.48z"/>
<path class="st2" d="M228.77,263.53c0.01-0.61,0.01-1.22,0.02-1.83c5.54-2.61,6.11-6.82,1.95-14.32c-0.39-0.6-0.78-1.2-1.18-1.81
	l-0.08,0.13c-0.24-1.73-0.48-3.47-0.72-5.2c6.36,2.78,9.42,8.47,11.61,14.41c0.56,1.52-1.66,4.7-3.38,6.25
	c-1.58,1.42-4.21,1.67-6.38,2.43c-0.62-0.03-1.25-0.07-1.87-0.1L228.77,263.53z"/>
<path class="st26" d="M244.25,268.32c-1.75,5.59-2.25,11.86-8.26,15.12c0.16-1.34,0.31-2.69,0.47-4.03
	c-0.19-1.05-0.38-2.09-0.57-3.14c-0.4-1.33-0.79-2.66-1.19-3.98c1.47-1.55,2.93-3.09,4.4-4.64c0.91-0.12,1.81-0.25,2.72-0.37
	C242.62,267.63,243.43,267.98,244.25,268.32z"/>
<path class="st24" d="M239.09,267.66c-1.47,1.55-2.93,3.09-4.4,4.64c-0.63,0.09-1.27,0.18-1.9,0.27c-0.12-0.14-0.23-0.29-0.34-0.44
	c0.13-0.55,0.25-1.09,0.38-1.64C234.56,268.75,235.94,266.24,239.09,267.66z"/>
<path class="st6" d="M244.25,268.32c-0.81-0.35-1.62-0.69-2.43-1.04c0.32-0.26,0.63-0.53,0.95-0.79c2.38,0.25,5.44-0.88,5.99,3.01
	C247.25,269.11,245.75,268.72,244.25,268.32z"/>
<path class="st18" d="M173.73,235.53c0.12,0.06,0.25,0.11,0.37,0.17c-0.11-0.07-0.23-0.14-0.34-0.2
	C173.76,235.49,173.73,235.53,173.73,235.53z"/>
<path class="st27" d="M221.91,259.77c-2.05-0.7-4.11-1.4-6.16-2.1c-1.98-3.96-3.96-7.93-5.94-11.89c4.63-5.49,8.55-5.76,14.73-1.04
	c-0.52,1.03-1.03,2.06-1.55,3.08c0.45-0.26,0.9-0.53,1.35-0.79c1.91,1.75,4.72,3.2,5.43,5.35c0.54,1.62-1.19,4.52-2.69,6.11
	C226.05,259.57,223.68,259.38,221.91,259.77z"/>
<path class="st28" d="M185.95,261.01c-2.58-6.04-5.28-12.08-0.11-18.16c11.47-6.75,23.61,5.78,24.03,15.25
	c0.12,2.78-2.01,5.66-3.1,8.49c-0.64-0.02-1.29-0.04-1.93-0.06c4.26-7.68,3.37-9.64-5.7-11.72c1.57-1.4,2.97-2.64,5.43-4.83
	c-4.17-1.69-7.46-3.72-11-4.3c-4.97-0.82-8.44,3.39-7.74,8.44c1.12,8.15,7.55,14.05,15.82,14.52c-1.74,0.3-3.86,1.39-5.14,0.76
	c-3.12-1.54-5.86-3.87-8.75-5.88c0,0,0,0,0,0C187.15,262.67,186.55,261.84,185.95,261.01z"/>
<path class="st24" d="M187.75,263.51c2.89,2.01,5.63,4.34,8.75,5.88c1.28,0.63,3.4-0.45,5.14-0.76c1.06-0.7,2.13-1.4,3.19-2.1
	c0.64,0.02,1.29,0.04,1.93,0.06c-0.36,0.88-0.72,1.75-1.24,3.02c1.3,0.29,2.54,0.56,3.76,0.83c2.12,6.11,3.83,6.83,9.82,4.98
	c4.37-1.35,8.89-2.2,13.35-3.27c0.11,0.15,0.22,0.29,0.34,0.44c-5.94,7.31-12.38,9.46-21.04,6.7c-4.38-1.4-8.62-3.23-12.92-4.87
	c-4.06-1.98-8.12-3.96-12.18-5.95c-4.31,0.3-8.62,0.61-12.93,0.91c2.44-4.46,6.66-4.12,10.67-3.64
	C186.5,265.97,187.96,266.31,187.75,263.51z"/>
<path class="st28" d="M221.91,259.77c1.77-0.38,4.14-0.19,5.17-1.28c1.5-1.59,3.23-4.49,2.69-6.11c-0.72-2.15-3.52-3.6-5.43-5.35
	c-0.45,0.26-0.9,0.53-1.35,0.79c0.51-1.02,1.03-2.05,1.55-3.08c-6.18-4.72-10.1-4.45-14.73,1.04c-1.45-4.03,1.19-7.26,5.89-7.26
	c5.86,0,9.79,3.64,13.79,7.19c0,0,0.08-0.13,0.08-0.13c0.39,0.6,0.78,1.2,1.18,1.81c4.16,7.5,3.59,11.71-1.95,14.32
	C226.5,261.05,224.2,260.41,221.91,259.77z"/>
<path class="st24" d="M185.95,261.01c0.6,0.83,1.2,1.67,1.8,2.5C187.15,262.67,186.55,261.84,185.95,261.01z"/>
<path class="st0" d="M90.86,260.53c-2.27,2.62-3.84,5.4-2.11,8.96c-2.37-2.29-2.97-7.52-0.84-9.4
	C88.4,259.67,89.86,260.36,90.86,260.53z"/>
<path class="st13" d="M210.75,332.5c0.34-0.35,0.84-0.65,1-1.07c1.9-5.01,5.2-6.35,10-3.92c-1.33,3-2.66,6-4,9
	c-0.33,0.67-0.67,1.33-1,2C214.75,336.51,212.75,334.51,210.75,332.5z"/>
<path class="st23" d="M198.83,274.4c4.3,1.64,8.54,3.47,12.92,4.87c8.67,2.76,15.1,0.61,21.04-6.7c0.63-0.09,1.27-0.18,1.9-0.27
	c0.4,1.33,0.79,2.65,1.19,3.98c0.19,1.05,0.38,2.09,0.57,3.13c-0.16,1.34-0.31,2.69-0.47,4.03c-3.05-2.25-5.91-0.94-9.16-0.13
	c-7.09,1.76-14.03,5.04-21.83,1.71c-3.1-1.33-7.19-0.35-10.82-0.42C195.73,281.2,197.28,277.8,198.83,274.4z"/>
<path class="st26" d="M198.83,274.4c-1.55,3.4-3.1,6.8-4.65,10.2c-0.81-0.02-1.62-0.05-2.43-0.07c-1.7-5.36-3.4-10.72-5.1-16.08
	C190.71,270.43,194.77,272.42,198.83,274.4z"/>
<path class="st14" d="M216.78,263.47c1.95,2.88,3.35,4.79,4.47,6.86c0.12,0.23-1.38,1.34-2.13,2.04c-1.41-1.69-2.98-3.28-4.14-5.13
	C214.72,266.78,215.78,265.5,216.78,263.47z"/>
<path class="st14" d="M228.73,263.49c-0.44,2.36-0.87,4.72-1.31,7.09c-0.77,0.01-1.53,0.01-2.3,0.02c-0.36-1.83-1.34-3.86-0.84-5.4
	c0.31-0.94,2.91-1.13,4.48-1.66C228.77,263.53,228.73,263.49,228.73,263.49z"/>
<path class="st6" d="M230.74,247.38c-0.39-0.6-0.78-1.2-1.18-1.81C229.95,246.18,230.35,246.78,230.74,247.38z"/>
<path class="st21" d="M236.46,279.42c-0.19-1.04-0.38-2.09-0.57-3.13C236.08,277.33,236.27,278.37,236.46,279.42z"/>
<path class="st27" d="M204.83,266.52c-1.06,0.7-2.12,1.4-3.19,2.1c-8.27-0.47-14.7-6.38-15.82-14.52c-0.69-5.05,2.78-9.25,7.74-8.44
	c3.53,0.58,6.83,2.61,11,4.3c-2.46,2.19-3.86,3.43-5.43,4.83C208.21,256.88,209.09,258.84,204.83,266.52z"/>
</svg>
