<?xml version="1.0" encoding="utf-8"?>
<!-- Generator: Adobe Illustrator 24.0.1, SVG Export Plug-In . SVG Version: 6.00 Build 0)  -->
<svg version="1.1" id="Слой_1" xmlns="http://www.w3.org/2000/svg" xmlns:xlink="http://www.w3.org/1999/xlink" x="0px" y="0px"
	 viewBox="0 0 40.8 40" style="enable-background:new 0 0 40.8 40;" xml:space="preserve">
<style type="text/css">
	.st0{fill-rule:evenodd;clip-rule:evenodd;fill:#18CFAB;}
	.st1{fill:#FFFFFF;}
</style>
<path class="st0" d="M20.4,0c11.3,0,20.4,9,20.4,20c0,11-9.1,20-20.4,20C9.1,40,0,31,0,20C0,9,9.1,0,20.4,0z"/>
<rect x="14.4" y="14.5" class="st1" width="12" height="11"/>
</svg>
