<?xml version="1.0" encoding="utf-8"?>
<!-- Generator: Adobe Illustrator 24.0.1, SVG Export Plug-In . SVG Version: 6.00 Build 0)  -->
<svg version="1.1" id="Слой_1" xmlns="http://www.w3.org/2000/svg" xmlns:xlink="http://www.w3.org/1999/xlink" x="0px" y="0px"
	 viewBox="0 0 99 76" style="enable-background:new 0 0 99 76;" xml:space="preserve">
<style type="text/css">
	.st0{fill-rule:evenodd;clip-rule:evenodd;fill:#FFFFFF;}
</style>
<path class="st0" d="M81.4,5.4H19.2v11.2h-5.5V0h73.1v30.1h-5.5V5.4z M38.8,76H0V19h38.8V76z M18.3,71.3c0,1,0.8,1.8,1.9,1.8
	c1,0,1.9-0.8,1.9-1.8c0-1-0.8-1.8-1.9-1.8C19.2,69.5,18.3,70.3,18.3,71.3z M33.2,24.5H5.6v42.1h27.6L33.2,24.5z M41.3,41.9h28.8v5.4
	H41.3V41.9z M72.9,75.1V32.2H99v42.9H72.9z M87.2,34.6c0-0.3-0.3-0.6-0.6-0.6c-0.3,0-0.6,0.3-0.6,0.6c0,0.3,0.3,0.6,0.6,0.6
	C86.9,35.2,87.2,34.9,87.2,34.6z M90.3,36h-7.5v0.6h7.5V36z M84.8,71.8c0,0.8,0.7,1.5,1.5,1.5c0.8,0,1.5-0.7,1.5-1.5
	c0-0.8-0.7-1.5-1.5-1.5C85.5,70.3,84.8,71,84.8,71.8z M77.1,68.2c3.4,0,10.9,0,17.7,0V38.7l-17.7,0V68.2z M41.3,49.4h7.9h2.1h18.8
	v7.6H41.3v-2.9h19.3v-1.4H41.3V49.4z"/>
</svg>
