<?xml version="1.0" encoding="utf-8"?>
<!-- Generator: Adobe Illustrator 24.0.1, SVG Export Plug-In . SVG Version: 6.00 Build 0)  -->
<svg version="1.1" id="Слой_1" xmlns="http://www.w3.org/2000/svg" xmlns:xlink="http://www.w3.org/1999/xlink" x="0px" y="0px"
	 viewBox="0 0 464.76 420.48" style="enable-background:new 0 0 464.76 420.48;" xml:space="preserve">
<style type="text/css">
	.st0{fill:#ADC5B7;}
	.st1{fill:#A9C2B4;}
	.st2{fill:#ACC5B7;}
	.st3{fill:#AAC3B5;}
	.st4{fill:#A4BEAF;}
	.st5{fill:#779885;}
	.st6{fill:#7C9B89;}
	.st7{fill:#98B4A4;}
	.st8{fill:#02BBBB;}
	.st9{fill:#9FB9AA;}
	.st10{fill:#5E7567;}
	.st11{fill:#01AEAE;}
	.st12{fill:#4C735D;}
	.st13{fill:#026F6F;}
	.st14{fill:#6A8E79;}
	.st15{fill:#16281D;}
	.st16{fill:#91AF9E;}
	.st17{fill:#5E846D;}
	.st18{fill:#C3DBCC;}
	.st19{fill:#E5E5E5;}
	.st20{fill:#FB632B;}
	.st21{fill:#729580;}
	.st22{fill:#648872;}
	.st23{fill:#FDFDFD;}
</style>
<path class="st0" d="M457.49,78.5c-0.55,0.58-1.63,1.24-1.56,1.73c1.72,11.21-0.1,22.14-2.89,32.88
	c-2.28,8.77-4.48,17.59-8.66,25.81c-4.63,9.12-10.81,16.58-19.85,21.5c-3.34,1.82-6.72,3.57-10.16,5.18
	c-5.94,2.78-12.51,3.27-18.79,3.69c-10.88,0.72-21.86,0.66-32.75,0.02c-11.69-0.69-23.14-3.24-34.5-6.27
	c-10.37-2.77-19.86-7.33-29.15-12.44c-6.9-3.8-6.85-4.04-11.99,1.75c-6.05,6.82-11.96,13.76-17.99,20.59
	c-0.97,1.09-2.28,1.89-3.43,2.81c-0.98,0.78-1.8,2.32-3.34,1.12c-1.36-1.06-2.22-2.29-1.52-4.3c1.36-3.9,2.22-7.98,3.7-11.83
	c2.6-6.77,5.35-13.49,8.35-20.09c2-4.4,2.65-7.9,0.13-12.91c-3.36-6.67-4.95-14.37-6.39-21.81c-1.34-6.94-2.13-14.13-1.98-21.19
	c0.15-7.04,1.44-14.12,2.83-21.06c1.42-7.11,3.34-14.14,5.46-21.08c3.32-10.86,10.75-18.49,20.15-24.43
	c7.99-5.05,16.87-7.09,26.06-8.88c11.92-2.32,23.85-2.16,35.73-1.56c10.16,0.51,20.24,2.71,30.35,4.21
	c10.27,1.52,19.56,6.08,29.18,9.6c10.58,3.86,19.78,9.77,27.6,17.98c3.46,3.63,5.68,7.84,7.26,12.34
	c2.62,7.47,5.74,14.84,6.26,22.92c0.04,0.61,1.23,1.15,1.88,1.72C457.49,77.16,457.49,77.83,457.49,78.5z M389.69,162.17
	c0.03,0.26,0.07,0.51,0.1,0.77c5.24-0.63,10.5-1.18,15.72-1.92c6.66-0.95,12.21-4.35,18.01-7.61c7.03-3.95,11.41-9.71,15.26-16.35
	c4.04-6.98,5.72-14.77,8.17-22.31c3.77-11.59,4.32-23.61,4.27-35.53c-0.04-9.59-3.35-18.86-6.97-27.75
	c-1.53-3.75-3.94-7.41-6.79-10.28c-7.63-7.69-16.04-14.26-27-16.9c-4.42-1.07-8.51-3.47-12.9-4.75c-15.03-4.41-30.62-4.9-46.08-5.89
	c-7.73-0.5-15.57,0.29-23.34,0.87c-11.32,0.84-22.23,3.36-32.13,9.23c-6.67,3.95-12.21,9.03-15.7,16.12
	c-4.12,8.39-6.03,17.43-7.84,26.5c-1.66,8.32-2.53,16.72-1.95,25.19c0.32,4.76,1.6,9.46,1.81,14.21c0.35,7.92,3.23,14.94,7.59,21.21
	c2.04,2.92,2.09,5.09,0.87,8c-3.99,9.46-7.88,18.96-11.77,28.46c-0.29,0.7-0.22,1.55-0.31,2.34c0.65-0.31,1.41-0.49,1.93-0.95
	c1.12-0.99,2.24-2.03,3.14-3.21c5.53-7.29,12.27-13.42,18.81-19.74c1.72-1.66,3.26-1.57,5.33-0.42c6.35,3.51,12.8,6.84,19.28,10.1
	c7.15,3.59,14.99,5.17,22.68,6.88c9.63,2.14,19.47,3.39,29.25,4.75c3.52,0.49,7.16,0.39,10.72,0.22
	C383.16,163.22,386.42,162.59,389.69,162.17z"/>
<path class="st1" d="M257.48,232.4c-0.59,0.79-1.18,1.58-1.78,2.37c-0.82-1.85-1.39-3.88-2.54-5.48c-0.92-1.28-2.52-1.35-3.66,0.22
	c-0.01,0.33-0.01,0.65-0.01,0.98c1.73,2.06,2.27,5.58,6.14,5.03c0.41,2.12,0.91,4.23,1.2,6.36c0.92,6.81-1.5,13.16-3,19.6
	c-0.64,2.78-2.19,5.34-3.33,8.01c-1.81,0.57-3.67,1.02-5.42,1.74c-1.35,0.55-2.64,2.19-3.81,2.05c-4.55-0.52-4.37,3.84-6.46,5.79
	c-0.28,0.27-0.15,1.33,0.16,1.75c0.19,0.26,1.28,0.23,1.63-0.07c2.26-1.95,4.55-1.47,6.89-0.26c-3.54,4.66-8.74,6.39-14.03,7.97
	c0.04-0.67,0.08-1.35,0.12-2.02c0.92-2.77,1.41-5.79,2.84-8.27c3.27-5.66,5.23-11.79,7.35-17.89c3.19-0.09,3.74-2.22,3.73-4.79
	c1.48,0.52,3.55,1.91,4.32,1.39c1.59-1.08,2.6-3.12,3.62-4.89c0.61-1.06,0.54-2.56,1.24-3.51c1.23-1.67,0.81-2.84-0.75-3.66
	c-1.67-0.88-2.78,0.45-2.87,1.72c-0.29,4.32-3.4,5.66-6.69,6.94c0.05-0.99,0.09-1.98,0.14-2.97c0.02-0.35,0.03-0.71,0.05-1.06
	c0.33-1.25,0.66-2.51,0.99-3.76c4.08-6.65,4.61-14.29,5.96-21.7c0.09-0.5-0.52-1.13-0.8-1.7c0.01-0.19-0.03-0.37-0.11-0.54
	l-0.08-0.19c0.58-0.19,1.57-0.25,1.68-0.59c1.67-5.35,2.74-10.72-0.59-15.89c-0.62-0.34-1.24-0.69-1.87-1.03
	c-0.51-0.19-1.02-0.39-1.52-0.58c-0.22,0.08-0.45,0.09-0.68,0.05c-1.33-1.94-2.67-0.66-4.02-0.01c-0.65-0.01-1.31-0.01-1.96-0.02
	c-6.93,3.09-8.99,9.23-10.04,16.01c-0.34,0.52-0.88,1.01-0.99,1.58c-1.06,5.64-2,11.3-3.12,16.93c-0.18,0.91-1.07,1.69-1.63,2.53
	c-1.08-0.35-2.15-0.95-3.25-1.01c-1.67-0.08-3,0.78-2.88,2.63c0.12,1.79,1.43,2.58,3.15,2.34c0.95-0.13,1.85-0.66,2.77-1
	c1.97,1.91-0.15,3.38-0.55,5.03c-3.17,0.97-3.35,1.66-1.42,5.4c-0.01,0.52-0.02,1.05-0.03,1.57c-1.45,0-2.91,0.01-4.36,0.01
	c-2.01-3.36-4.04-6.71-8.6-6.89c0.28-1.95,0.69-3.89,0.78-5.85c0.03-0.65-0.74-1.35-1.15-2.02c-0.45,0.56-1.04,1.06-1.33,1.7
	c-1.35,2.99-2.61,6.01-3.91,9.03c-0.51,0.34-1.03,0.68-1.54,1.03c-0.65-0.75-1.75-1.44-1.88-2.27c-0.29-1.95-0.01-3.98-0.21-5.96
	c-0.06-0.58-0.93-1.08-1.43-1.62c-0.48,0.56-1.16,1.06-1.38,1.71c-0.25,0.75-0.12,1.64-0.08,2.47c0.15,2.86-1.36,3.88-4,3.67
	c-0.65-0.33-1.3-0.66-1.94-0.99c-0.14-0.59-0.28-1.18-0.42-1.78c0.45-1.07,0.91-2.15,1.36-3.22c-0.33,0.01-0.66,0.02-0.99,0.03
	c-0.22,0.05-0.43,0.05-0.65,0.02c-0.52-2.43-1.19-4.83-1.52-7.28c-0.62-4.58-1.04-9.18-1.54-13.77c0.48-0.28,0.96-0.57,1.43-0.85
	c-0.54-0.38-1.08-0.76-1.62-1.13c-0.13-0.47-0.31-0.94-0.38-1.43c-0.39-2.49-0.39-4.25,2.76-5.59c3.11-1.33,5.05-4.59,5.2-8.37
	c0.81-2.17,0.97-4.29,0.38-6.64c-0.94-3.79-1.42-7.69-2.12-11.54c-0.8-4.39-5.06-7.6-8.42-6.06c-2.65,1.22-5.33,1.71-8.17,1.9
	c-0.69,0.05-1.71,0.58-1.93,1.15c-1.25,3.15-2.3,6.37-3.42,9.57c-1.44,0.01-3.03-0.2-3,2l-0.02,0.01c-1.49-1.33-2.84-2.91-4.52-3.94
	c-2.07-1.27-4.08-2.41-6.84-2.67c-3.22-0.31-4.9-1.21-8.61-0.39c-1.67-1-4.07-1.28-4.01-4.01c5.35-3.37,11.54-3.81,17.51-4.95
	c6.82-1.3,13.68-2.15,20.67-2.11c6.52,0.04,13.06-1.09,19.55-0.76c10.93,0.55,22.01,0.32,32.46,4.72
	c5.99,2.52,10.96,6.01,14.45,11.53c1.41,2.23,2.9,4.4,4.36,6.6c0.98,3.36,1.96,6.72,2.95,10.08c-0.14,2.37,0.11,4.34,3.33,3.91
	c1.41-0.19,2.69,0.09,2.71,1.95c-0.05,0.26-0.07,0.51-0.05,0.77c-1.15,0.11-2.36,0.04-3.43,0.38c-0.83,0.26-1.48,1.05-2.22,1.61
	c0.73,0.48,1.4,1.16,2.2,1.38c1.09,0.31,2.28,0.26,3.43,0.37c0.08,1.06,0.63,2.69,0.15,3.08c-1.74,1.46-1.15,1.9,0.5,2.64
	c1.62,0.73,3.09,1.8,4.63,2.72c-2.6-0.3-5.19-0.61-7.79-0.9c-1.48-0.17-2.2,0.23-1.55,1.9C257.57,231.02,257.44,231.74,257.48,232.4
	z M209.06,204.2c4.05-1.6,6.98-2.74,9.9-3.92c1.54-0.62,3.12-1.19,4.54-2.02c0.55-0.32,0.73-1.29,1.07-1.96
	c-0.67-0.24-1.44-0.81-2.01-0.66c-1.92,0.52-3.78,1.25-5.63,1.99c-3.23,1.29-6.42,2.67-9.65,3.96c-0.55,0.22-1.19,0.21-1.79,0.31
	c0.04-0.59-0.11-1.28,0.14-1.77c0.89-1.78,1.94-3.48,2.88-5.23c1.02-1.89,2.11-3.75,2.95-5.72c0.27-0.63-0.17-1.55-0.28-2.34
	c-0.66,0.32-1.63,0.46-1.92,0.98c-2.81,5.06-5.46,10.21-8.26,15.27c-1.16,2.1-0.07,3.35,1.59,3.88c5.2,1.66,10.46,3.15,15.75,4.47
	c0.83,0.21,1.98-0.83,2.98-1.29c-0.46-0.95-0.68-2.21-1.43-2.77c-1.01-0.75-2.41-1.04-3.67-1.39
	C214.16,205.42,212.08,204.95,209.06,204.2z M205.1,226.11c-1.36-4.51-2.4-9-4.17-13.18c-0.6-1.42-3.05-2.05-4.66-3.04
	c-0.02,1.66-0.31,3.38,0,4.97c0.54,2.72,1.73,5.32,2.15,8.05c0.6,3.89,0.72,7.86,1.14,11.78c0.05,0.52,0.63,1.37,0.98,1.38
	c0.51,0.01,1.33-0.49,1.51-0.97C203.12,232.21,204.05,229.27,205.1,226.11z M240.69,268.73c0.36,0.17,0.69,0.39,1.05,0.46
	c0.09,0.02,0.45-0.6,0.39-0.67c-0.25-0.28-0.61-0.46-0.92-0.68C241.06,268.08,240.92,268.33,240.69,268.73z M252.23,237.14
	c-0.39-0.1-0.76-0.27-1.12-0.25c-0.12,0.01-0.22,0.48-0.33,0.73c0.35,0.15,0.69,0.33,1.06,0.4
	C251.9,238.04,252.06,237.55,252.23,237.14z"/>
<path class="st2" d="M217.21,255.5c1.45,0,2.91-0.01,4.36-0.01c0.08,0.72,0.17,1.43,0.25,2.15c-0.1,1.29-0.2,2.57-0.29,3.86
	c-1.67,7.67-3.34,15.34-5.01,23.02c-1.28,3-2.57,6.01-3.85,9.01c-1.77,0.35-3.55,0.7-5.32,1.04c-6.88,0.97-13.76,1.94-20.64,2.9
	c-3,0.03-6.01,0.07-9.01,0.1c-0.4,0-0.8-0.01-1.2-0.01c-0.39-0.98-0.51-2.4-1.23-2.84c-1.63-0.99-3.51-1.9-5.36-2.1
	c-2.92-0.32-3.63-1.91-3.39-4.36c0.25-2.49-1.31-3.48-3.22-4.37c-2.87-1.34-5.53-1.62-8.12,0.71c-1.58,1.42-3.41,2.58-5.14,3.83
	c-2.26,1.65-4.62,1.57-6.89,0.15c-1.96-1.23-4.42-2.8-3.32-5.37c1.39-3.25,0.84-6.34,0.67-9.54c0.64-0.12,1.29-0.23,1.93-0.35
	c1.13,2.1,2.37,3.93,5.13,2.16c0.99-0.06,2.17,0.18,2.94-0.27c1.09-0.63,1.88-1.78,2.8-2.7c0.55-0.51,1.67-1.25,1.57-1.5
	c-1.01-2.49-2.22-4.91-3.37-7.34c1-0.73,2-1.45,3-2.18c0.61,0.04,1.72,0.24,1.76,0.11c0.47-1.53-0.41-2.07-1.8-2.11
	c-0.33-0.62-0.67-1.24-1-1.86c0.63-2.01-0.94-3-1.98-4.23c1-0.97,2-1.94,3-2.91c2.19,0.08,3.53-0.3,2.58-3.1
	c-0.49-1.43-0.11-3.17-0.11-4.77c0-1.75,0.06-3.5-0.01-5.25c-0.07-1.63-0.28-3.25-0.43-4.87c1.08-0.39,2.16-0.8,3.25-1.18
	c3.35-1.18,3.36-1.18,1.92-4.94c-0.04-0.26-0.05-0.53-0.04-0.79c0.97-0.69,1.94-1.38,2.91-2.07c2.63-0.22,3.16-1.88,2.81-4.13
	c0.06-1.96,0.12-3.92,0.17-5.89c2.12-0.9,2.16-2.74,1.91-4.56c-0.59-4.16-1.3-8.3-1.96-12.45c0,0,0.02-0.01,0.02-0.01
	c1-0.67,2-1.33,3-2c1.12-3.2,2.17-6.42,3.42-9.57c0.22-0.57,1.24-1.1,1.93-1.15c2.84-0.19,5.52-0.68,8.17-1.9
	c3.36-1.54,7.62,1.67,8.42,6.06c0.7,3.85,1.18,7.75,2.12,11.54c0.59,2.35,0.42,4.46-0.38,6.64c-0.56-0.2-1.12-0.39-1.68-0.59
	c-1-3.41-1.98-6.82-2.99-10.22c-0.7-2.35-1.22-4.79-2.27-6.97c-0.43-0.9-2.21-1.9-3.1-1.69c-5.12,1.2-9.28,3.86-11.16,9.08
	c-0.26,0.72,0.02,2.29,0.48,2.49c2.8,1.24,5.66,2.75,8.62,3.08c2.6,0.29,4.13,1.69,6.01,2.96c1.34,0.91,1.04,1.46,0.51,2.75
	c-1.35,3.32-4.7,3.78-7.12,5.56c-1.93-1.42-3.86-2.85-5.81-4.25c-0.37-0.26-0.81-0.42-1.21-0.62c-0.2,0.55-0.66,1.15-0.56,1.64
	c0.62,3.02,2.59,5.37,5.43,5.83c3.98,0.64,5.2,2.52,4.69,6.23c-0.15,1.12,0.15,2.3,0.29,3.45c0.75,5.88,1.52,11.76,2.28,17.64
	c-1.74,3.39-1.6,4.38,0.87,6.02c0.06,0.65,0.13,1.31,0.19,1.96c-2.74,1.94,0.06,4.03-0.17,6.04c-3.21-1.04-6.36-2.34-9.64-3.04
	c-2.82-0.6-6.07-1.34-8.61-0.48c-2.98,1.01-3.72,4.86-3.51,7.62c0.3,4.01-0.58,7.71-1.07,11.56c-0.27,2.16-0.93,3.73-2.43,5.19
	c-0.64,0.62-0.91,1.62-1.35,2.45c0.89,0.06,1.79,0.2,2.68,0.16c0.81-0.04,1.63-0.49,2.41-0.42c2.46,0.22,3.74-0.95,5.21-2.88
	c1.61-2.11,4.19-3.47,6.35-5.16c1.37-0.3,3.28,0.86,3.91-1.44c1.02-0.2,2.04-0.39,3.07-0.59c1.27,1.69,2.32,1.31,3.23-0.34
	c6.25-3.08,11.9-6.98,16.6-12.18c0.09,0.18,0.15,0.37,0.17,0.57c0.42,0.57,0.84,1.14,1.26,1.7c0.63,0.36,1.26,0.72,1.89,1.08l0,0
	c0.35,0.3,0.7,0.61,1.05,0.91l-0.1,0.24l0.14-0.23c2.92,2.67,3.99,2.86,6.87,1.14c0.08-0.05-0.17-0.64-0.27-0.98
	C215.95,259.44,216.58,257.47,217.21,255.5z"/>
<path class="st1" d="M28.63,307.61c-4.95,1.95-8.7-0.96-12.01-3.65c-5.08-4.14-7.01-10.17-8.17-16.5
	c-1.11-6.02,0.49-11.36,3.29-16.52c0.39-0.73,0.8-1.46,1.11-2.23c1.06-2.63,0.6-3.11-2.25-2.82c-0.92,0.1-1.89-0.3-2.84-0.47
	c0.85-0.62,1.7-1.25,2.57-1.85c0.11-0.08,0.33,0,0.49-0.02c1.43-0.22,2.86-0.44,4.28-0.66c-0.88-1.04-1.83-2.03-2.63-3.13
	c-0.33-0.45-0.34-1.13-0.5-1.7c0.61-0.12,1.23-0.37,1.82-0.3c0.44,0.05,0.8,0.6,1.25,0.77c0.86,0.32,1.77,0.53,2.66,0.79
	c-0.4-0.75-0.84-1.5-1.2-2.27c-0.18-0.39-0.23-0.84-0.34-1.26c0.47-0.07,1.09-0.36,1.38-0.16c2.37,1.63,3.54-0.18,4.95-1.56
	c3.29-3.22,6.63-6.39,9.95-9.58c3.71,0.97,4.94,0.45,7.15-2.61c0.42-0.58,1.94-1.19,2.13-1c2.5,2.58,3.12-0.96,4.64-1.39
	c3.02-0.86,1.42-3.04,1.09-4.81c6.03-3.05,12.03-6.17,18.11-9.11c1.44-0.69,3.17-0.79,4.76-1.16c0.72,1.68,1.45,3.36,2.17,5.04
	c-1.11,0.1-2.29,0.01-3.31,0.36c-0.59,0.2-0.94,1.11-1.4,1.7c0.64,0.13,1.28,0.39,1.91,0.37c1.27-0.04,2.53-0.24,3.79-0.38
	c1.74,0.37,3.47,0.73,5.21,1.1c-1.16,1.27-2.31,2.54-3.47,3.81c-1.66,0.73-3.46,1.24-4.94,2.23c-3.69,2.47-7.24,5.15-10.85,7.75
	c-2.68,1.91-5.46,3.71-8.03,5.75c-3.36,2.67-6.44,5.71-9.87,8.27c-3.79,2.84-5.54,6.33-5.1,11.07c0.39,4.13,3.48,6.22,7.25,4.35
	c2.79-1.38,5.31-3.32,7.93-5.03c3.27-2.14,6.53-4.3,9.8-6.45c0.69,0.71,1.37,1.43,2.06,2.14c-0.37,0.54-0.68,1.13-1.13,1.6
	c-2.3,2.37-4.67,4.68-6.94,7.08c-0.38,0.4-0.38,1.15-0.55,1.73c0.75,0.08,1.63,0.45,2.22,0.18c0.86-0.39,1.52-1.24,2.24-1.9
	c2.06-1.89,4.11-3.79,6.17-5.68c0.67,0.67,1.34,1.33,2,2c-0.98,1.36-1.96,2.72-2.94,4.08c0.19,0.2,0.38,0.4,0.57,0.59
	c1.45-0.89,2.9-1.79,4.34-2.68c0.68,1.35,1.36,2.71,2.05,4.06c-5.04,4.3-10.08,8.6-15.11,12.91c-1.76-1.36-3.45-2.85-5.31-4.06
	c-2.68-1.75-2.56,0.34-2.59,2.08c-4.16,0.66-7.82,2.14-10.03,6.04c-3.46,3.23-6.78,6.64-10.44,9.62
	C25.63,306.07,27.12,306.68,28.63,307.61z M24.78,268.4c-0.95-0.59-2.16-1.8-2.61-1.56c-2.86,1.5-5.62,3.23-8.24,5.13
	c-0.48,0.35-0.3,1.84-0.1,2.74c0.07,0.33,1.25,0.8,1.61,0.61c2.84-1.5,5.63-3.1,8.36-4.78C24.24,270.26,24.33,269.42,24.78,268.4z
	 M31.46,274.64c-0.54-0.24-1.82-1.14-2.13-0.88c-1.71,1.44-3.23,3.12-4.67,4.84c-0.15,0.18,0.57,1.58,1.06,1.71
	C27.92,280.86,31.49,277.72,31.46,274.64z M39.82,285.41c2.05-0.5,3.71-0.69,5.16-1.34c0.67-0.3,0.93-1.5,1.38-2.29
	c-0.77-0.41-1.61-1.25-2.3-1.14c-1.58,0.23-3.17,0.78-4.61,1.48c-0.68,0.33-1.04,1.31-1.55,2C38.65,284.62,39.4,285.12,39.82,285.41
	z M52.34,243.56c2.34-1.2,4.73-2.35,7.04-3.66c0.43-0.24,0.51-1.1,0.75-1.67c-0.57-0.23-1.32-0.82-1.69-0.64
	c-2.49,1.22-4.92,2.57-7.32,3.97c-0.25,0.14-0.34,0.99-0.16,1.31C51.16,243.2,51.77,243.3,52.34,243.56z M32.53,258.49
	c-0.68-0.4-1.26-1.01-1.63-0.9c-1.36,0.41-2.64,1.06-3.96,1.62c-1.51,0.64-3.69,0.28-3.97,2.71c1.68-0.24,3.4-0.35,5.03-0.76
	c1.08-0.28,2.07-0.98,3.07-1.53C31.48,259.4,31.82,259.05,32.53,258.49z M27.35,293.49c0.24-0.1,1.46-0.6,2.67-1.11
	c-1.34-0.3-2.67-0.67-4.02-0.88c-0.81-0.13-1.67-0.11-2.47,0.04c-0.56,0.1-1.05,0.54-1.57,0.83c0.6,0.37,1.15,0.92,1.8,1.07
	C24.53,293.64,25.39,293.49,27.35,293.49z M35.26,251.79c1.69-0.18,2.98-0.23,4.21-0.52c0.29-0.07,0.37-0.98,0.54-1.51
	c-0.81-0.26-1.8-0.95-2.39-0.7c-1.08,0.45-1.94,1.46-2.89,2.24C35,251.55,35.27,251.79,35.26,251.79z"/>
<path class="st3" d="M147.54,275.48c-2.76,1.77-4-0.06-5.13-2.16c0.34-0.73,1.05-1.53,0.93-2.18c-0.21-1.15-0.67-2.79-1.5-3.16
	c-0.88-0.4-2.57,0.11-3.46,0.79c-2.05,1.58-1,3.9,2.1,4.89c0.17,3.2,0.72,6.29-0.67,9.54c-1.1,2.56,1.36,4.14,3.32,5.37
	c2.27,1.42,4.64,1.5,6.89-0.15c1.73-1.26,3.55-2.41,5.14-3.83c2.59-2.33,5.24-2.05,8.12-0.71c1.91,0.89,3.47,1.88,3.22,4.37
	c-0.24,2.46,0.47,4.05,3.39,4.36c1.86,0.2,3.74,1.11,5.36,2.1c0.72,0.44,0.84,1.86,1.23,2.84c-8.11-0.04-16.22-0.28-24.32-0.05
	c-4.89,0.14-9.23-1.52-13.71-2.91c0.25-2.14-0.38-4.14-2.53-4.5c-1.06-0.18-3.44-0.11-3.42,2.34c-1.63-0.74-3.31-1.38-4.86-2.24
	c-1.16-0.64-1.74-0.54-2.18,0.77c-0.16,0.47-0.79,0.79-1.21,1.18c-0.26-0.55-0.66-1.08-0.74-1.65c-0.16-1.12-0.13-2.26-0.2-3.64
	c-0.66,0.41-1.06,0.67-1.46,0.9c-0.86,0.5-1.73,0.99-2.6,1.49c0.07-0.88,0.11-1.77,0.24-2.65c0.04-0.31,0.36-0.59,0.4-0.9
	c0.07-0.59,0.03-1.19,0.04-1.79c-0.58,0.13-1.31,0.08-1.71,0.42c-1.26,1.07-2.38,2.32-3.61,3.42c-0.32,0.28-1.13,0.53-1.28,0.38
	c-0.4-0.42-0.91-1.19-0.76-1.59c0.43-1.19,0.99-2.42,1.81-3.36c3.18-3.68,2.89-3.51,1.22-7.79c-1.47-3.78-2.06-7.9-3.04-11.87
	c1.78-0.04,2.83-0.94,2.88-2.72c0.06-1.82,0.04-3.65-0.13-5.45c-0.43-4.76-3.31-9.84,1.96-13.8c0.19-0.14,0.19-0.63,0.18-0.95
	c-0.06-1.76,0.31-3.21,2.03-4.19c0.51-0.29,1.02-1.69,0.78-2.02c-2.02-2.71-0.62-6.03-1.77-8.85c0.67-1.18,1.61-2.28,1.92-3.55
	c0.34-1.39,0.12-2.92,0.07-4.38c-0.1-2.85,1.02-4.7,4.02-5.08c-0.67,4.12,0.81,7.71,2.77,11.17c1.03,1.82,1.84,4.09,3.42,5.21
	c3.23,2.28,6.89,3.95,10.19,6.19c1.44,0.98,2.51,0.25,2.61-1.56c1-0.34,1.99-0.68,2.99-1.02c2.22,1.69,4.65,1.67,7.18,0.87
	c0.94-0.3,1.89-0.56,2.83-0.84c0.15,1.62,0.36,3.24,0.43,4.87c0.07,1.75,0.01,3.5,0.01,5.25c0,1.6-0.38,3.33,0.11,4.77
	c0.96,2.81-0.39,3.18-2.58,3.1c-0.72-3.96-0.72-3.96-5.9-3.94c-0.02-0.48,0.06-0.99-0.09-1.42c-0.28-0.8-0.68-1.55-1.04-2.32
	c-0.62,0.62-1.37,1.15-1.81,1.87c-0.29,0.48-0.15,1.24-0.2,1.87c-3.17-1.11-5.34-0.46-5.7,2.01c-0.16,1.09,0.36,2.82,1.17,3.34
	c0.68,0.44,2.75-0.1,3.25-0.85c0.83-1.23,0.89-2.97,1.28-4.5c1.04,0,2.08,0.01,3.13,0.01c-0.8,5.32-0.8,5.32,2.91,6.84
	c1.04,1.23,2.61,2.22,1.98,4.23c-0.66-0.04-1.33-0.14-1.99-0.1c-2.12,0.1-3.58,1.31-3.76,3.3c-0.23,2.58,1.93,2.68,3.79,2.84
	c1.15,2.44,2.36,4.85,3.37,7.34c0.1,0.25-1.02,0.99-1.57,1.5c-0.64-0.7-1.16-1.69-1.96-2.04c-1.04-0.45-2.46-0.81-3.41-0.43
	c-0.72,0.29-1.23,1.77-1.31,2.77C146.54,273.67,147.21,274.59,147.54,275.48z M136.45,248.32c-0.03-2.25-0.48-3.92-2.66-3.67
	c-1.98,0.22-3.13,1.66-3.21,3.7c-0.07,1.92,0.83,3.14,2.88,3.1C135.76,251.4,136.5,249.95,136.45,248.32z M131.9,261.48
	c2.41,0.12,3.53-1.1,3.59-3.35c0.05-1.82-0.66-2.73-2.57-2.66c-1.87,0.07-3.2,0.73-3.37,2.74
	C129.39,260.12,130.23,261.33,131.9,261.48z M143.57,258.33c-0.38-0.35-1.08-1.54-2.01-1.74c-1.84-0.4-4.32,1.77-3.9,3.43
	c0.24,0.97,1.48,2.13,2.48,2.38C142.1,262.9,143.4,261.48,143.57,258.33z M130.52,272.11c1.24-1.74,2.52-2.88,2.84-4.24
	c0.2-0.85-1.04-2.05-1.63-3.09c-1.32,1.27-2.82,2.42-3.82,3.9C127.7,269,129.29,270.53,130.52,272.11z"/>
<path class="st3" d="M355.44,234.52c1.98,1.44,3.26,0.2,4.71-1.05c0.6-0.52,1.74-0.42,2.63-0.6c-0.4,0.7-0.62,1.63-1.22,2.04
	c-2.14,1.5-1.89,2.66,0.07,4.14c8.32,6.26,15.08,13.98,19.85,23.21c1.69,3.26,2.64,7.2,2.76,10.87c0.07,2.3-1.51,5.25-3.29,6.87
	c-3.17,2.86-6.96,5.18-11.7,4.49c-0.81-0.12-1.99-0.33-2.43,0.1c-2.37,2.26-3.74,1.51-5.05-1.13c-0.46-0.93-1.69-1.11-2.19,0.33
	c-0.27,0.77-0.23,1.68-0.61,2.37c-0.26,0.47-1.02,0.66-1.55,0.97c-0.3-0.52-0.83-1.03-0.85-1.57c-0.04-1.24,0.16-2.49,0.26-3.73
	c-1.06,0.67-2.13,1.33-3.19,2c-1.03,0.66-2.33,0.63-1.8-0.77c1.04-2.71-0.44-2.89-2.36-3.65c-4.26-1.68-8.4-3.69-12.52-5.7
	c-3.22-1.58-6.34-3.37-9.5-5.07c-0.47-3.14,1.75-4.18,4.04-5.15c1.76,0.31,3.5,0.68,5.27,0.91c1.33,0.18,2.73,0.12,2.75,2.02
	c-1.2,0.7-2.64,1.62-0.56,2.68c2,1.02,4.12,0.44,5.92-0.98c-0.46-0.57-0.93-1.13-1.39-1.7c0.26-0.55,0.38-1.4,0.8-1.6
	c2.81-1.35,5.33-1.07,7.23,1.67c1.27,0.53,2.79,1.77,3.76,1.43c2.09-0.74,4-2.14,5.74-3.57c0.64-0.52,0.6-1.88,0.87-2.86
	c-1.03-0.21-2.18-0.81-3.07-0.54c-2.16,0.65-4.21,1.7-6.3,2.58c0-0.5-0.17-1.08,0.04-1.47c1.54-2.98,3.06-5.98,4.79-8.85
	c0.79-1.31,1.61-2.1-0.56-2.84c-0.89-0.3-1.47-1.49-2.19-2.28c0.67-0.58,1.38-1.11,1.99-1.75c1.54-1.63-0.02-2.15-1.06-2.84
	c-0.01-0.33-0.03-0.66-0.04-0.99c1.56-1.01,1.1-2.17,0.2-3.3C354.43,237.68,353.71,236.17,355.44,234.52z M365.13,252.54
	c-0.19,1.11-0.82,2.37-0.43,3.03c1.25,2.11,2.83,4.03,4.4,5.94c0.34,0.41,1.15,0.43,1.74,0.62c0.2-0.76,0.82-1.78,0.53-2.23
	c-1.49-2.34-3.19-4.53-4.86-6.75C366.35,252.93,365.94,252.88,365.13,252.54z M359.66,273.79c1.88-1.97,3.55-3.7,5.19-5.47
	c0.07-0.07-0.22-0.47-0.35-0.72c-1.46,0.91-2.97,1.75-4.35,2.77c-0.61,0.45-1.03,1.24-1.38,1.95
	C358.68,272.52,359.17,273.01,359.66,273.79z M368.57,276.85c1.38-1.53,2.54-2.78,3.63-4.08c0.1-0.11-0.18-0.54-0.29-0.82
	c-1.03,0.56-2.11,1.05-3.06,1.72c-0.49,0.34-0.87,0.97-1.08,1.54C367.69,275.48,368.11,275.94,368.57,276.85z"/>
<path class="st4" d="M355.5,243.5c1.04,0.69,2.61,1.21,1.06,2.84c-0.6,0.64-1.32,1.17-1.99,1.75c0.72,0.79,1.31,1.98,2.19,2.28
	c2.18,0.74,1.35,1.53,0.56,2.84c-1.73,2.87-3.25,5.87-4.79,8.85c-0.2,0.39-0.03,0.98-0.04,1.47c-0.33,0.99-0.67,1.97-1,2.96
	c-1.91-2.74-4.43-3.02-7.23-1.67c-0.43,0.2-0.54,1.05-0.8,1.6c-1.32,0-2.65,0-3.97,0c-0.02-1.9-1.41-1.85-2.75-2.02
	c-1.77-0.23-3.51-0.6-5.27-0.91c0.34-1.7,0.68-3.4,1.02-5.09c2.72,1.17,5.46,2.3,8.17,3.51c2.99,1.33,5.52-0.09,5.77-3.41
	c0.07-0.96,0.01-2.13-0.48-2.89c-2.04-3.19-3.68-7.05-6.55-9.24c-7.08-5.4-14.12-11.09-22.82-13.92c-1.39-0.94-2.77-1.89-4.16-2.83
	c0.68-1.35,1.35-2.7,2.03-4.04c0.35-0.02,0.71-0.04,1.06-0.06c0.3,0.13,0.59,0.37,0.89,0.38c0.55,0.03,1.12-0.07,1.67-0.11
	c-0.35-0.41-0.62-0.96-1.06-1.19c-0.38-0.21-0.96-0.06-1.44-0.08c-1.03-0.66-2.06-1.32-3.1-1.98c0-1.01-0.01-2.03-0.01-3.04
	c1.61-0.04,3.74,0.13,3.65-2.06c-0.09-2.11-2.22-1.89-3.83-1.91c-1.94-0.02-3.89-0.04-5.83-0.06c0.33-1.64,0.67-3.28,1-4.92
	c9.59,1.35,18.51,4.48,26.67,9.8c3.59,2.34,7.4,4.35,11.18,6.36c0.64,0.34,1.75,0.12,2.51-0.17c0.8-0.31,1.44-1.01,2.15-1.55
	c0.17,0.95,0.36,1.9,0.49,2.86c0.07,0.49-0.07,1.03,0.07,1.48c0.46,1.46,1.12,2.56,2.7,0.95c0.7-0.71,1.35-1.47,2.12-2.1
	c0.34-0.28,0.89-0.28,1.35-0.41c0.05,0.56,0.24,1.16,0.12,1.68c-0.4,1.7-0.93,3.38-1.4,5.06c-1.73,1.65-1.01,3.16,0.22,4.69
	c0.9,1.12,1.36,2.29-0.2,3.3c-1.96-1.78-3.89-3.61-5.92-5.31c-0.34-0.29-1.19-0.2-1.67,0.01c-0.24,0.1-0.43,1.06-0.24,1.32
	c1.67,2.23,3.24,4.61,5.26,6.5C354.16,246.21,355.35,245.29,355.5,243.5z M342.53,242.41c-0.07-1.09,0.03-1.52-0.14-1.74
	c-2.64-3.56-5.3-7.11-8.02-10.62c-0.18-0.23-1.18-0.24-1.28-0.06c-0.28,0.53-0.61,1.34-0.39,1.79c1.54,3.11,3.12,6.21,4.89,9.2
	c0.56,0.94,1.59,1.83,2.6,2.19C340.85,243.41,341.87,242.65,342.53,242.41z M351.43,255.05c1.24-0.7,1.99-1.14,2.75-1.57
	c-0.98-0.66-1.89-1.58-2.97-1.87c-0.67-0.18-1.6,0.59-2.41,0.94C349.65,253.34,350.49,254.15,351.43,255.05z"/>
<path class="st3" d="M217.52,336.37c0.22-0.07,0.43-0.07,0.64,0.02c0.41-0.39,0.82-0.79,1.23-1.18c3.19,0.12,6.39,0.17,9.57,0.39
	c5.4,0.37,10.8,0.87,16.21,1.21c0.37,0.02,1.24-1.03,1.14-1.29c-0.73-1.83-1.54-3.65-2.53-5.36c-4.12-7.16-5.18-14.83-4.04-22.91
	c6.37,0.27,12.75,0.53,19.12,0.8c-0.18,4.09-0.3,8.18-0.56,12.27c-0.19,2.96-0.62,5.9-0.85,8.85c-0.36,4.44-0.64,8.88-0.96,13.32
	c-4.72-0.55-7.77,1.71-9.75,5.78c-4.5-0.65-9.01-1.19-13.48-1.96c-5.28-0.91-10.53-2.01-15.8-3.03
	C217.48,340.97,217.5,338.67,217.52,336.37z M252.96,318.7c-0.7-1-1.3-1.87-1.91-2.74c-0.51,0.91-1.47,1.85-1.41,2.72
	c0.05,0.87,1.12,1.68,1.74,2.52C251.85,320.47,252.31,319.73,252.96,318.7z M249.13,319.67c-0.97-1.1-1.73-1.98-2.5-2.86
	c-0.37,0.45-1.14,1.08-1.03,1.33c0.45,1.08,1.16,2.05,1.78,3.07C247.8,320.83,248.23,320.45,249.13,319.67z M242.07,341.87
	c-1.28-0.8-2.15-1.33-3.02-1.87c-0.17,0.42-0.6,1-0.47,1.22c0.48,0.74,1.11,1.4,1.8,1.94C240.48,343.24,241.2,342.55,242.07,341.87z
	"/>
<path class="st4" d="M118.49,225.5c1.15,2.82-0.25,6.15,1.77,8.85c0.24,0.33-0.27,1.73-0.78,2.02c-1.72,0.98-2.09,2.43-2.03,4.19
	c0.01,0.32,0.01,0.81-0.18,0.95c-5.27,3.96-2.39,9.04-1.96,13.8c0.16,1.81,0.18,3.64,0.13,5.45c-0.06,1.78-1.11,2.68-2.88,2.72
	c-0.67-4.03-1.32-8.07-2.03-12.09c-0.16-0.91-0.3-2.22-0.9-2.55c-0.56-0.32-1.9,0.16-2.57,0.7c-4.11,3.29-8.15,6.68-12.15,10.1
	c-0.57,0.49-1.34,1.64-1.15,1.96c1.91,3.2-3.12,2.88-2.59,5.27c-1.22-0.5-2.44-1.01-3.66-1.51c0.01-3.02,0.14-6.08-3.04-7.87
	c0.61-0.78,1.19-1.58,1.84-2.33c1.09-1.25,0.6-1.67-0.82-1.66c-0.67,0.01-1.33,0.02-2,0.03c-0.03-1.47-0.07-2.94-0.1-4.4
	c0.45-0.47,0.84-1.06,1.37-1.41c6.09-3.88,12.21-7.71,18.3-11.58c1.23-0.78,2.38-1.68,3.57-2.52c4.34-1.21,4.48-1.44,4.78-5.45
	c0.14-1.94,0.53-3.86,0.81-5.79c0.74,0.04,1.49,0.08,2.23,0.12c1.18-0.65,1.18-1.32,0.02-2c0.67-0.33,1.35-0.66,2.02-1
	c0.03,0.97,0.14,1.94,0.07,2.9C116.48,223.92,116.26,225.44,118.49,225.5z M99.46,246.4c3.33,0.29,5.07-0.63,5.62-2.76
	c0.12-0.46-2.12-2.22-2.52-2c-1.76,0.95-3.24,2.41-4.83,3.68C98.58,245.86,99.44,246.39,99.46,246.4z"/>
<path class="st5" d="M142.49,304.78c8.13,2.69,16.6,3.75,24.96,5.34c1.9,0.36,3.91,0.2,5.87,0.28c-0.24,0.99-0.48,1.98-0.71,2.97
	c-0.37,1.08-0.74,2.17-1.11,3.25c-1.99-1.33-3.68-1.04-5.96-0.05c-2.52,1.09-6.09,1.9-8.39,0.91c-4.71-2.01-9.03-1.59-13.68-0.57
	c-2.39,0.52-4.94,0.53-7.4,0.43c-3.79-0.15-7.57-0.6-11.36-0.88c-1.33-0.1-2.69,0.09-3.99-0.15c-7.67-1.4-15.39-2.11-23.19-1.86
	c-0.01-0.99-0.02-1.98-0.03-2.97c3.2-0.95,6.24-2.58,9.79-2.11c0.69,0.09,1.47-0.58,2.21-0.89c2.5,1.42,5.05,2.75,7.47,4.28
	c1.67,1.05,3.06,0.55,4.52-0.28c4.99,0.77,9.01-1.63,13.03-4.02c1.42,0,3.07,0.36,2.91-1.97
	C139.12,305.93,141.67,307.9,142.49,304.78z"/>
<path class="st6" d="M142.49,304.78c-0.81,3.12-3.37,1.15-5.06,1.74c-1.39,0.03-3.03-0.31-2.91,1.97
	c-4.02,2.38-8.04,4.78-13.03,4.02c-0.37-1-0.48-2.59-1.15-2.89c-2.81-1.24-5.76-2.2-8.72-3.05c-1.36-0.39-2.13,0.5-2.12,1.93
	c-0.74,0.32-1.53,0.99-2.21,0.89c-3.54-0.47-6.58,1.16-9.79,2.11c0.66-5.66,1.32-11.32,1.98-16.99c3.86,0.7,7.76,1.2,11.56,2.14
	C121.55,299.26,132.01,302.06,142.49,304.78z M117.76,304.3c0.03,0.36-0.01,0.62,0.06,0.66c2.28,1.11,4.56,2.21,6.86,3.26
	c0.05,0.02,0.34-0.46,0.52-0.71c-1.52-1.03-3.02-2.09-4.57-3.07c-0.54-0.34-1.2-0.56-1.83-0.63
	C118.46,303.77,118.07,304.15,117.76,304.3z"/>
<path class="st7" d="M257.48,232.4c-0.03-0.66,0.1-1.38-0.13-1.97c-0.65-1.66,0.07-2.07,1.55-1.9c2.6,0.29,5.19,0.6,7.79,0.9
	c0.62,0.08,1.24,0.16,1.86,0.24c0.13,1.44,0.49,2.34,1.92,0.85c0.7,0.07,1.4,0.14,2.1,0.21c0.69,0.57,1.39,1.15,2.08,1.72
	c7.86,3.05,15.74,6.08,23.57,9.2c0.85,0.34,1.51,1.17,2.26,1.77c0.31,5.36,0.4,5.49,5.07,7.09c0.98,1,1.95,2.01,2.93,3.01
	c-0.46,2.32,0.87,3.84,2.3,5.38c1.01,1.1,1.81,2.4,2.7,3.6c-4.68-2.33-9.35-4.67-14.03-7c1.46-1.08,1.42-2.3-0.14-3.02
	c-3.99-1.83-6.72-4.77-9.01-8.47c-0.87-1.42-3.64-3.11-4.67-2.67c-1.72,0.75-4.81,0.06-5.16,3.17c-7.63-2.42-13.94-7.27-20.74-11.22
	C259.03,232.91,258.23,232.7,257.48,232.4z"/>
<path class="st8" d="M212.71,342.64c-0.81,2.3-1.61,4.59-2.42,6.89c-4.17,0.76-8.35,1.51-12.51,2.3c-4.83,0.91-9.66,1.86-14.49,2.79
	c-4.77-1.92-8.86-4.55-10.33-9.9c7.31-1.05,14.61-2.13,21.92-3.14c5.68-0.78,11.37-1.47,17.06-2.2c0.2,0.03,0.39,0.06,0.59,0.1
	C212.59,340.53,212.65,341.59,212.71,342.64z"/>
<path class="st9" d="M312.49,219.49c0,1.01,0.01,2.03,0.01,3.04c-1.54,0.39-3.5-0.96-4.64,1.11c1.56,0.62,3.1,1.3,4.69,1.84
	c0.59,0.2,1.28,0.07,1.93,0.1c-0.68,1.35-1.35,2.7-2.03,4.04c-0.67-0.31-1.33-0.62-2-0.93c-1.16-1.93-2.35-3.77-5.02-2.08
	c-0.83-0.07-1.68-0.02-2.48-0.22c-11.82-2.95-23.64-5.93-35.46-8.9c3.09-2.22,6.66-0.77,9.79-0.62c2.63,0.13,3.48-0.45,4.24-2.43
	c2.42,0.31,4.84,0.62,7.27,0.93c2.19,0.28,4.09,0.19,3.69-2.87c0.34-1.67,0.68-3.34,1.01-5.01c4.66,1.02,9.33,2.03,13.99,3.05
	c-0.33,1.64-0.67,3.28-1,4.92c-0.58,0.85-1.15,1.7-1.73,2.55c0.79,0.48,1.55,1.26,2.39,1.37
	C308.9,219.61,310.71,219.47,312.49,219.49z"/>
<path class="st2" d="M190.36,377.47c-1.62-5.16-3.31-10.3-4.82-15.49c-0.59-2.03-0.77-4.18-1.14-6.27c3.34,0.9,6.69,1.81,10.03,2.71
	c0.96,3.57,1.88,7.15,2.89,10.71c0.62,2.17,1.4,4.29,2.11,6.44c-0.93,0.7-2.43,1.23-2.71,2.13c-1.17,3.83-1.99,7.77-2.93,11.67
	c-0.43-0.58-0.84-1.19-1.31-1.73c-0.64-0.74-1.33-1.42-2-2.13c-2,1-4,1.99-6.01,2.99c-0.98-0.33-1.96-0.65-2.93-0.98
	c-1.02-0.33-2.03-0.65-3.05-0.98c-0.09-1.78-1.26-2.69-2.55-1.6c-2.34,1.99-4.93,1.48-7.51,1.55c5.71-6.09,12.76-9.02,21.08-9.01
	c0.27,0.75,0.4,1.6,0.86,2.19c0.25,0.32,1.08,0.19,1.65,0.26c-0.13-0.57-0.15-1.21-0.44-1.68
	C191.36,377.87,190.78,377.72,190.36,377.47z"/>
<path class="st4" d="M78.7,232.59c-1.74-0.37-3.47-0.73-5.21-1.1c-0.33-0.69-0.66-1.37-0.99-2.06c-0.72-1.68-1.45-3.36-2.17-5.04
	c4.12-1.93,8.09-4.41,12.4-5.68c8.16-2.39,16.53-4.08,24.81-6.06c-0.04,2.44-2.38,5.53,1.92,6.74c-2.33,1.02-4.66,2.04-6.99,3.06
	c-2.74,1.05-5.52,2.02-8.22,3.18C89.04,227.9,83.88,230.27,78.7,232.59z"/>
<path class="st0" d="M84.46,257.49c3.18,1.78,3.05,4.85,3.04,7.87c-5.33,4.06-10.66,8.13-16,12.19c-0.68-1.35-1.36-2.71-2.05-4.06
	c0.9-1.43,1.79-2.87,2.69-4.3c-2.49-1.12-2.85,2.07-4.67,2.31c-0.67-0.67-1.34-1.33-2-2c1.18-2.77,1.15-2.81-2-3.01
	c-0.69-0.71-1.37-1.43-2.06-2.14c2.09-1.92,4.19-3.84,6.28-5.76c4.61-3.12,9.21-6.23,13.82-9.35c0.62-0.04,1.24-0.07,1.86-0.11
	c0.03,1.47,0.07,2.94,0.1,4.4c-1.1,0.64-2.22,1.26-3.29,1.94c-0.65,0.41-1.42,0.81-1.79,1.43c-0.35,0.58-0.23,1.43-0.32,2.16
	c0.61,0.06,1.29,0.31,1.83,0.14C81.46,258.73,82.95,258.08,84.46,257.49z"/>
<path class="st7" d="M293.49,207.49c-0.34,1.67-0.68,3.34-1.01,5.01c-2.54-0.31-5.09-0.88-7.62-0.82c-1.4,0.04-3.37,0.46-3.33,2.75
	c-0.77,1.98-1.61,2.56-4.24,2.43c-3.13-0.15-6.7-1.6-9.79,0.62c-2-0.34-4.01-0.67-6.01-1.01c-0.03-1.87-1.31-2.14-2.71-1.95
	c-3.22,0.43-3.47-1.54-3.33-3.91c0.68-0.4,1.68-0.63,1.98-1.22c1.09-2.14,2.07-3.38,4.93-2.2c2.05,0.85,4.32-1.54,5.07-4.52
	C276.3,203.23,285.03,204.65,293.49,207.49z M268.66,213.21c1.45-1.06,3.27-1.72,3.41-2.62c0.29-1.93-1.57-2.04-3.07-2.06
	c-1.52-0.01-3.27,0.12-3.13,2.06C265.93,211.41,267.46,212.13,268.66,213.21z"/>
<path class="st8" d="M171.5,316.63c0.37-1.08,0.74-2.17,1.11-3.25c11.67,1.65,23.35,3.3,35.02,4.94c0.4,2.39,0.8,4.78,1.2,7.18
	c-1.66,0.03-3.33,0.17-4.99,0.06c-10.89-0.72-21.77-1.49-32.66-2.24c0.07-1.15,0.14-2.3,0.21-3.44
	C171.43,318.79,171.46,317.71,171.5,316.63z"/>
<path class="st8" d="M171.77,338.7c-0.12-3.79-0.24-7.58-0.36-11.38c4.88,0.6,9.75,1.26,14.64,1.8c4.4,0.49,8.82,0.97,13.24,1.22
	c3.38,0.19,6.79,0.02,10.19,0c0.37,1.06,0.74,2.12,1.1,3.18c0,0.65,0.01,1.31,0.01,1.96c-5.86,0.71-11.71,1.6-17.59,2.08
	C185.94,338.12,178.85,338.33,171.77,338.7z"/>
<path class="st1" d="M190.49,385.5c0.67,0.71,1.36,1.4,2,2.13c0.47,0.55,0.88,1.15,1.31,1.73c0.27,0.01,0.52,0.09,0.75,0.24
	c-5.06,4.84-10.09,9.71-15.19,14.5c-1.05,0.98-2.36,1.67-3.56,2.5c-4.45-4.32-9.53-8.09-12.34-13.87c0.29-3.18,2.84-4.55,4.98-6.25
	c2.59-0.07,5.18,0.44,7.51-1.55c1.29-1.1,2.46-0.18,2.55,1.6c-1.52,0.36-3.07,0.64-4.55,1.11c-0.51,0.16-1.17,0.75-1.23,1.21
	c-0.06,0.45,0.43,1.26,0.88,1.46c2.45,1.05,6.08-0.28,7.95-2.8c0.98,0.33,1.96,0.65,2.93,0.98c-0.5,1.08-0.98,2.77,0.62,2.6
	c1.79-0.19,3.58-1.43,5.08-2.6C190.73,388.06,190.41,386.52,190.49,385.5z M175.56,391.91c-1.11,0.72-1.94,1.26-2.78,1.8
	c1.05,0.59,2.05,1.52,3.15,1.64c0.74,0.08,1.61-0.98,2.42-1.54C177.52,393.24,176.68,392.67,175.56,391.91z"/>
<path class="st10" d="M258.87,308.05c-6.37-0.27-12.75-0.53-19.12-0.8c-0.61-5.65,0.95-10.62,4.67-14.92
	c0.13,1.41-0.22,3.13,2.01,3.24c0.28,0.54,0.55,1.08,0.83,1.62c0.44-0.54,0.87-1.08,1.31-1.62c1.34-0.04,2.69-0.07,4.03-0.11
	c0.3-1,0.59-2.01,0.89-3.01l-0.04,0.07c0.35-1.02,0.69-2.05,1.04-3.07l-0.03,0.06c1.1-0.93,2.2-1.86,3.3-2.79
	c0.91,1.86,2.62,3.74,2.58,5.59C260.22,297.56,259.4,302.8,258.87,308.05z"/>
<path class="st11" d="M173.94,309.3c1.12-3.34,2.24-6.69,3.36-10.03c2.7,0.67,5.36,1.49,8.09,1.97c6.29,1.11,12.62,2.06,18.93,3.07
	c1,0.16,2,0.31,3,0.47c0.09,2.94,0.18,5.88,0.27,8.81c0,0-0.09-0.11-0.09-0.11c-1.64-0.03-3.31,0.09-4.92-0.13
	C193.03,312.04,183.48,310.66,173.94,309.3z"/>
<path class="st9" d="M313.48,262.52c-0.89-1.21-1.68-2.51-2.7-3.6c-1.43-1.55-2.75-3.06-2.3-5.38c0.66-0.65,1.32-1.3,1.98-1.96
	c0.11-1.96-1.4-2.4-2.8-2.73c-0.25-0.06-0.78,1.07-1.18,1.66c-0.31,0.02-0.62,0.02-0.93,0.02c-4.67-1.59-4.77-1.73-5.07-7.09
	c1.98,0.74,3.96,1.49,5.94,2.23c1.94,1.21,3.77,2.64,5.83,3.6c6.71,3.14,13.5,6.1,20.26,9.13c-0.34,1.7-0.68,3.4-1.02,5.09
	c-2.29,0.98-4.51,2.01-4.04,5.15c-3.97-1.69-7.94-3.37-11.91-5.06c-0.69-0.36-1.38-0.72-2.07-1.08L313.48,262.52z M325.42,257.6
	c-2.16-0.78-3.54-1.33-4.97-1.73c-0.18-0.05-0.77,0.59-0.82,0.96c-0.18,1.28,1.95,2.79,3.57,2.48
	C323.71,259.21,324.12,258.62,325.42,257.6z"/>
<path class="st10" d="M99.48,294.51c-0.66,5.66-1.32,11.32-1.98,16.99c0.01,0.99,0.02,1.98,0.03,2.97
	c-0.42-0.01-0.84-0.03-1.26-0.04c-1.2-1.13-2.31-2.78-4.07-0.7c-2.69-0.75-5.46-1.31-8.04-2.34c-1.07-0.43-2.01-1.73-2.51-2.85
	c-0.54-1.21-0.22-2.3,1.66-1.8c2.24,0.6,4.52,1.12,6.81,1.46c0.6,0.09,1.31-0.59,1.97-0.91c-0.46-0.41-0.87-1.05-1.4-1.18
	c-2.26-0.54-4.54-0.98-6.84-1.34c-3.03-0.48-3.17-1.9-1.47-4.04c3.44,0.98,6.87,1.99,10.33,2.88c0.37,0.1,0.92-0.5,1.38-0.78
	c-0.3-0.36-0.53-0.94-0.9-1.03c-3.14-0.85-6.3-1.61-9.45-2.39c0.25-3.14,2.59-4.73,5.1-5.05C92.33,293.91,95.93,294.41,99.48,294.51
	z"/>
<path class="st12" d="M96.27,314.43c0.42,0.01,0.84,0.03,1.26,0.04c7.8-0.25,15.52,0.46,23.19,1.86c1.29,0.24,2.66,0.05,3.99,0.15
	c3.79,0.28,7.57,0.74,11.36,0.88c2.46,0.1,5.01,0.09,7.4-0.43c4.65-1.02,8.97-1.44,13.68,0.57c2.3,0.98,5.87,0.18,8.39-0.91
	c2.28-0.99,3.97-1.29,5.96,0.05c-0.04,1.08-0.07,2.16-0.11,3.24c-5.9,1.37-11.84,1.24-17.85,0.78c-11.76-0.91-23.57-1.29-35.31-2.39
	c-7.69-0.72-15.3-2.34-22.95-3.55C95.61,314.61,95.94,314.52,96.27,314.43z"/>
<path class="st10" d="M163.45,392.73c2.81,5.78,7.89,9.55,12.34,13.87c-3.47,3-6.91,6.03-10.46,8.94c-0.47,0.39-1.46,0.14-2.21,0.18
	c0.01-0.73-0.1-1.49,0.06-2.18c0.3-1.34,0.76-2.65,1.15-3.98c-2.39-0.44-2.32,1.77-3.19,2.96c-0.17,0.24-0.4,0.43-0.61,0.64
	c-0.29-0.88-0.59-1.75-0.88-2.63c1.16-1.97,2.4-3.9,3.44-5.92c0.44-0.86,0.49-1.93,0.71-2.91c-0.94,0.55-1.89,1.1-2.82,1.66
	c-1.3,0.79-0.96,3.45-3.38,2.96c-0.14-4.57,1.57-8.55,3.98-12.28C161.96,393.44,162.81,393.16,163.45,392.73z"/>
<path class="st13" d="M171.77,338.7c7.08-0.37,14.17-0.58,21.23-1.15c5.88-0.47,11.73-1.37,17.59-2.08c0.45,1.3,0.9,2.6,1.35,3.9
	c-5.69,0.73-11.38,1.42-17.06,2.2c-7.31,1.01-14.61,2.09-21.92,3.14C172.56,342.71,172.16,340.7,171.77,338.7z"/>
<path class="st13" d="M209.47,330.34c-3.4,0.01-6.8,0.19-10.19,0c-4.42-0.25-8.83-0.73-13.24-1.22c-4.89-0.54-9.76-1.19-14.64-1.8
	c-0.07-1.34-0.15-2.67-0.22-4.01c10.88,0.75,21.77,1.52,32.66,2.24c1.65,0.11,3.32-0.03,4.99-0.06
	C209.04,327.11,209.26,328.72,209.47,330.34z"/>
<path class="st9" d="M48.5,288.47c0.03-1.74-0.09-3.83,2.59-2.08c1.86,1.21,3.55,2.7,5.31,4.06c-1.28,1.05-2.55,2.1-3.83,3.15
	c-0.5-0.25-1-0.5-1.5-0.74c-0.18,0.9-0.35,1.8-0.53,2.7c0,0,0.02-0.04,0.02-0.04c-0.34,0.35-0.69,0.69-1.03,1.04
	c0,0,0.03-0.03,0.03-0.03c-0.35,0.34-0.7,0.67-1.05,1.01l0.03-0.02c-0.67,0.41-1.34,0.82-2,1.23c-0.28,0.27-0.57,0.53-0.85,0.8
	c-4.18,0.66-8.37,1.31-10.14,6.03c0,0,0.02-0.03,0.02-0.03c-0.7,0.33-1.39,0.66-2.09,0.99c-1.61,0.36-3.22,0.72-4.83,1.07
	c-1.51-0.93-3-1.54-0.6-3.49c3.67-2.98,6.98-6.39,10.44-9.62c3.4,0.89,9.51-1.78,10.53-4.69C49.13,289.47,48.68,288.92,48.5,288.47z
	"/>
<path class="st14" d="M229.57,286.45c-0.04,0.67-0.08,1.35-0.12,2.02c-3.44,6.24-7.1,12.32-12.71,16.94
	c-0.16-0.02-0.33-0.01-0.49-0.05c-3.51-0.94-3.69-1.55-1.35-4.29c0.28-0.33,0.58-1.03,0.42-1.3c-2.17-3.73,0.27-6.9,1.17-10.25
	c0.65-0.01,1.29-0.01,1.94-0.02c0.35,0.57,0.69,1.14,1.04,1.71c0.34-0.58,0.67-1.15,1.01-1.73c0-0.65-0.01-1.31-0.01-1.96
	C223.51,287.15,226.54,286.8,229.57,286.45z"/>
<path class="st13" d="M173.94,309.3c9.55,1.36,19.09,2.75,28.64,4.05c1.62,0.22,3.28,0.1,4.92,0.13c0.03,0.75,0.06,1.49,0.09,2.24
	c-0.07,0.27-0.02,0.52,0.16,0.73c-0.04,0.62-0.09,1.25-0.13,1.87c-11.67-1.65-23.35-3.3-35.02-4.94c0.24-0.99,0.48-1.98,0.71-2.97
	C173.53,310.03,173.73,309.66,173.94,309.3z"/>
<path class="st3" d="M120.49,200.51c-0.1-0.48-0.07-1.06-0.34-1.42c-0.72-1.01-2.38-2.59-2.23-2.77c1.41-1.73,2.44,0.14,3.72,0.56
	c0.7,0.23,2.04-0.15,2.46-0.72c0.53-0.72,0.56-1.91,0.51-2.89c-0.03-0.72-0.53-1.43-0.82-2.14c0.89,0.11,1.78,0.22,2.67,0.32
	c0.33,0.04,0.66,0.06,0.99,0.09c0.17,0.17,0.35,0.33,0.52,0.5c-0.16-0.18-0.31-0.37-0.47-0.55c-0.01-0.16-0.02-0.33-0.03-0.49
	c-0.13-1.38-0.26-2.75-0.39-4.13c2.14-0.18,2.09,1.55,2.58,2.87c0.52,1.41,1.25,1.47,2.62,0.65c1.93-1.16,4.14-1.87,6.22-2.77
	c-0.35,0.96-0.69,1.92-1.04,2.89c-1.35,1.3-2.16,3.07-4.6,3.24c-1.19,0.08-2.53,1.83-3.31,3.12c-2.35,3.93-4.66,7.92-5.08,12.65
	c-0.64-1.22-2.14-2.85-1.78-3.6C124.08,203,122.14,201.91,120.49,200.51z"/>
<path class="st1" d="M120.49,200.51c1.64,1.4,3.59,2.5,2.22,5.39c-0.36,0.75,1.14,2.38,1.78,3.6c0,1,0,2,0.01,3
	c-3,0.38-4.11,2.23-4.02,5.08c0.05,1.46,0.27,2.99-0.07,4.38c-0.31,1.26-1.26,2.37-1.92,3.55c-2.23-0.06-2.01-1.57-1.91-3.1
	c0.06-0.96-0.04-1.93-0.07-2.9c-0.01-0.67-0.02-1.33-0.04-2c1.54-1.29,1.49-2.28-0.51-3.01c-0.54-0.2-0.99-0.65-1.48-0.99
	c-0.01-0.99-0.01-1.97-0.02-2.96C116.48,207.2,118.49,203.85,120.49,200.51z"/>
<path class="st13" d="M194.43,358.42c-3.34-0.9-6.69-1.81-10.03-2.71c-0.37-0.36-0.74-0.72-1.11-1.09
	c4.83-0.93,9.66-1.88,14.49-2.79c4.17-0.79,8.34-1.53,12.51-2.3c-2.75,5.6-8.01,7.23-13.48,8.51
	C196.03,358.23,195.23,358.3,194.43,358.42z"/>
<path class="st12" d="M216.51,289.5c-0.9,3.35-3.35,6.52-1.17,10.25c0.16,0.27-0.14,0.97-0.42,1.3c-2.35,2.74-2.17,3.35,1.35,4.29
	c0.16,0.04,0.32,0.04,0.49,0.05c-2.15,3.74-5.53,6.11-9.16,8.18c-0.09-2.94-0.18-5.88-0.27-8.81c0.07-1.07,0.14-2.14,0.2-3.21
	c3.17-1.75,4.6-4.61,5.15-8.04c1.28-3,2.57-6.01,3.85-9.01c0.37,0,0.75,0.01,1.12,0.01c0,0.63,0,1.26,0,1.89
	C217.26,287.44,216.89,288.47,216.51,289.5z"/>
<path class="st15" d="M204.32,304.31c-6.31-1.01-12.64-1.96-18.93-3.07c-2.73-0.48-5.4-1.3-8.09-1.97c0.13-0.57,0.26-1.13,0.4-1.7
	c3-0.03,6.01-0.07,9.01-0.1c6.73,1.21,13.45,2.43,20.18,3.64c0,0-0.08,0.16-0.08,0.16C205.98,302.28,205.15,303.29,204.32,304.31z"
	/>
<path class="st16" d="M280.47,244.53c0.35-3.11,3.44-2.42,5.16-3.17c1.03-0.45,3.8,1.25,4.67,2.67c2.29,3.71,5.02,6.64,9.01,8.47
	c1.56,0.72,1.6,1.94,0.14,3.02C293.12,251.86,286.8,248.19,280.47,244.53z"/>
<path class="st6" d="M267.42,202.68c-0.75,2.98-3.02,5.37-5.07,4.52c-2.86-1.18-3.84,0.06-4.93,2.2c-0.3,0.59-1.3,0.82-1.98,1.22
	c-0.98-3.36-1.96-6.72-2.95-10.08C257.46,201.25,262.44,201.96,267.42,202.68z"/>
<path class="st3" d="M243.49,280.5c-2.34-1.22-4.62-1.69-6.89,0.26c-0.35,0.3-1.44,0.33-1.63,0.07c-0.31-0.42-0.44-1.48-0.16-1.75
	c2.09-1.95,1.91-6.31,6.46-5.79c1.17,0.13,2.46-1.5,3.81-2.05c1.75-0.72,3.61-1.17,5.42-1.74
	C248.16,273.17,245.83,276.83,243.49,280.5z"/>
<path class="st10" d="M194.55,389.6c-0.23-0.15-0.48-0.23-0.75-0.24c0.95-3.9,1.76-7.84,2.93-11.67c0.28-0.9,1.77-1.43,2.71-2.13
	c4.16,3.65,4.29,5.41,0.51,9.1C198.21,386.36,196.35,387.96,194.55,389.6z"/>
<path class="st16" d="M116.47,217.5c0.01,0.67,0.02,1.33,0.04,2c-0.67,0.33-1.35,0.66-2.02,1c-0.01,0.67-0.02,1.33-0.02,2
	c-0.74-0.04-1.49-0.08-2.23-0.12c-0.59-1.31-0.65-3.1-2.77-2.97c-4.3-1.21-1.96-4.3-1.92-6.74c2.31-0.71,4.62-1.42,6.93-2.13
	c0.01,0.99,0.01,1.97,0.02,2.96C112.82,215.99,114.3,216.92,116.47,217.5z"/>
<path class="st9" d="M47.46,234.67c0.33,1.77,1.92,3.95-1.09,4.81c-1.52,0.43-2.15,3.97-4.64,1.39c-0.19-0.2-1.71,0.41-2.13,1
	c-2.21,3.06-3.44,3.58-7.15,2.61C36.61,239.93,42.33,237.75,47.46,234.67z"/>
<path class="st12" d="M246.42,295.57c-2.23-0.11-1.87-1.83-2.01-3.24c1.39-1.37,2.78-2.73,4.17-4.1c0.11,0.73,0.22,1.46,0.33,2.19
	c0.5-0.4,1.1-0.72,1.48-1.21c0.39-0.5,0.58-1.17,0.86-1.76c3.28-2.75,2.36,1.01,3.19,2.06l0.03-0.06c-1.89,0.5-1.75,1.69-1.04,3.07
	l0.04-0.07c-2.01,0.49-0.97,1.89-0.89,3.01c-1.34,0.04-2.69,0.07-4.03,0.11l-0.04-0.05c0.01-0.65,0.11-1.31,0-1.94
	c-0.11-0.65-0.42-1.27-0.64-1.9c-0.4,0.48-0.97,0.9-1.14,1.44c-0.24,0.75-0.19,1.59-0.26,2.39L246.42,295.57z"/>
<path class="st17" d="M246.75,348.26c1.98-4.06,5.03-6.33,9.75-5.78c-0.68,5.5-1.13,5.92-6.29,5.9
	C249.05,348.38,247.9,348.31,246.75,348.26z"/>
<path class="st9" d="M137.49,190.49c0.35-0.96,0.69-1.92,1.04-2.89c1.66-0.7,3.31-1.41,4.97-2.11c-0.06,2.73,2.34,3.01,4.01,4.01
	C144.4,192.25,141.1,193.01,137.49,190.49z"/>
<path class="st4" d="M212.71,342.64c-0.06-1.06-0.12-2.11-0.18-3.17c1.41-1.01,2.82-2.03,4.23-3.04c0.25-0.07,0.5-0.09,0.76-0.06
	c-0.02,2.3-0.04,4.6-0.06,6.9C215.88,343.06,214.3,342.85,212.71,342.64z"/>
<path class="st4" d="M255.63,235.53c-3.87,0.55-4.41-2.97-6.14-5.03c0-0.33,0.01-0.65,0.01-0.98c1.14-1.57,2.74-1.49,3.66-0.22
	c1.16,1.6,1.72,3.63,2.54,5.48C255.68,235.03,255.66,235.28,255.63,235.53z"/>
<path class="st18" d="M157.6,406.32c2.42,0.49,2.08-2.17,3.38-2.96c0.93-0.56,1.88-1.11,2.82-1.66c-0.22,0.98-0.27,2.05-0.71,2.91
	c-1.05,2.03-2.28,3.96-3.44,5.92C158.96,409.13,158.28,407.72,157.6,406.32z"/>
<path class="st18" d="M83.74,299.41c3.15,0.79,6.31,1.55,9.45,2.39c0.37,0.1,0.6,0.68,0.9,1.03c-0.46,0.28-1.01,0.88-1.38,0.78
	c-3.46-0.89-6.89-1.91-10.33-2.88C82.84,300.29,83.29,299.85,83.74,299.41z"/>
<path class="st16" d="M216.76,336.43c-1.41,1.01-2.82,2.03-4.23,3.04c-0.2-0.03-0.39-0.07-0.59-0.1c-0.45-1.3-0.9-2.6-1.35-3.9
	c0-0.65-0.01-1.31-0.01-1.96C212.96,333.8,216,332.7,216.76,336.43z"/>
<path class="st16" d="M35.54,305.58c1.77-4.72,5.96-5.37,10.14-6.03C42.93,302.62,39.52,304.58,35.54,305.58z"/>
<path class="st9" d="M132.51,292.43c-0.02-2.45,2.36-2.52,3.42-2.34c2.15,0.36,2.79,2.36,2.53,4.5
	C136.48,293.87,134.49,293.15,132.51,292.43z"/>
<path class="st18" d="M190.36,377.47c0.42,0.25,0.99,0.4,1.22,0.77c0.29,0.47,0.31,1.11,0.44,1.68c-0.57-0.07-1.4,0.06-1.65-0.26
	c-0.47-0.59-0.59-1.45-0.86-2.19C189.8,377.46,190.08,377.46,190.36,377.47z"/>
<path class="st15" d="M96.27,314.43c-0.33,0.09-0.65,0.18-0.98,0.27c-1.03-0.32-2.06-0.65-3.09-0.97
	C93.95,311.65,95.07,313.3,96.27,314.43z"/>
<path class="st18" d="M251.25,287.44c-0.28,0.59-0.46,1.26-0.86,1.76c-0.38,0.49-0.98,0.81-1.48,1.21
	c-0.11-0.73-0.22-1.46-0.33-2.19C249.47,287.97,250.36,287.71,251.25,287.44z"/>
<path class="st16" d="M50.54,295.57c0.18-0.9,0.35-1.8,0.53-2.7c0.5,0.25,1,0.5,1.5,0.74C51.9,294.26,51.22,294.91,50.54,295.57z"/>
<path class="st16" d="M46.53,298.75c0.67-0.41,1.34-0.82,2-1.23C47.87,297.93,47.2,298.34,46.53,298.75z"/>
<path class="st7" d="M313.47,262.51c0.69,0.36,1.38,0.72,2.07,1.08C314.85,263.23,314.16,262.87,313.47,262.51z"/>
<path class="st16" d="M33.46,306.54c0.7-0.33,1.39-0.66,2.09-0.99C34.86,305.88,34.16,306.21,33.46,306.54z"/>
<path class="st4" d="M219.39,335.21c-0.41,0.39-0.82,0.79-1.23,1.18C218.57,336,218.98,335.6,219.39,335.21z"/>
<path class="st8" d="M207.75,316.45c-0.18-0.22-0.23-0.46-0.16-0.73c0.12,0.16,0.25,0.31,0.34,0.49
	C207.95,316.25,207.81,316.37,207.75,316.45z"/>
<path class="st16" d="M49.53,296.57c0.34-0.35,0.69-0.69,1.03-1.04C50.22,295.88,49.87,296.22,49.53,296.57z"/>
<path class="st16" d="M48.5,297.55c0.35-0.34,0.7-0.67,1.05-1.01C49.2,296.87,48.85,297.21,48.5,297.55z"/>
<path class="st19" d="M389.69,162.17c-3.27,0.42-6.53,1.06-9.81,1.22c-3.57,0.18-7.2,0.27-10.72-0.22
	c-9.79-1.36-19.62-2.61-29.25-4.75c-7.69-1.71-15.53-3.28-22.68-6.88c-6.48-3.26-12.93-6.59-19.28-10.1
	c-2.08-1.15-3.61-1.24-5.33,0.42c-6.54,6.32-13.28,12.45-18.81,19.74c-0.9,1.18-2.02,2.22-3.14,3.21c-0.52,0.46-1.28,0.64-1.93,0.95
	c0.09-0.78,0.02-1.63,0.31-2.34c3.89-9.5,7.78-19,11.77-28.46c1.22-2.91,1.17-5.08-0.87-8c-4.37-6.27-7.24-13.29-7.59-21.21
	c-0.21-4.76-1.49-9.46-1.81-14.21c-0.58-8.47,0.29-16.87,1.95-25.19c1.81-9.07,3.71-18.11,7.84-26.5
	c3.48-7.09,9.02-12.17,15.7-16.12c9.9-5.86,20.81-8.39,32.13-9.23c7.76-0.57,15.61-1.36,23.34-0.87
	c15.46,0.99,31.06,1.48,46.08,5.89c4.39,1.29,8.47,3.69,12.9,4.75c10.95,2.64,19.37,9.21,27,16.9c2.85,2.87,5.26,6.53,6.79,10.28
	c3.62,8.89,6.93,18.16,6.97,27.75c0.05,11.92-0.5,23.95-4.27,35.53c-2.45,7.54-4.13,15.33-8.17,22.31
	c-3.85,6.64-8.23,12.4-15.26,16.35c-5.8,3.26-11.34,6.66-18.01,7.61c-5.23,0.74-10.48,1.29-15.72,1.92
	C389.75,162.68,389.72,162.42,389.69,162.17z M314.99,67.33c4.69,4.75,8.98,9.13,13.33,13.47c0.93,0.93,1.91,2.08,3.07,2.43
	c1.1,0.34,2.99,0.21,3.63-0.51c1.05-1.19,0.43-2.69-0.86-3.88c-4.88-4.5-9.59-9.18-14.52-13.62c-1.98-1.79-2-3.34-0.8-5.55
	c2.45-4.53,4.7-9.17,6.93-13.81c1.22-2.53,2.41-5.1,3.3-7.76c0.29-0.85-0.21-2.78-0.72-2.92c-1.03-0.3-2.61-0.07-3.41,0.6
	c-0.91,0.76-1.2,2.25-1.78,3.41c-2.82,5.62-5.63,11.25-8.53,16.82c-0.17,0.33-1.34,0.54-1.7,0.3c-0.8-0.54-1.54-1.32-2.04-2.16
	c-3.17-5.38-6.44-10.71-9.31-16.24c-1.07-2.07-2.31-2.87-4.26-2.2c-2.79,0.95-1.36,3.17-0.67,4.54c1.61,3.24,3.56,6.32,5.53,9.37
	c2.69,4.17,5.58,8.21,8.26,12.38c0.43,0.67,0.68,1.97,0.32,2.56c-2.37,3.96-4.99,7.76-7.42,11.69c-1.83,2.95-3.51,6-5.2,9.03
	c-1.07,1.93,0.13,3.09,1.78,3.04c1.22-0.04,2.87-0.92,3.52-1.94C307.31,80.27,310.97,74.02,314.99,67.33z M322.72,142.44
	c0.7-0.77,1.94-1.82,2.79-3.12c1.72-2.63,3.21-5.41,4.83-8.1c4.34-7.23,8.75-14.41,13.01-21.68c1.66-2.84,2.98-5.88,4.51-8.8
	c0.81-1.55,0.91-3.19-0.83-3.75c-1.15-0.37-3.08-0.03-3.92,0.77c-1.24,1.19-1.81,3.07-2.69,4.64c-0.81,1.44-1.74,2.81-2.45,4.29
	c-0.73,1.53-1.52,1.59-2.46,0.31c-1.96-2.66-3.91-5.33-5.78-8.06c-1.11-1.62-2.12-4.22-4.33-3c-2.02,1.11-0.87,3.55,0.02,5.34
	c0.67,1.33,1.42,2.62,2.22,3.88c1.24,1.96,2.37,4.02,3.86,5.77c2.29,2.69,2.13,5.49,0.56,8.21c-1.89,3.29-4.14,6.37-6.23,9.54
	c-2,3.04-4.19,5.98-5.9,9.17C318.73,140.09,319.99,142.39,322.72,142.44z M394.67,107.43c-0.31-0.87-0.43-2.32-1-2.53
	c-0.93-0.34-2.28-0.11-3.23,0.35c-0.81,0.39-1.43,1.37-1.91,2.22c-1.13,2-2.03,4.14-3.2,6.11c-0.56,0.95-1.52,1.67-2.3,2.5
	c-0.82-0.79-1.77-1.47-2.43-2.38c-2.04-2.8-3.88-5.75-6-8.48c-0.56-0.72-1.89-0.85-2.86-1.25c-0.26,1.16-0.71,2.32-0.7,3.48
	c0,0.75,0.62,1.52,1.05,2.23c2.17,3.52,4.32,7.06,6.6,10.52c1.25,1.91,2.3,3.56,0.24,5.69c-0.97,1.01-1.26,2.65-2.06,3.87
	c-3.42,5.26-6.95,10.45-10.35,15.73c-1.02,1.58-1.88,3.5,0.51,4.65c1.91,0.92,3.33,0.17,4.52-1.74
	c7.77-12.43,15.37-24.95,21.97-38.05C393.98,109.46,394.26,108.5,394.67,107.43z M406.91,53.91c-0.62-1.08-0.98-2.5-1.78-2.82
	c-0.7-0.28-2.21,0.43-2.8,1.16c-1.53,1.88-2.77,4-4.09,6.06c-1.02,1.59-1.96,3.23-2.94,4.85c-1.32-1.67-2.71-3.29-3.95-5.02
	c-1.54-2.15-2.84-4.5-4.52-6.52c-0.53-0.64-2.27-0.98-2.95-0.59c-0.71,0.41-1.18,1.92-1.06,2.86c0.13,1.06,1,2.05,1.61,3.03
	c2.28,3.63,4.46,7.35,6.94,10.84c1.18,1.65,1.17,2.96,0.18,4.52c-2.63,4.16-5.23,8.35-7.88,12.5c-1.77,2.78-3.79,5.42-5.38,8.29
	c-1.12,2.02,0.13,3.83,2.29,3.29c1.41-0.35,3-1.51,3.75-2.76c6.86-11.46,13.58-23,20.28-34.56
	C405.53,57.51,406.1,55.77,406.91,53.91z M368.96,57.51c-6.15,0-8.4-3.05-6.63-8.88c0.48-1.57,0.89-3.18,1.01-4.8
	c0.04-0.62-0.71-1.62-1.32-1.85c-0.53-0.2-1.7,0.26-2.02,0.77c-2.48,4.03-4.25,8.37-3.4,13.18c0.5,2.84,1.79,5.37,5.35,5.64
	c2.12,0.16,4.21,0.72,6.34,0.91c3.31,0.29,3.66,0.69,2.69,4.02c-1.01,3.48-2.11,6.95-3.16,10.42c-0.52,1.72-0.63,3.52,1.3,4.27
	c2.41,0.94,3.11-1.14,3.9-2.78c0.21-0.44,0.33-0.93,0.44-1.41c1.86-8.18,3.74-16.35,5.53-24.54c0.35-1.6,0.58-3.29,0.43-4.9
	c-0.09-0.97-1.04-1.85-1.6-2.77c-0.92,0.61-2.35,1.03-2.66,1.86c-0.81,2.13-1.27,4.42-1.6,6.68
	C372.98,57.2,372.75,57.51,368.96,57.51z M351.49,58.24c0.02-6.95-4.24-11.57-10.63-11.78c-6.96-0.23-13.14,4.85-13.31,13.01
	c-0.14,6.6,5.33,10.41,11.82,10.92C346.16,70.93,351.47,65.23,351.49,58.24z M402.94,117.45c0.28-0.23,1.11-0.59,1.39-1.2
	c0.54-1.18,1.02-2.5,1.09-3.78c0.46-8.51,3.42-16.36,6.18-24.26c0.87-2.48,1.98-4.89,2.59-7.43c0.27-1.09-0.06-2.89-0.82-3.51
	c-0.69-0.57-2.4-0.2-3.54,0.14c-3.04,0.9-3.61,3.73-4.2,6.25c-2.32,9.97-3.58,20.16-6.02,30.12
	C399.07,115.96,400.41,117.49,402.94,117.45z M420.52,60.51c0-0.01,0-0.01,0-0.02c-2.16,0-4.31,0.01-6.47,0
	c-1.83-0.01-3.48,0.42-3.43,2.62c0.04,1.87,1.52,2.36,3.17,2.37c1.16,0.01,2.32-0.02,3.48,0.03c3.45,0.17,6.94,0.15,10.34,0.65
	c2.01,0.29,3.27,0.07,3.75-1.97c0.48-2.03-0.59-3.49-2.9-3.64C425.84,60.38,423.18,60.51,420.52,60.51z M358.08,113.51
	c0,0,0-0.01,0-0.01c-2.33,0-4.67,0.09-6.99-0.03c-2.15-0.1-3.22,1.19-3.25,2.93c-0.04,1.99,1.77,2,3.32,2.09
	c4.61,0.28,9.22,0.63,13.84,0.94c1.92,0.13,3.31-0.51,3.45-2.65c0.14-2-0.81-3.21-2.87-3.26
	C363.08,113.46,360.58,113.51,358.08,113.51z M400.58,124.53c-1.86-0.09-4.35,1.9-3.92,3.47c0.27,0.98,1.49,2.11,2.5,2.38
	c1.96,0.52,3.23-0.85,3.32-3.12C402.53,125.9,402.48,124.56,400.58,124.53z"/>
<path class="st6" d="M217.64,286.41c0-0.63,0-1.26,0-1.89c1.41-0.13,3.31,0.29,2.29-2.36c-0.12-0.31,1.01-1.1,1.56-1.66
	c3.76-1.84,4.09-3.65,1.07-5.91c-0.31-1.42-0.9-2.84-0.86-4.24c0.09-2.95,0.51-5.89,0.8-8.84c2.49-3.33,2.47-3.47-0.68-3.87
	c-0.08-0.72-0.17-1.43-0.25-2.15c0.01-0.52,0.02-1.05,0.03-1.57c0.47-1.8,0.95-3.6,1.42-5.4c0.4-1.65,2.52-3.12,0.55-5.03
	c0.07-0.99,0.14-1.97,0.2-2.96c0.56-0.84,1.45-1.61,1.63-2.53c1.12-5.63,2.06-11.29,3.12-16.93c0.11-0.57,0.65-1.05,0.99-1.58
	c6.36,0.75,12.73,1.51,19.09,2.26c0.08,0.17,0.11,0.35,0.11,0.54c-3.43,1.58-1.84,4.72-2.25,7.24c-0.91,0.55-2.64,1.19-2.59,1.63
	c0.32,2.81-2.87,5.46-0.39,8.3c0.03,2.07,0.05,4.15,0.08,6.22c-0.33,1.25-0.66,2.51-0.99,3.76c-0.02,0.35-0.03,0.71-0.05,1.06
	c-0.05,0.99-0.09,1.98-0.14,2.97c-0.28,0.36-0.56,0.72-0.83,1.07c-0.59,1.91-1.18,3.82-1.77,5.73c-2.12,6.09-4.09,12.23-7.35,17.89
	c-1.43,2.48-1.92,5.5-2.84,8.27c-3.03,0.35-6.06,0.7-9.09,1.06C219.54,287.14,218.59,286.77,217.64,286.41z M234.32,264.28
	c-0.09-0.12-0.68-0.9-1.27-1.67c-0.51,0.69-1.28,1.31-1.49,2.08c-0.47,1.71-0.74,3.49-0.9,5.25c-0.04,0.43,0.61,1.22,1.05,1.31
	c0.46,0.09,1.43-0.36,1.52-0.74C233.67,268.79,233.88,267.01,234.32,264.28z M239.51,235.23c0-1.57,0.09-2.09-0.03-2.56
	c-0.14-0.53-0.46-1.01-0.71-1.51c-0.4,0.48-0.91,0.91-1.18,1.45c-0.2,0.41-0.18,1-0.09,1.47c0.26,1.34,0.61,2.66,0.93,3.99
	C238.92,236.81,239.39,235.55,239.51,235.23z"/>
<path class="st17" d="M306.42,245.66c-1.98-0.74-3.96-1.49-5.94-2.23c-0.75-0.6-1.41-1.43-2.26-1.77
	c-7.84-3.11-15.71-6.14-23.57-9.2c-0.69-0.57-1.39-1.15-2.08-1.72c-0.7-0.07-1.4-0.14-2.1-0.21c-0.64-0.28-1.28-0.57-1.92-0.85
	c-0.62-0.08-1.24-0.16-1.86-0.24c-1.54-0.92-3.01-1.99-4.63-2.72c-1.65-0.74-2.25-1.18-0.5-2.64c0.48-0.4-0.07-2.02-0.15-3.08
	c0.01-1.25,0.02-2.5,0.02-3.75c-0.02-0.26,0-0.52,0.05-0.77c2,0.34,4.01,0.67,6.01,1.01c11.82,2.97,23.63,5.95,35.46,8.9
	c0.8,0.2,1.65,0.15,2.48,0.22c1.67,0.69,3.34,1.39,5.02,2.08c0.67,0.31,1.33,0.62,2,0.93c1.39,0.94,2.77,1.89,4.16,2.83
	c-0.6,0.28-1.35,0.94-1.78,0.77c-3.74-1.43-4.46,1.14-5.31,3.75C308.55,239.89,307.46,242.77,306.42,245.66z"/>
<path class="st16" d="M137.49,190.49c3.62,2.51,6.91,1.75,10.01-0.99c3.71-0.82,5.39,0.09,8.61,0.39c2.77,0.26,4.77,1.4,6.84,2.67
	c1.68,1.03,3.03,2.61,4.52,3.94c0.66,4.15,1.37,8.29,1.96,12.45c0.26,1.83,0.21,3.66-1.91,4.56c-0.61-1.65,1.39-4.22-1.74-4.98
	c-0.11-1.16-0.23-2.33-0.34-3.49c0.08-1.32,0-2.52-1.78-2.51c-0.2-0.2-0.28-0.44-0.23-0.72c-0.45-0.76-0.91-1.51-1.36-2.27
	c-1.56-1.35-3.11-2.7-4.67-4.05c-2.08-1.73-4.33-2.2-6.82-0.93c-4.02-2.41-8.1-1.35-11.43,0.92c-2.93,1.99-5.52,4.88-7.41,7.9
	c-4.53,7.23-4.42,16.78,2.93,22.57c1.77,1.4,3.88,2.37,5.83,3.54c-0.84,2.71,1.96,2.69,3,3.99c-0.11,1.81-1.17,2.54-2.61,1.56
	c-3.3-2.24-6.96-3.91-10.19-6.19c-1.58-1.11-2.39-3.39-3.42-5.21c-1.95-3.45-3.43-7.05-2.77-11.17c0-1,0-2-0.01-3
	c0.42-4.72,2.73-8.72,5.08-12.65c0.77-1.29,2.12-3.04,3.31-3.12C135.33,193.56,136.13,191.79,137.49,190.49z"/>
<path class="st15" d="M187.63,250.46c-0.06-0.65-0.13-1.31-0.19-1.96c-0.29-2.01-0.58-4.01-0.87-6.02
	c-0.76-5.88-1.53-11.76-2.28-17.64c-0.15-1.15-0.45-2.33-0.29-3.45c0.51-3.71-0.71-5.59-4.69-6.23c-2.84-0.46-4.81-2.81-5.43-5.83
	c-0.1-0.49,0.36-1.09,0.56-1.64c0.41,0.21,0.85,0.36,1.21,0.62c1.95,1.4,3.87,2.83,5.81,4.25c3.26,0.91,5.71-0.2,7.63-2.92
	c1.02-1.45,2.26-2.75,3.4-4.11c0.56,0.2,1.12,0.39,1.68,0.59c-0.15,3.79-2.09,7.05-5.2,8.37c-3.15,1.34-3.15,3.1-2.76,5.59
	c0.07,0.48,0.25,0.95,0.38,1.43c0.06,0.66,0.13,1.32,0.19,1.99c0.5,4.59,0.92,9.2,1.54,13.77c0.33,2.45,1,4.86,1.52,7.28
	c0.09,1.06,0.19,2.12,0.28,3.18c0.14,0.59,0.28,1.18,0.42,1.78c0.38,3.21,0.66,6.43,1.19,9.61c0.16,0.94,1.02,1.77,1.57,2.65
	c0.8-0.64,1.6-1.28,2.41-1.92l0.04-0.17c1.97-1.87,3.94-3.74,5.91-5.62c0.45-0.87,0.9-1.73,1.34-2.6c1.29-3.01,2.56-6.04,3.91-9.03
	c0.29-0.64,0.88-1.14,1.33-1.7c0.41,0.68,1.18,1.37,1.15,2.02c-0.09,1.96-0.5,3.9-0.78,5.85c-1.43,2.78-2.87,5.56-4.3,8.34
	c-4.7,5.2-10.35,9.1-16.6,12.18c-1.08,0.11-2.15,0.22-3.23,0.34c-1.02,0.2-2.04,0.39-3.07,0.59c-1.27-0.08-2.53-0.15-3.8-0.23
	c-0.23-0.7-0.47-1.4-0.7-2.11c1.86-0.46,3.72-0.92,5.58-1.38c2.05-0.56,4.1-1.11,6.15-1.67c0.39-0.61,1.19-1.28,1.11-1.83
	C189.14,258.7,188.36,254.58,187.63,250.46z"/>
<path class="st10" d="M248.6,221.76c-6.36-0.75-12.73-1.51-19.09-2.26c1.05-6.78,3.11-12.92,10.04-16.01
	c-0.44,2.57-0.96,5.14-1.29,7.73c-0.25,1.98,0.9,1.7,2.11,1.06c0.75,0.36,1.51,0.73,2.26,1.09l-0.07,0.01
	c0.36,0.6,0.73,1.2,1.09,1.8c0.27-0.54,0.54-1.08,0.81-1.63c0.57-1.96,1.14-3.91,1.71-5.87c0.52-1.21,1.04-2.43,1.56-3.64
	c0.62,0.34,1.24,0.69,1.87,1.03c-0.36,5.5-0.72,10.99-1.09,16.49C248.52,221.57,248.6,221.76,248.6,221.76z"/>
<path class="st15" d="M209.06,204.2c3.02,0.75,5.11,1.22,7.17,1.8c1.27,0.35,2.66,0.64,3.67,1.39c0.75,0.56,0.97,1.82,1.43,2.77
	c-1,0.46-2.14,1.49-2.98,1.29c-5.3-1.32-10.55-2.81-15.75-4.47c-1.65-0.53-2.75-1.78-1.59-3.88c2.8-5.06,5.45-10.21,8.26-15.27
	c0.29-0.52,1.27-0.66,1.92-0.98c0.11,0.79,0.54,1.71,0.28,2.34c-0.84,1.97-1.92,3.84-2.95,5.72c-0.95,1.75-1.99,3.45-2.88,5.23
	c-0.25,0.49-0.1,1.17-0.14,1.77c0.6-0.1,1.24-0.09,1.79-0.31c3.23-1.3,6.42-2.67,9.65-3.96c1.85-0.74,3.71-1.47,5.63-1.99
	c0.57-0.15,1.33,0.42,2.01,0.66c-0.35,0.67-0.52,1.64-1.07,1.96c-1.42,0.83-3,1.4-4.54,2.02C216.04,201.46,213.1,202.6,209.06,204.2
	z"/>
<path class="st2" d="M205.1,226.11c-1.05,3.15-1.98,6.1-3.05,8.99c-0.18,0.47-1,0.98-1.51,0.97c-0.35-0.01-0.93-0.86-0.98-1.38
	c-0.42-3.92-0.54-7.89-1.14-11.78c-0.42-2.73-1.61-5.33-2.15-8.05c-0.32-1.6-0.02-3.31,0-4.97c1.61,0.99,4.06,1.62,4.66,3.04
	C202.7,217.11,203.74,221.6,205.1,226.11z"/>
<path class="st20" d="M204.31,256.95c1.43-2.78,2.87-5.56,4.3-8.34c4.57,0.17,6.59,3.52,8.6,6.89c-0.63,1.97-1.27,3.94-1.9,5.91
	c-2.2-0.05-4.4-0.1-6.6-0.16l-0.14,0.23l0.1-0.24c-0.35-0.3-0.7-0.61-1.05-0.91l0,0c-0.63-0.36-1.26-0.72-1.89-1.08
	c-0.42-0.57-0.84-1.14-1.26-1.7C204.46,257.33,204.4,257.13,204.31,256.95z"/>
<path class="st2" d="M201.66,254.06c-1.97,1.87-3.94,3.74-5.91,5.62c-0.74-1.93,1.15-5.51-3.23-5.16c-0.01-1.34-0.02-2.68-0.03-4.02
	c2.65,0.2,4.15-0.81,4-3.67c-0.04-0.83-0.17-1.72,0.08-2.47c0.21-0.65,0.9-1.14,1.38-1.71c0.5,0.54,1.37,1.04,1.43,1.62
	c0.19,1.97-0.09,4.01,0.21,5.96c0.12,0.83,1.22,1.52,1.88,2.27C201.53,253.01,201.6,253.53,201.66,254.06z"/>
<path class="st4" d="M241.54,254.56c0.28-0.36,0.56-0.72,0.83-1.07c3.29-1.28,6.4-2.62,6.69-6.94c0.09-1.27,1.2-2.6,2.87-1.72
	c1.56,0.82,1.98,1.98,0.75,3.66c-0.7,0.96-0.63,2.46-1.24,3.51c-1.02,1.77-2.03,3.8-3.62,4.89c-0.77,0.52-2.84-0.86-4.32-1.39
	C242.85,255.18,242.19,254.87,241.54,254.56z"/>
<path class="st21" d="M246.46,229.54c0.41-2.52-1.18-5.66,2.25-7.24c0.28,0.57,0.89,1.2,0.8,1.7c-1.35,7.4-1.88,15.04-5.96,21.7
	c-0.03-2.07-0.05-4.15-0.08-6.22C245.6,236.5,246.48,233.15,246.46,229.54z"/>
<path class="st12" d="M242.63,213.37c-0.75-0.36-1.51-0.73-2.26-1.09c0.38-2.92,0.76-5.85,1.15-8.77c1.34-0.65,2.68-1.93,4.02,0.01
	C244.57,206.8,243.6,210.08,242.63,213.37z"/>
<path class="st12" d="M248.52,221.57c0.36-5.5,0.72-10.99,1.09-16.49c3.34,5.18,2.26,10.54,0.59,15.89
	C250.09,221.31,249.1,221.37,248.52,221.57z"/>
<path class="st19" d="M223.78,240.53c-0.07,0.99-0.14,1.97-0.2,2.96c-0.92,0.35-1.82,0.87-2.77,1c-1.71,0.24-3.03-0.54-3.15-2.34
	c-0.12-1.85,1.21-2.71,2.88-2.63C221.63,239.58,222.7,240.17,223.78,240.53z"/>
<path class="st18" d="M242.63,213.37c0.97-3.28,1.93-6.57,2.9-9.85c0.23,0.04,0.46,0.02,0.68-0.05c-0.01,1.41-0.02,2.82-0.04,4.23
	c-0.57,1.96-1.14,3.91-1.71,5.87c-0.64-0.06-1.27-0.12-1.91-0.18L242.63,213.37z"/>
<path class="st0" d="M192.49,250.49c0.01,1.34,0.02,2.68,0.03,4.02c0.53,2.1,0.51,4.53,3.2,5.33c-0.8,0.64-1.6,1.28-2.41,1.92
	c-0.54-0.88-1.41-1.7-1.57-2.65c-0.53-3.18-0.82-6.4-1.19-9.61C191.2,249.83,191.84,250.16,192.49,250.49z"/>
<path class="st18" d="M241.52,203.5c-0.38,2.92-0.76,5.85-1.15,8.77c-1.21,0.64-2.36,0.92-2.11-1.06c0.32-2.59,0.85-5.15,1.29-7.73
	C240.21,203.49,240.86,203.5,241.52,203.5z"/>
<path class="st12" d="M261.43,217.25c-0.01,1.25-0.02,2.5-0.02,3.75c-1.15-0.11-2.33-0.07-3.43-0.37c-0.8-0.22-1.47-0.91-2.2-1.38
	c0.73-0.56,1.39-1.34,2.22-1.61C259.07,217.29,260.28,217.36,261.43,217.25z"/>
<path class="st19" d="M241.54,254.56c0.65,0.31,1.31,0.63,1.96,0.94c0.01,2.57-0.54,4.71-3.73,4.79
	C240.36,258.38,240.95,256.47,241.54,254.56z"/>
<path class="st19" d="M223.03,248.52c-0.47,1.8-0.95,3.6-1.42,5.4C219.67,250.18,219.85,249.49,223.03,248.52z"/>
<path class="st18" d="M190.13,247.72c-0.09-1.06-0.19-2.12-0.28-3.18c0.22,0.04,0.43,0.03,0.65-0.02l0.5-0.03l0.5,0
	C191.03,245.58,190.58,246.65,190.13,247.72z"/>
<path class="st3" d="M170.49,194.5c-1,0.67-2,1.33-3,2C167.46,194.29,169.05,194.5,170.49,194.5z"/>
<path class="st12" d="M246.18,207.69c0.01-1.41,0.02-2.82,0.04-4.23c0.51,0.19,1.02,0.39,1.52,0.58
	C247.22,205.26,246.7,206.48,246.18,207.69z"/>
<path class="st3" d="M240.69,268.73c0.23-0.4,0.37-0.64,0.52-0.89c0.32,0.22,0.68,0.4,0.92,0.68c0.06,0.07-0.29,0.68-0.39,0.67
	C241.38,269.12,241.05,268.9,240.69,268.73z"/>
<path class="st0" d="M186.79,223.49c-0.06-0.66-0.13-1.32-0.19-1.99c0.54,0.38,1.08,0.76,1.62,1.13
	C187.74,222.92,187.26,223.2,186.79,223.49z"/>
<path class="st4" d="M252.23,237.14c-0.18,0.41-0.33,0.9-0.39,0.89c-0.36-0.07-0.71-0.25-1.06-0.4c0.11-0.26,0.21-0.73,0.33-0.73
	C251.47,236.88,251.84,237.04,252.23,237.14z"/>
<path class="st0" d="M201.66,254.06c-0.07-0.52-0.13-1.05-0.2-1.57c0.51-0.34,1.03-0.68,1.54-1.03
	C202.56,252.32,202.11,253.19,201.66,254.06z"/>
<path class="st0" d="M191.49,244.5c0,0-0.5,0-0.5,0s-0.5,0.03-0.5,0.03C190.82,244.52,191.16,244.51,191.49,244.5z"/>
<path class="st3" d="M249.5,229.51c0,0.33-0.01,0.65-0.01,0.98C249.49,230.17,249.49,229.84,249.5,229.51z"/>
<path class="st21" d="M242.51,250.51c0.02-0.35,0.03-0.71,0.05-1.06C242.55,249.8,242.53,250.16,242.51,250.51z"/>
<path class="st0" d="M192.49,205.53c-1.14,1.37-2.38,2.66-3.4,4.11c-1.91,2.73-4.36,3.83-7.63,2.92c2.42-1.78,5.77-2.24,7.12-5.56
	c0.53-1.29,0.83-1.84-0.51-2.75c-1.88-1.27-3.41-2.67-6.01-2.96c-2.96-0.33-5.82-1.84-8.62-3.08c-0.46-0.2-0.74-1.78-0.48-2.49
	c1.88-5.22,6.04-7.88,11.16-9.08c0.89-0.21,2.67,0.8,3.1,1.69c1.05,2.18,1.57,4.62,2.27,6.97
	C190.51,198.71,191.49,202.12,192.49,205.53z"/>
<path class="st3" d="M176.91,267.72c0.23,0.7,0.47,1.4,0.7,2.11c-0.04,0.56-0.08,1.11-0.11,1.67c-2.16,1.69-4.74,3.05-6.35,5.16
	c-1.47,1.93-2.75,3.1-5.21,2.88c-0.78-0.07-1.6,0.38-2.41,0.42c-0.89,0.05-1.78-0.1-2.68-0.16c0.44-0.83,0.71-1.83,1.35-2.45
	c1.5-1.46,2.16-3.03,2.43-5.19c0.49-3.85,1.37-7.55,1.07-11.56c-0.21-2.76,0.53-6.62,3.51-7.62c2.54-0.86,5.79-0.12,8.61,0.48
	c3.28,0.69,6.43,2,9.64,3.04c0,1,0.01,2,0.01,3c-2.93-0.26-4.24,1.09-3.99,4c-0.33,0-0.67,0-1,0c-0.81-0.57-4.84-5.19-4.96-5.97
	c-0.26-1.62-0.9-3.4-2.65-2.54c-1.87,0.92-5.36-0.97-5.57,3.32c-0.18,3.81-1.29,7.56-1.76,11.37c-0.21,1.7-0.6,4.11,1.86,4.35
	c0.74,0.07,1.73-2.29,2.58-3.55c0.18-0.27,0.28-0.6,0.38-0.92C173.33,266.32,173.33,266.32,176.91,267.72z"/>
<path class="st11" d="M206.89,301.1c-6.73-1.21-13.45-2.43-20.18-3.64c6.88-0.97,13.76-1.94,20.64-2.9
	C207.19,296.74,207.04,298.92,206.89,301.1z"/>
<path class="st22" d="M221.49,280.5c-0.55,0.57-1.68,1.35-1.56,1.66c1.02,2.64-0.88,2.23-2.29,2.36c-0.37,0-0.75-0.01-1.12-0.01
	c1.67-7.67,3.34-15.34,5.01-23.02c0.32,0,0.65,0.01,0.97,0.01c-0.29,2.95-0.71,5.89-0.8,8.84c-0.04,1.4,0.55,2.83,0.86,4.24
	C222.21,276.56,221.85,278.53,221.49,280.5z"/>
<path class="st16" d="M156.49,232.51c-0.94,0.28-1.89,0.54-2.83,0.84c-2.53,0.8-4.96,0.82-7.18-0.87c1.31-0.17,2.63-0.52,3.94-0.48
	c1.81,0.06,6.85-2.67,8.01-4.58c1.08-0.34,2.16-0.68,3.23-1.03c1.43,3.76,1.43,3.75-1.92,4.94
	C158.65,231.72,157.57,232.12,156.49,232.51z"/>
<path class="st6" d="M165.77,208.54c3.14,0.76,1.13,3.33,1.74,4.98c-0.06,1.96-0.12,3.92-0.17,5.89c-2.54,0.28-2.99,2-2.81,4.13
	c-0.97,0.69-1.94,1.38-2.91,2.07c-0.22-0.18-0.43-0.37-0.65-0.55C163.76,219.9,166.04,214.59,165.77,208.54z"/>
<path class="st19" d="M148.56,246.56c5.19-0.02,5.19-0.02,5.9,3.94c-1,0.97-2,1.94-3,2.91c-3.71-1.52-3.71-1.52-2.91-6.84
	L148.56,246.56z"/>
<path class="st19" d="M151.48,263.67c-1.87-0.16-4.02-0.26-3.79-2.84c0.18-1.99,1.64-3.2,3.76-3.3c0.66-0.03,1.33,0.07,1.99,0.1
	c0.33,0.62,0.67,1.24,1,1.86c0.01,0.67,0.03,1.33,0.04,2C153.48,262.22,152.48,262.94,151.48,263.67z"/>
<path class="st19" d="M147.54,275.48c-0.34-0.89-1-1.81-0.93-2.67c0.08-1,0.59-2.48,1.31-2.77c0.94-0.38,2.37-0.02,3.41,0.43
	c0.8,0.35,1.31,1.34,1.96,2.04c-0.92,0.93-1.71,2.07-2.8,2.7C149.71,275.66,148.54,275.42,147.54,275.48z"/>
<path class="st19" d="M140.48,273.67c-3.1-0.99-4.15-3.31-2.1-4.89c0.89-0.69,2.58-1.19,3.46-0.79c0.83,0.38,1.29,2.01,1.5,3.16
	c0.12,0.65-0.59,1.45-0.93,2.18C141.77,273.44,141.13,273.55,140.48,273.67z"/>
<path class="st19" d="M206.89,301.1c0.15-2.18,0.31-4.36,0.46-6.54c1.77-0.35,3.55-0.7,5.32-1.04c-0.54,3.43-1.98,6.29-5.15,8.04
	c-0.13-0.36-0.36-0.46-0.71-0.29L206.89,301.1z"/>
<path class="st0" d="M187.48,259.5c0-1-0.01-2-0.01-3c0.23-2.01-2.57-4.1,0.17-6.04c0.73,4.12,1.51,8.24,2.12,12.38
	c0.08,0.54-0.72,1.22-1.11,1.83c0,0-0.2-0.21-0.2-0.21C188.12,262.8,187.8,261.15,187.48,259.5z"/>
<path class="st3" d="M208.71,261.25c2.2,0.05,4.4,0.1,6.6,0.16c0.1,0.34,0.35,0.93,0.27,0.98
	C212.71,264.11,211.64,263.92,208.71,261.25z"/>
<path class="st16" d="M164.53,223.54c-0.18-2.13,0.26-3.85,2.81-4.13C167.7,221.66,167.17,223.32,164.53,223.54z"/>
<path class="st0" d="M186.57,242.48c0.29,2.01,0.58,4.01,0.87,6.02C184.97,246.86,184.83,245.87,186.57,242.48z"/>
<path class="st17" d="M222.5,261.5c-0.32,0-0.65-0.01-0.97-0.01c0.1-1.29,0.2-2.57,0.29-3.86C224.97,258.04,225,258.18,222.5,261.5z
	"/>
<path class="st3" d="M154.48,261.49c-0.01-0.67-0.03-1.33-0.04-2c1.39,0.04,2.27,0.57,1.8,2.11
	C156.21,261.73,155.1,261.54,154.48,261.49z"/>
<path class="st6" d="M161.66,226.4c-1.08,0.34-2.16,0.68-3.23,1.03l-0.09-0.11c0.88-0.75,1.76-1.51,2.64-2.26
	c0.22,0.18,0.43,0.37,0.65,0.55C161.61,225.88,161.62,226.14,161.66,226.4z"/>
<path class="st18" d="M177.5,271.49c0.04-0.56,0.08-1.11,0.11-1.67c1.27,0.08,2.53,0.15,3.8,0.23
	C180.77,272.35,178.87,271.2,177.5,271.49z"/>
<path class="st18" d="M184.48,269.47c1.08-0.11,2.15-0.22,3.23-0.34C186.79,270.78,185.74,271.16,184.48,269.47z"/>
<path class="st3" d="M204.48,257.53c0.42,0.57,0.84,1.14,1.26,1.71C205.32,258.66,204.9,258.1,204.48,257.53z"/>
<path class="st3" d="M205.74,259.23c0.63,0.36,1.26,0.72,1.9,1.08C207,259.95,206.37,259.59,205.74,259.23z"/>
<path class="st3" d="M207.63,260.32c0.35,0.3,0.7,0.61,1.05,0.91C208.33,260.93,207.98,260.62,207.63,260.32z"/>
<path class="st21" d="M67.71,258.59c-2.09,1.92-4.19,3.84-6.28,5.76c-3.26,2.15-6.52,4.31-9.8,6.45c-2.62,1.71-5.14,3.65-7.93,5.03
	c-3.77,1.87-6.86-0.22-7.25-4.35c-0.44-4.74,1.3-8.23,5.1-11.07c3.43-2.57,6.51-5.6,9.87-8.27c2.57-2.05,5.35-3.84,8.03-5.75
	c0.3,0.58,0.46,1.32,0.92,1.7c2.39,1.99,3.45,4.35,3.21,7.56C63.38,258.37,65.68,258.51,67.71,258.59z"/>
<path class="st14" d="M83.39,249.14c-0.62,0.04-1.24,0.07-1.86,0.11c0.04-0.65-0.15-1.42,0.14-1.93c2.55-4.58-3.72-5.72-3.68-9.4
	c0.01-0.49-1.79-1-2.76-1.51c1.16-1.27,2.31-2.54,3.47-3.81c5.18-2.32,10.34-4.69,15.55-6.94c2.69-1.17,5.47-2.13,8.22-3.18
	c0.46,2.88,3.1,5.1,2.36,8.43c-0.16,0.74,1.16,1.81,1.81,2.73c-1.19,0.84-2.34,1.74-3.57,2.52c-6.09,3.87-12.21,7.7-18.3,11.58
	C84.23,248.07,83.85,248.66,83.39,249.14z"/>
<path class="st5" d="M75.23,236.41c0.96,0.5,2.76,1.01,2.76,1.51c-0.04,3.68,6.24,4.82,3.68,9.4c-0.29,0.51-0.1,1.28-0.14,1.93
	c-4.61,3.12-9.21,6.23-13.82,9.35c-2.03-0.08-4.33-0.22-4.13-2.94c0.24-3.21-0.82-5.57-3.21-7.56c-0.46-0.38-0.62-1.13-0.92-1.7
	c3.61-2.6,7.15-5.28,10.85-7.75C71.78,237.65,73.58,237.14,75.23,236.41z"/>
<path class="st18" d="M24.78,268.4c-0.45,1.02-0.54,1.86-0.98,2.14c-2.73,1.68-5.52,3.28-8.36,4.78c-0.36,0.19-1.54-0.29-1.61-0.61
	c-0.19-0.9-0.37-2.39,0.1-2.74c2.62-1.9,5.38-3.63,8.24-5.13C22.62,266.6,23.83,267.8,24.78,268.4z"/>
<path class="st18" d="M63.49,266.49c3.15,0.2,3.17,0.24,2,3.01c-2.05,1.89-4.11,3.79-6.17,5.68c-0.73,0.67-1.39,1.51-2.24,1.9
	c-0.59,0.27-1.47-0.1-2.22-0.18c0.18-0.59,0.18-1.34,0.55-1.73c2.27-2.4,4.64-4.71,6.94-7.08C62.8,267.62,63.11,267.02,63.49,266.49
	z"/>
<path class="st18" d="M48.5,288.47c0.18,0.45,0.63,1,0.5,1.35c-1.03,2.9-7.13,5.58-10.53,4.69
	C40.68,290.61,44.35,289.13,48.5,288.47z"/>
<path class="st18" d="M31.46,274.64c0.03,3.08-3.54,6.22-5.74,5.67c-0.49-0.12-1.21-1.53-1.06-1.71c1.44-1.72,2.96-3.4,4.67-4.84
	C29.64,273.5,30.92,274.4,31.46,274.64z"/>
<path class="st18" d="M39.82,285.41c-0.42-0.29-1.17-0.79-1.93-1.3c0.51-0.69,0.87-1.67,1.55-2c1.45-0.7,3.03-1.25,4.61-1.48
	c0.7-0.1,1.53,0.73,2.3,1.14c-0.45,0.79-0.71,1.99-1.38,2.29C43.53,284.72,41.88,284.91,39.82,285.41z"/>
<path class="st18" d="M52.34,243.56c-0.57-0.26-1.19-0.36-1.38-0.69c-0.18-0.32-0.09-1.16,0.16-1.31c2.4-1.4,4.82-2.75,7.32-3.97
	c0.37-0.18,1.12,0.41,1.69,0.64c-0.24,0.57-0.32,1.43-0.75,1.67C57.08,241.21,54.69,242.36,52.34,243.56z"/>
<path class="st18" d="M32.53,258.49c-0.71,0.56-1.05,0.91-1.45,1.13c-1,0.56-1.99,1.25-3.07,1.53c-1.64,0.42-3.35,0.52-5.03,0.76
	c0.29-2.43,2.47-2.07,3.97-2.71c1.32-0.56,2.6-1.21,3.96-1.62C31.26,257.48,31.85,258.1,32.53,258.49z"/>
<path class="st18" d="M67.49,271.49c1.82-0.24,2.18-3.42,4.67-2.31c-0.9,1.43-1.79,2.87-2.69,4.3c-1.45,0.89-2.9,1.79-4.34,2.68
	c-0.19-0.2-0.38-0.4-0.57-0.59C65.53,274.21,66.51,272.85,67.49,271.49z"/>
<path class="st18" d="M27.35,293.49c-1.96,0-2.82,0.14-3.6-0.04c-0.65-0.16-1.2-0.7-1.8-1.07c0.52-0.29,1.02-0.72,1.57-0.83
	c0.8-0.15,1.66-0.17,2.47-0.04c1.35,0.21,2.68,0.58,4.02,0.88C28.8,292.89,27.59,293.39,27.35,293.49z"/>
<path class="st18" d="M35.26,251.79c0.01,0.01-0.26-0.24-0.52-0.49c0.95-0.78,1.8-1.78,2.89-2.24c0.6-0.25,1.58,0.43,2.39,0.7
	c-0.18,0.52-0.26,1.44-0.54,1.51C38.24,251.56,36.95,251.61,35.26,251.79z"/>
<path class="st18" d="M72.5,229.44c0.33,0.69,0.66,1.37,0.99,2.06c-1.26,0.14-2.52,0.33-3.79,0.38c-0.63,0.02-1.28-0.24-1.91-0.37
	c0.46-0.59,0.81-1.5,1.4-1.7C70.21,229.45,71.39,229.54,72.5,229.44z"/>
<path class="st6" d="M158.43,227.43c-1.16,1.91-6.2,4.64-8.01,4.58c-1.31-0.04-2.63,0.3-3.94,0.48c-1,0.34-1.99,0.68-2.99,1.02
	c-1.04-1.3-3.84-1.28-3-3.99c6.25,1.72,12.1,0.15,17.85-2.19L158.43,227.43z"/>
<path class="st19" d="M136.45,248.32c0.06,1.63-0.68,3.09-2.99,3.13c-2.05,0.04-2.95-1.19-2.88-3.1c0.08-2.03,1.23-3.48,3.21-3.7
	C135.97,244.4,136.41,246.07,136.45,248.32z"/>
<path class="st19" d="M145.42,246.56c-0.39,1.53-0.45,3.27-1.28,4.5c-0.51,0.75-2.57,1.28-3.25,0.85c-0.81-0.51-1.33-2.25-1.17-3.34
	C140.09,246.1,142.26,245.45,145.42,246.56L145.42,246.56z"/>
<path class="st19" d="M131.9,261.48c-1.66-0.15-2.5-1.35-2.34-3.27c0.17-2.02,1.5-2.68,3.37-2.74c1.91-0.07,2.62,0.85,2.57,2.66
	C135.42,260.38,134.31,261.59,131.9,261.48z"/>
<path class="st19" d="M143.57,258.33c-0.17,3.15-1.47,4.57-3.43,4.07c-1-0.25-2.24-1.41-2.48-2.38c-0.42-1.65,2.06-3.83,3.9-3.43
	C142.48,256.79,143.19,257.98,143.57,258.33z"/>
<path class="st19" d="M130.52,272.11c-1.23-1.58-2.82-3.11-2.61-3.43c1-1.48,2.5-2.63,3.82-3.9c0.59,1.04,1.83,2.24,1.63,3.09
	C133.04,269.23,131.76,270.37,130.52,272.11z"/>
<path class="st2" d="M148.55,246.57c-1.04,0-2.08-0.01-3.13-0.01l0,0c0.05-0.63-0.1-1.39,0.2-1.87c0.44-0.72,1.19-1.26,1.81-1.87
	c0.35,0.77,0.76,1.52,1.04,2.32c0.15,0.43,0.07,0.94,0.09,1.42L148.55,246.57z"/>
<path class="st18" d="M351.51,266.49c0.33-0.99,0.67-1.97,1-2.96c2.09-0.89,4.14-1.94,6.3-2.58c0.89-0.27,2.04,0.34,3.07,0.54
	c-0.27,0.98-0.23,2.33-0.87,2.86c-1.74,1.43-3.66,2.84-5.74,3.57C354.3,268.26,352.78,267.02,351.51,266.49z"/>
<path class="st18" d="M365.13,252.54c0.81,0.34,1.22,0.39,1.39,0.61c1.66,2.22,3.37,4.42,4.86,6.75c0.28,0.45-0.33,1.47-0.53,2.23
	c-0.59-0.2-1.4-0.21-1.74-0.62c-1.57-1.9-3.15-3.83-4.4-5.94C364.31,254.91,364.94,253.65,365.13,252.54z"/>
<path class="st18" d="M355.5,243.5c-0.15,1.79-1.34,2.71-2.61,1.53c-2.02-1.89-3.58-4.27-5.26-6.5c-0.2-0.26,0-1.21,0.24-1.32
	c0.49-0.21,1.33-0.3,1.67-0.01c2.03,1.7,3.96,3.53,5.92,5.31C355.47,242.84,355.48,243.17,355.5,243.5z"/>
<path class="st18" d="M339.5,266.43c1.32,0,2.65,0,3.97,0c0.46,0.57,0.93,1.13,1.39,1.7c-1.8,1.42-3.92,2-5.92,0.98
	C336.87,268.05,338.3,267.13,339.5,266.43z"/>
<path class="st18" d="M359.66,273.79c-0.49-0.78-0.98-1.26-0.89-1.46c0.34-0.71,0.76-1.5,1.38-1.95c1.38-1.02,2.89-1.86,4.35-2.77
	c0.12,0.25,0.41,0.65,0.35,0.72C363.22,270.09,361.54,271.82,359.66,273.79z"/>
<path class="st18" d="M368.57,276.85c-0.46-0.91-0.89-1.37-0.79-1.64c0.21-0.58,0.59-1.2,1.08-1.54c0.95-0.67,2.03-1.16,3.06-1.72
	c0.1,0.28,0.38,0.71,0.29,0.82C371.11,274.07,369.96,275.32,368.57,276.85z"/>
<path class="st22" d="M306.42,245.66c1.04-2.9,2.13-5.77,3.09-8.69c0.86-2.61,1.58-5.18,5.31-3.75c0.43,0.17,1.18-0.49,1.78-0.77
	c8.7,2.83,15.74,8.52,22.82,13.92c2.87,2.19,4.5,6.04,6.55,9.24c0.49,0.76,0.55,1.93,0.48,2.89c-0.25,3.31-2.78,4.74-5.77,3.41
	c-2.71-1.21-5.45-2.34-8.17-3.51c-6.76-3.03-13.55-6-20.26-9.13C310.19,248.31,308.36,246.88,306.42,245.66z"/>
<path class="st18" d="M342.53,242.41c-0.66,0.24-1.68,1-2.34,0.77c-1.01-0.36-2.05-1.25-2.6-2.19c-1.76-2.99-3.35-6.09-4.89-9.2
	c-0.22-0.44,0.1-1.26,0.39-1.79c0.09-0.17,1.1-0.17,1.28,0.06c2.72,3.5,5.38,7.05,8.02,10.62
	C342.56,240.89,342.46,241.32,342.53,242.41z"/>
<path class="st18" d="M312.49,219.49c-1.79-0.01-3.59,0.12-5.35-0.11c-0.84-0.11-1.6-0.89-2.39-1.37c0.58-0.85,1.15-1.7,1.73-2.55
	c1.94,0.02,3.89,0.04,5.83,0.06c1.61,0.02,3.74-0.21,3.83,1.91C316.23,219.62,314.1,219.45,312.49,219.49z"/>
<path class="st18" d="M314.47,225.58c-0.65-0.02-1.34,0.1-1.93-0.1c-1.59-0.54-3.13-1.22-4.69-1.84c1.14-2.07,3.1-0.72,4.64-1.11
	c1.03,0.66,2.06,1.32,3.1,1.98c-0.04,0.33-0.06,0.66-0.06,1C315.18,225.53,314.83,225.55,314.47,225.58z"/>
<path class="st18" d="M351.43,255.05c-0.94-0.9-1.78-1.7-2.62-2.5c0.81-0.35,1.74-1.12,2.41-0.94c1.08,0.29,1.99,1.22,2.97,1.87
	C353.42,253.91,352.67,254.34,351.43,255.05z"/>
<path class="st9" d="M315.53,225.51c0-0.33,0.02-0.67,0.06-1c0.49,0.01,1.06-0.13,1.44,0.08c0.44,0.24,0.71,0.78,1.06,1.19
	c-0.56,0.04-1.12,0.14-1.67,0.11C316.12,225.88,315.83,225.65,315.53,225.51z"/>
<path class="st18" d="M252.96,318.7c-0.65,1.03-1.11,1.77-1.58,2.5c-0.62-0.84-1.69-1.65-1.74-2.52c-0.05-0.88,0.9-1.81,1.41-2.72
	C251.66,316.83,252.26,317.7,252.96,318.7z"/>
<path class="st18" d="M249.13,319.67c-0.89,0.78-1.33,1.16-1.76,1.54c-0.62-1.01-1.33-1.99-1.78-3.07
	c-0.11-0.26,0.67-0.88,1.03-1.33C247.39,317.68,248.16,318.56,249.13,319.67z"/>
<path class="st18" d="M242.07,341.87c-0.87,0.68-1.59,1.37-1.69,1.29c-0.69-0.55-1.32-1.21-1.8-1.94c-0.14-0.22,0.29-0.8,0.47-1.22
	C239.92,340.54,240.79,341.08,242.07,341.87z"/>
<path class="st17" d="M106.64,233.63c-0.64-0.92-1.97-1.99-1.81-2.73c0.74-3.33-1.91-5.55-2.36-8.43c2.33-1.02,4.66-2.04,6.99-3.06
	c2.12-0.13,2.19,1.66,2.77,2.97c-0.28,1.93-0.67,3.85-0.81,5.79C111.12,232.19,110.98,232.41,106.64,233.63z M107.01,227
	c-0.11,0.09-0.32,0.2-0.31,0.26c0.05,0.25,0.17,0.48,0.26,0.73c0.11-0.09,0.32-0.2,0.31-0.26C107.22,227.47,107.1,227.24,107.01,227
	z"/>
<path class="st18" d="M99.46,246.4c-0.02-0.01-0.88-0.55-1.73-1.08c1.58-1.27,3.07-2.73,4.83-3.68c0.41-0.22,2.64,1.54,2.52,2
	C104.53,245.78,102.79,246.69,99.46,246.4z"/>
<path class="st18" d="M84.46,257.49c-1.51,0.59-3,1.24-4.55,1.72c-0.54,0.17-1.22-0.08-1.83-0.14c0.09-0.73-0.02-1.58,0.32-2.16
	c0.37-0.61,1.14-1.02,1.79-1.43c1.08-0.68,2.19-1.3,3.29-1.94c0.67-0.01,1.33-0.02,2-0.03c1.41-0.01,1.91,0.4,0.82,1.66
	C85.65,255.91,85.08,256.71,84.46,257.49z"/>
<path class="st1" d="M114.47,222.49c0.01-0.67,0.02-1.33,0.02-2C115.65,221.18,115.64,221.84,114.47,222.49z"/>
<path class="st7" d="M109.5,308.49c-0.01-1.43,0.75-2.33,2.12-1.93c2.96,0.85,5.91,1.81,8.72,3.05c0.68,0.3,0.78,1.89,1.15,2.89
	c-1.46,0.82-2.85,1.33-4.52,0.28C114.55,311.24,112,309.91,109.5,308.49z"/>
<path class="st9" d="M134.52,308.48c-0.12-2.27,1.52-1.93,2.91-1.97C137.59,308.84,135.94,308.49,134.52,308.48z"/>
<path class="st7" d="M117.76,304.3c0.31-0.16,0.7-0.54,1.05-0.5c0.63,0.07,1.29,0.3,1.83,0.63c1.55,0.98,3.05,2.04,4.57,3.07
	c-0.18,0.25-0.47,0.74-0.52,0.71c-2.3-1.05-4.59-2.15-6.86-3.26C117.75,304.93,117.79,304.66,117.76,304.3z"/>
<path class="st18" d="M305.55,250.52c0.31,0,0.62,0,0.93-0.02c1.33,0.36,2.65,0.72,3.98,1.08c-0.66,0.65-1.32,1.3-1.98,1.96
	C307.51,252.53,306.53,251.52,305.55,250.52z"/>
<path class="st1" d="M268.54,229.68c0.64,0.28,1.28,0.57,1.92,0.85C269.04,232.02,268.67,231.12,268.54,229.68z"/>
<path class="st1" d="M272.56,230.74c0.69,0.57,1.39,1.15,2.08,1.72C273.95,231.89,273.25,231.32,272.56,230.74z"/>
<path class="st18" d="M281.52,214.44c-0.04-2.29,1.93-2.71,3.33-2.75c2.53-0.07,5.08,0.51,7.62,0.82c0.41,3.06-1.5,3.15-3.69,2.87
	C286.36,215.06,283.94,214.75,281.52,214.44z"/>
<path class="st4" d="M310.44,228.69c-1.67-0.69-3.34-1.39-5.02-2.08C308.09,224.92,309.28,226.76,310.44,228.69z"/>
<path class="st18" d="M181.55,387.5c-1.87,2.51-5.5,3.85-7.95,2.8c-0.45-0.19-0.94-1-0.88-1.46c0.06-0.46,0.72-1.05,1.23-1.21
	c1.49-0.47,3.03-0.76,4.55-1.11C179.52,386.85,180.53,387.18,181.55,387.5z"/>
<path class="st18" d="M190.49,385.5c-0.08,1.03,0.24,2.56-0.31,2.99c-1.49,1.17-3.29,2.4-5.08,2.6c-1.61,0.17-1.13-1.51-0.62-2.6
	C186.49,387.49,188.49,386.49,190.49,385.5z"/>
<path class="st18" d="M268.66,213.21c-1.2-1.07-2.73-1.79-2.79-2.62c-0.15-1.94,1.6-2.07,3.13-2.06c1.5,0.01,3.36,0.12,3.07,2.06
	C271.93,211.49,270.11,212.15,268.66,213.21z"/>
<path class="st18" d="M175.56,391.91c1.11,0.76,1.95,1.33,2.79,1.91c-0.81,0.55-1.68,1.62-2.42,1.54c-1.1-0.12-2.11-1.06-3.15-1.64
	C173.62,393.17,174.46,392.63,175.56,391.91z"/>
<path class="st12" d="M248.55,295.57c-0.44,0.54-0.87,1.08-1.31,1.62c-0.28-0.54-0.55-1.08-0.83-1.62l0.04-0.05
	c0.68,0,1.36,0,2.05,0L248.55,295.57z"/>
<path class="st19" d="M252.59,295.46c-0.08-1.11-1.12-2.51,0.89-3.01C253.18,293.45,252.89,294.45,252.59,295.46z"/>
<path class="st19" d="M253.44,292.52c-0.71-1.38-0.86-2.57,1.04-3.07C254.13,290.47,253.79,291.5,253.44,292.52z"/>
<path class="st13" d="M206.81,301.27c0.35-0.17,0.58-0.07,0.71,0.29c-0.07,1.07-0.14,2.14-0.2,3.21c-1-0.16-2-0.31-3-0.47
	C205.15,303.29,205.98,302.28,206.81,301.27z"/>
<path class="st18" d="M325.42,257.6c-1.3,1.03-1.71,1.61-2.22,1.71c-1.62,0.31-3.74-1.21-3.57-2.48c0.05-0.37,0.64-1.01,0.82-0.96
	C321.88,256.27,323.26,256.82,325.42,257.6z"/>
<path class="st7" d="M310.47,251.57c-1.33-0.36-2.65-0.72-3.98-1.08c0.4-0.58,0.93-1.71,1.18-1.66
	C309.07,249.17,310.58,249.61,310.47,251.57z"/>
<path class="st22" d="M217.64,286.41c0.95,0.37,1.89,0.73,2.84,1.1c0,0.65,0.01,1.31,0.01,1.96c-0.68,0.01-1.36,0.01-2.05,0.02
	c-0.65,0.01-1.29,0.01-1.94,0.02C216.89,288.47,217.26,287.44,217.64,286.41z"/>
<path class="st7" d="M218.45,289.48c0.68-0.01,1.36-0.01,2.05-0.02c-0.34,0.58-0.67,1.15-1.01,1.73
	C219.14,290.62,218.79,290.05,218.45,289.48z"/>
<path class="st19" d="M127.51,191.47c0.16,0.18,0.31,0.37,0.47,0.55c-0.17-0.17-0.35-0.33-0.52-0.5L127.51,191.47z"/>
<path class="st4" d="M116.47,217.5c-2.18-0.58-3.65-1.52-1.99-4.01c0.49,0.34,0.94,0.79,1.48,0.99
	C117.97,215.22,118.01,216.21,116.47,217.5z"/>
<path class="st18" d="M248.51,295.52c-0.68,0-1.36,0-2.05,0c0.07-0.8,0.01-1.65,0.26-2.39c0.18-0.55,0.75-0.97,1.14-1.44
	c0.22,0.63,0.53,1.25,0.64,1.9C248.62,294.21,248.52,294.87,248.51,295.52z"/>
<path class="st23" d="M314.99,67.33c-4.03,6.69-7.68,12.95-11.57,19.06c-0.65,1.02-2.3,1.91-3.52,1.94
	c-1.64,0.05-2.85-1.11-1.78-3.04c1.69-3.04,3.38-6.08,5.2-9.03c2.42-3.93,5.04-7.73,7.42-11.69c0.36-0.59,0.11-1.89-0.32-2.56
	c-2.69-4.17-5.57-8.21-8.26-12.38c-1.97-3.05-3.91-6.13-5.53-9.37c-0.68-1.38-2.12-3.59,0.67-4.54c1.95-0.67,3.19,0.13,4.26,2.2
	c2.87,5.54,6.14,10.87,9.31,16.24c0.5,0.84,1.23,1.62,2.04,2.16c0.36,0.24,1.53,0.03,1.7-0.3c2.9-5.58,5.71-11.2,8.53-16.82
	c0.58-1.16,0.87-2.65,1.78-3.41c0.8-0.67,2.38-0.9,3.41-0.6c0.51,0.15,1.01,2.07,0.72,2.92c-0.89,2.66-2.07,5.23-3.3,7.76
	c-2.24,4.64-4.49,9.28-6.93,13.81c-1.2,2.21-1.18,3.76,0.8,5.55c4.93,4.44,9.65,9.11,14.52,13.62c1.29,1.19,1.91,2.69,0.86,3.88
	c-0.64,0.72-2.52,0.85-3.63,0.51c-1.17-0.35-2.14-1.5-3.07-2.43C323.98,76.46,319.68,72.07,314.99,67.33z"/>
<path class="st23" d="M322.72,142.44c-2.73-0.04-3.99-2.34-2.79-4.58c1.71-3.19,3.9-6.13,5.9-9.17c2.09-3.18,4.34-6.26,6.23-9.54
	c1.57-2.73,1.72-5.53-0.56-8.21c-1.49-1.75-2.62-3.81-3.86-5.77c-0.8-1.26-1.55-2.55-2.22-3.88c-0.9-1.79-2.04-4.23-0.02-5.34
	c2.22-1.22,3.22,1.38,4.33,3c1.87,2.73,3.82,5.4,5.78,8.06c0.94,1.27,1.73,1.22,2.46-0.31c0.71-1.48,1.64-2.86,2.45-4.29
	c0.88-1.57,1.45-3.46,2.69-4.64c0.84-0.8,2.78-1.14,3.92-0.77c1.73,0.56,1.64,2.2,0.83,3.75c-1.53,2.92-2.85,5.96-4.51,8.8
	c-4.26,7.27-8.67,14.45-13.01,21.68c-1.62,2.7-3.11,5.47-4.83,8.1C324.66,140.62,323.42,141.67,322.72,142.44z"/>
<path class="st23" d="M394.67,107.43c-0.42,1.08-0.69,2.03-1.14,2.91c-6.6,13.1-14.21,25.62-21.97,38.05
	c-1.19,1.91-2.61,2.66-4.52,1.74c-2.39-1.15-1.53-3.07-0.51-4.65c3.4-5.27,6.93-10.46,10.35-15.73c0.8-1.23,1.08-2.86,2.06-3.87
	c2.06-2.13,1.01-3.78-0.24-5.69c-2.27-3.46-4.42-7-6.6-10.52c-0.44-0.7-1.05-1.48-1.05-2.23c0-1.16,0.44-2.32,0.7-3.48
	c0.97,0.4,2.3,0.53,2.86,1.25c2.13,2.73,3.96,5.68,6,8.48c0.66,0.9,1.61,1.59,2.43,2.38c0.78-0.83,1.74-1.54,2.3-2.5
	c1.17-1.98,2.07-4.11,3.2-6.11c0.48-0.85,1.1-1.83,1.91-2.22c0.95-0.46,2.29-0.68,3.23-0.35
	C394.24,105.11,394.36,106.56,394.67,107.43z"/>
<path class="st23" d="M406.91,53.91c-0.81,1.86-1.38,3.59-2.28,5.14c-6.7,11.55-13.42,23.1-20.28,34.56
	c-0.75,1.25-2.34,2.41-3.75,2.76c-2.16,0.53-3.42-1.27-2.29-3.29c1.59-2.87,3.6-5.51,5.38-8.29c2.65-4.15,5.25-8.34,7.88-12.5
	c0.99-1.56,1-2.87-0.18-4.52c-2.49-3.49-4.66-7.2-6.94-10.84c-0.61-0.98-1.48-1.97-1.61-3.03c-0.12-0.94,0.36-2.46,1.06-2.86
	c0.68-0.39,2.41-0.05,2.95,0.59c1.69,2.02,2.98,4.37,4.52,6.52c1.24,1.73,2.63,3.35,3.95,5.02c0.98-1.62,1.92-3.26,2.94-4.85
	c1.31-2.06,2.56-4.18,4.09-6.06c0.59-0.73,2.1-1.43,2.8-1.16C405.93,51.41,406.29,52.83,406.91,53.91z"/>
<path class="st23" d="M368.96,57.51c3.78,0,4.01-0.31,4.57-4.18c0.32-2.27,0.79-4.56,1.6-6.68c0.32-0.84,1.74-1.26,2.66-1.86
	c0.56,0.92,1.51,1.81,1.6,2.77c0.16,1.61-0.08,3.3-0.43,4.9c-1.79,8.19-3.68,16.36-5.53,24.54c-0.11,0.48-0.23,0.97-0.44,1.41
	c-0.79,1.65-1.49,3.72-3.9,2.78c-1.93-0.75-1.82-2.55-1.3-4.27c1.05-3.47,2.15-6.93,3.16-10.42c0.97-3.33,0.62-3.73-2.69-4.02
	c-2.12-0.19-4.21-0.75-6.34-0.91c-3.56-0.27-4.85-2.8-5.35-5.64c-0.85-4.82,0.92-9.16,3.4-13.18c0.32-0.52,1.5-0.97,2.02-0.77
	c0.61,0.23,1.37,1.23,1.32,1.85c-0.12,1.62-0.54,3.24-1.01,4.8C360.56,54.46,362.82,57.51,368.96,57.51z"/>
<path class="st23" d="M351.49,58.24c-0.02,6.99-5.34,12.7-12.12,12.16c-6.49-0.52-11.96-4.32-11.82-10.92
	c0.17-8.16,6.35-13.24,13.31-13.01C347.26,46.67,351.52,51.28,351.49,58.24z M333.48,58.26c0.07,4.24,2.37,7.15,5.5,6.95
	c3.23-0.2,8.42-4.79,8.21-7.26c-0.3-3.54-3.53-6.54-6.94-6.45C335.84,51.62,333.41,54.05,333.48,58.26z"/>
<path class="st23" d="M402.94,117.45c-2.53,0.04-3.87-1.49-3.33-3.67c2.44-9.96,3.7-20.14,6.02-30.12c0.59-2.53,1.17-5.35,4.2-6.25
	c1.14-0.34,2.85-0.7,3.54-0.14c0.76,0.62,1.09,2.42,0.82,3.51c-0.62,2.54-1.72,4.95-2.59,7.43c-2.77,7.9-5.72,15.76-6.18,24.26
	c-0.07,1.28-0.55,2.59-1.09,3.78C404.05,116.86,403.22,117.22,402.94,117.45z"/>
<path class="st23" d="M420.52,60.51c2.65,0,5.32-0.13,7.96,0.04c2.31,0.15,3.38,1.61,2.9,3.64c-0.48,2.04-1.74,2.26-3.75,1.97
	c-3.41-0.5-6.89-0.48-10.34-0.65c-1.16-0.06-2.32-0.03-3.48-0.03c-1.65-0.01-3.13-0.5-3.17-2.37c-0.05-2.19,1.6-2.63,3.43-2.62
	c2.16,0.01,4.31,0,6.47,0C420.52,60.5,420.52,60.5,420.52,60.51z"/>
<path class="st23" d="M358.08,113.51c2.5,0,5-0.05,7.49,0.02c2.05,0.05,3,1.26,2.87,3.26c-0.15,2.13-1.54,2.78-3.45,2.65
	c-4.61-0.31-9.22-0.66-13.84-0.94c-1.54-0.09-3.35-0.1-3.32-2.09c0.03-1.74,1.1-3.04,3.25-2.93c2.33,0.11,4.66,0.03,6.99,0.03
	C358.08,113.5,358.08,113.51,358.08,113.51z"/>
<path class="st23" d="M400.58,124.53c1.9,0.02,1.95,1.36,1.9,2.72c-0.09,2.27-1.36,3.64-3.32,3.12c-1.01-0.27-2.23-1.4-2.5-2.38
	C396.23,126.43,398.72,124.44,400.58,124.53z"/>
<path class="st9" d="M234.32,264.28c-0.45,2.73-0.65,4.5-1.08,6.23c-0.1,0.38-1.06,0.83-1.52,0.74c-0.44-0.09-1.09-0.88-1.05-1.31
	c0.16-1.77,0.43-3.54,0.9-5.25c0.21-0.77,0.97-1.39,1.49-2.08C233.64,263.38,234.23,264.16,234.32,264.28z"/>
<path class="st7" d="M246.46,229.54c0.02,3.62-0.86,6.96-2.99,9.93c-2.47-2.84,0.71-5.49,0.39-8.3
	C243.82,230.73,245.55,230.09,246.46,229.54z"/>
<path class="st9" d="M221.49,280.5c0.36-1.97,0.72-3.94,1.07-5.91C225.58,276.85,225.25,278.66,221.49,280.5z"/>
<path class="st9" d="M239.51,235.23c-0.12,0.32-0.59,1.58-1.07,2.84c-0.32-1.33-0.67-2.65-0.93-3.99c-0.09-0.48-0.11-1.06,0.09-1.47
	c0.26-0.55,0.77-0.97,1.18-1.45c0.24,0.5,0.57,0.98,0.71,1.51C239.61,233.14,239.51,233.66,239.51,235.23z"/>
<path class="st23" d="M158.33,227.32c-5.75,2.35-11.6,3.91-17.85,2.19c-1.95-1.17-4.06-2.15-5.83-3.54
	c-7.35-5.78-7.46-15.34-2.93-22.57c1.89-3.02,4.48-5.91,7.41-7.9c3.34-2.27,7.41-3.33,11.43-0.92c-0.48,0.65-1.1,1.24-1.4,1.96
	c-1.26,3.06-0.48,5.15,2.13,5.92c2.61,0.77,5.41-0.82,5.97-3.53c0.23-1.1,0.09-2.28,0.12-3.42c1.56,1.35,3.11,2.7,4.67,4.05
	c0.45,0.76,0.91,1.51,1.36,2.27c-0.05,0.28,0.02,0.52,0.23,0.72c0.59,0.84,1.19,1.67,1.78,2.51c0.11,1.16,0.23,2.33,0.34,3.49
	c0.27,6.05-2.01,11.36-4.8,16.52C160.09,225.81,159.21,226.56,158.33,227.32z"/>
<path class="st15" d="M157.39,195.51c-0.03,1.14,0.11,2.32-0.12,3.42c-0.56,2.72-3.36,4.31-5.97,3.53c-2.6-0.77-3.39-2.85-2.13-5.92
	c0.3-0.72,0.92-1.31,1.4-1.96C153.06,193.31,155.31,193.78,157.39,195.51z"/>
<path class="st6" d="M165.43,205.05c-0.59-0.84-1.19-1.67-1.78-2.51C165.43,202.53,165.51,203.74,165.43,205.05z"/>
<path class="st6" d="M163.42,201.82c-0.45-0.76-0.91-1.51-1.36-2.27C162.51,200.31,162.96,201.06,163.42,201.82z"/>
<path class="st1" d="M176.91,267.72c-3.59-1.4-3.58-1.4-4.55,1.83c-0.09,0.32-0.19,0.65-0.38,0.92c-0.85,1.26-1.84,3.63-2.58,3.55
	c-2.46-0.24-2.07-2.65-1.86-4.35c0.47-3.81,1.58-7.56,1.76-11.37c0.2-4.29,3.7-2.4,5.57-3.32c1.75-0.86,2.4,0.92,2.65,2.54
	c0.12,0.78,4.15,5.4,4.96,5.97c0,0.95,0,1.89,0,2.84C180.63,266.8,178.77,267.26,176.91,267.72z"/>
<path class="st1" d="M195.72,259.84c-2.69-0.8-2.67-3.23-3.2-5.33c4.38-0.35,2.49,3.23,3.23,5.16L195.72,259.84z"/>
<path class="st0" d="M182.49,266.34c0-0.95,0-1.89,0-2.84c0.33,0,0.67,0,1,0c1.65,0.32,3.3,0.64,4.96,0.95l0.2,0.21
	C186.59,265.22,184.54,265.78,182.49,266.34z"/>
<path class="st12" d="M242.56,213.38c0.64,0.06,1.27,0.12,1.91,0.18c-0.27,0.54-0.54,1.08-0.81,1.63
	C243.29,214.58,242.93,213.98,242.56,213.38z"/>
<path class="st1" d="M188.44,264.45c-1.65-0.32-3.3-0.64-4.96-0.95c-0.25-2.91,1.06-4.26,3.99-4
	C187.8,261.15,188.12,262.8,188.44,264.45z"/>
<path class="st14" d="M107.01,227c0.1,0.24,0.22,0.48,0.26,0.72c0.01,0.06-0.2,0.17-0.31,0.26c-0.09-0.24-0.22-0.48-0.26-0.73
	C106.68,227.2,106.9,227.09,107.01,227z"/>
<path class="st19" d="M333.48,58.26c-0.07-4.22,2.36-6.64,6.77-6.76c3.41-0.09,6.64,2.91,6.94,6.45c0.21,2.47-4.97,7.06-8.21,7.26
	C335.85,65.42,333.55,62.5,333.48,58.26z"/>
</svg>
