<?xml version="1.0" encoding="utf-8"?>
<!-- Generator: Adobe Illustrator 24.0.1, SVG Export Plug-In . SVG Version: 6.00 Build 0)  -->
<svg version="1.1" id="Слой_1" xmlns="http://www.w3.org/2000/svg" xmlns:xlink="http://www.w3.org/1999/xlink" x="0px" y="0px"
	 viewBox="0 0 44 30" style="enable-background:new 0 0 44 30;" xml:space="preserve">
<style type="text/css">
	.st0{fill-rule:evenodd;clip-rule:evenodd;fill:#18CFAB;}
</style>
<path class="st0" d="M9.7,10.9c5.3,0,9.6,4.3,9.6,9.5c0,5.3-4.3,9.5-9.6,9.5C4.3,30,0,25.7,0,20.5l0-1.4C0,8.5,8.6,0,19.2,0v5.5
	c-3.7,0-7.1,1.4-9.7,4c-0.5,0.5-1,1-1.4,1.6C8.6,11,9.1,10.9,9.7,10.9z M34.4,10.9c5.3,0,9.6,4.3,9.6,9.5c0,5.3-4.3,9.5-9.6,9.5
	c-5.3,0-9.6-4.3-9.6-9.5l0-1.4C24.7,8.5,33.3,0,44,0v5.5c-3.7,0-7.1,1.4-9.7,4c-0.5,0.5-1,1-1.4,1.6C33.4,11,33.9,10.9,34.4,10.9z"
	/>
</svg>
