{
  "compilerOptions": {
    "baseUrl": ".",
    "paths": {
      "@/*":         ["*"],
      "@/pages/*":   ["pages/*"],
      "@/public/*":  ["public/*"],
      "@/locales/*": ["public/locales/*"],
      "@/schema":    ["components/schema"],
      "@/layout":    ["components/layout"],
      "@/svg":       ["components/svg"],
      "@/utility/*": ["components/utility/*"],
      "@/header":    ["components/body/header"],
      "@/main/*":    ["components/body/main/*"],
      "@/footer":    ["components/body/footer"]
    }
  }
}