[
  {
    "network": "telegram",
    "username": "arash_pilechi",
    "url": "https://t.me/arash_pilechi",
    "icon": "telegram"
  },
  {
    "network": "instagram",
    "username": "arash_pilechi",
    "url": "https://instagram.com/arash_pilechi",
    "icon": "instagram"
  },
  {
    "network": "whatsapp",
    "username": "+989154134341",
    "url": "https://wa.me/+989154134341",
    "icon": "whatsapp"
  },
  {
    "network": "facebook",
    "username": "arash.peelechi",
    "url": "https://www.facebook.com/arash.peelechi/",
    "icon": "facebook"
  },
  {
    "network": "linkedin",
    "username": "arash-pilechi",
    "url": "https://www.linkedin.com/in/arash-pilechi/",
    "icon": "linkedin"
  }
]
