RUN	simulations.UpdateEmployeeSimulation	updateemployeesimulation	1610883431530	 	3.5.0
USER	Update_Employee	START	1610883432456
REQUEST		[POST] Update employee	1610883432481	1610883432748	KO	status.find.is(201), but actually found 400
USER	Update_Employee	END	1610883432782
USER	Update_Employee	START	1610883432945
REQUEST		[POST] Update employee	1610883432946	1610883433218	KO	status.find.is(201), but actually found 400
USER	Update_Employee	END	1610883433219
USER	Update_Employee	START	1610883433449
REQUEST		[POST] Update employee	1610883433450	1610883433692	KO	status.find.is(201), but actually found 400
USER	Update_Employee	END	1610883433693
USER	Update_Employee	START	1610883433948
REQUEST		[POST] Update employee	1610883433949	1610883434202	KO	status.find.is(201), but actually found 400
USER	Update_Employee	END	1610883434203
USER	Update_Employee	START	1610883434447
REQUEST		[POST] Update employee	1610883434448	1610883434709	KO	status.find.is(201), but actually found 400
USER	Update_Employee	END	1610883434713
USER	Update_Employee	START	1610883434944
REQUEST		[POST] Update employee	1610883434946	1610883435195	KO	status.find.is(201), but actually found 400
USER	Update_Employee	END	1610883435196
USER	Update_Employee	START	1610883435440
REQUEST		[POST] Update employee	1610883435441	1610883435700	KO	status.find.is(201), but actually found 400
USER	Update_Employee	END	1610883435707
USER	Update_Employee	START	1610883435940
REQUEST		[POST] Update employee	1610883435941	1610883436200	KO	status.find.is(201), but actually found 400
USER	Update_Employee	END	1610883436204
USER	Update_Employee	START	1610883436442
REQUEST		[POST] Update employee	1610883436443	1610883436691	KO	status.find.is(201), but actually found 400
USER	Update_Employee	END	1610883436693
USER	Update_Employee	START	1610883436941
REQUEST		[POST] Update employee	1610883436942	1610883437182	KO	status.find.is(201), but actually found 400
USER	Update_Employee	END	1610883437184
USER	Update_Employee	START	1610883437443
REQUEST		[POST] Update employee	1610883437444	1610883437683	KO	status.find.is(201), but actually found 400
USER	Update_Employee	END	1610883437685
USER	Update_Employee	START	1610883437940
REQUEST		[POST] Update employee	1610883437941	1610883438176	KO	status.find.is(201), but actually found 400
USER	Update_Employee	END	1610883438178
USER	Update_Employee	START	1610883438442
REQUEST		[POST] Update employee	1610883438443	1610883438692	KO	status.find.is(201), but actually found 400
USER	Update_Employee	END	1610883438694
USER	Update_Employee	START	1610883438943
REQUEST		[POST] Update employee	1610883438943	1610883439187	KO	status.find.is(201), but actually found 400
USER	Update_Employee	END	1610883439188
USER	Update_Employee	START	1610883439440
REQUEST		[POST] Update employee	1610883439441	1610883439697	KO	status.find.is(201), but actually found 400
USER	Update_Employee	END	1610883439698
USER	Update_Employee	START	1610883439941
REQUEST		[POST] Update employee	1610883439941	1610883440197	KO	status.find.is(201), but actually found 400
USER	Update_Employee	END	1610883440199
USER	Update_Employee	START	1610883440443
REQUEST		[POST] Update employee	1610883440445	1610883440688	KO	status.find.is(201), but actually found 400
USER	Update_Employee	END	1610883440694
USER	Update_Employee	START	1610883440942
REQUEST		[POST] Update employee	1610883440943	1610883441190	KO	status.find.is(201), but actually found 400
USER	Update_Employee	END	1610883441193
USER	Update_Employee	START	1610883441441
REQUEST		[POST] Update employee	1610883441442	1610883441687	KO	status.find.is(201), but actually found 400
USER	Update_Employee	END	1610883441691
USER	Update_Employee	START	1610883441939
REQUEST		[POST] Update employee	1610883441940	1610883442184	KO	status.find.is(201), but actually found 400
USER	Update_Employee	END	1610883442186
