{
  "builders": [
    {
      "type": "qemu",
      "accelerator": "kvm",
      "iso_url": "http://mirrors.rit.edu/centos/7.9.2009/isos/x86_64/CentOS-7-x86_64-Minimal-2009.iso",
      "iso_checksum": "07b94e6b1a0b0260b94c83d6bb76b26bf7a310dc78d7a9c7432809fb9bc6194a",
      "headless": "true",
      "vnc_bind_address": "0.0.0.0",
      "vnc_port_min": "5900",
      "vnc_port_max": "5999",
      "ssh_host": "127.0.0.1",
      "ssh_username": "root",
      "ssh_password": "password",
      "ssh_timeout": "4m",
      "pause_before_connecting": "6m",
      "disk_size": "8192M",
      "format": "qcow2",
      "memory": "2048",
      "vm_name": "m1.small.qcow2",
      "net_device": "virtio-net",
      "disk_interface": "virtio",
      "skip_compaction": "false",
      "cpus": "2",
      "output_directory": "build",
      "http_directory": "http",
      "boot_wait": "10s",
      "boot_command": [
        "<tab> inst.sshd inst.text inst.ks=http://{{ .HTTPIP }}:{{ .HTTPPort }}/anaconda-ks.cfg<enter><wait>"
      ]
    }
  ],
  "provisioners": [
    {
      "type": "shell-local",
      "inline": [
        "virt-sysprep -a ./build/m1.small.qcow2"
      ]
    }
  ]
}

