%YAML 1.1
%TAG !u! tag:unity3d.com,2011:
--- !u!1001 &3593475708363456469
PrefabInstance:
  m_ObjectHideFlags: 0
  serializedVersion: 2
  m_Modification:
    m_TransformParent: {fileID: 5255454389428269608}
    m_Modifications:
    - target: {fileID: 2757065836659467662, guid: 863bd1191007cfc4684fe0f342e04e8a,
        type: 3}
      propertyPath: ObservedComponents.Array.size
      value: 1
      objectReference: {fileID: 0}
    - target: {fileID: 3318462341501569666, guid: 863bd1191007cfc4684fe0f342e04e8a,
        type: 3}
      propertyPath: m_Name
      value: AE_Ice Lance
      objectReference: {fileID: 0}
    - target: {fileID: 5262966289840937579, guid: 863bd1191007cfc4684fe0f342e04e8a,
        type: 3}
      propertyPath: m_LocalPosition.x
      value: 0
      objectReference: {fileID: 0}
    - target: {fileID: 5262966289840937579, guid: 863bd1191007cfc4684fe0f342e04e8a,
        type: 3}
      propertyPath: m_LocalPosition.y
      value: 0
      objectReference: {fileID: 0}
    - target: {fileID: 5262966289840937579, guid: 863bd1191007cfc4684fe0f342e04e8a,
        type: 3}
      propertyPath: m_LocalPosition.z
      value: 0
      objectReference: {fileID: 0}
    - target: {fileID: 5262966289840937579, guid: 863bd1191007cfc4684fe0f342e04e8a,
        type: 3}
      propertyPath: m_LocalRotation.x
      value: 0
      objectReference: {fileID: 0}
    - target: {fileID: 5262966289840937579, guid: 863bd1191007cfc4684fe0f342e04e8a,
        type: 3}
      propertyPath: m_LocalRotation.y
      value: 0
      objectReference: {fileID: 0}
    - target: {fileID: 5262966289840937579, guid: 863bd1191007cfc4684fe0f342e04e8a,
        type: 3}
      propertyPath: m_LocalRotation.z
      value: 0
      objectReference: {fileID: 0}
    - target: {fileID: 5262966289840937579, guid: 863bd1191007cfc4684fe0f342e04e8a,
        type: 3}
      propertyPath: m_LocalRotation.w
      value: 1
      objectReference: {fileID: 0}
    - target: {fileID: 5262966289840937579, guid: 863bd1191007cfc4684fe0f342e04e8a,
        type: 3}
      propertyPath: m_RootOrder
      value: 3
      objectReference: {fileID: 0}
    - target: {fileID: 5262966289840937579, guid: 863bd1191007cfc4684fe0f342e04e8a,
        type: 3}
      propertyPath: m_LocalEulerAnglesHint.x
      value: 0
      objectReference: {fileID: 0}
    - target: {fileID: 5262966289840937579, guid: 863bd1191007cfc4684fe0f342e04e8a,
        type: 3}
      propertyPath: m_LocalEulerAnglesHint.y
      value: 0
      objectReference: {fileID: 0}
    - target: {fileID: 5262966289840937579, guid: 863bd1191007cfc4684fe0f342e04e8a,
        type: 3}
      propertyPath: m_LocalEulerAnglesHint.z
      value: 0
      objectReference: {fileID: 0}
    - target: {fileID: 7290110033933449270, guid: 863bd1191007cfc4684fe0f342e04e8a,
        type: 3}
      propertyPath: _epicenter
      value: 
      objectReference: {fileID: 5255454389428269608}
    - target: {fileID: 7290110033933449270, guid: 863bd1191007cfc4684fe0f342e04e8a,
        type: 3}
      propertyPath: randomAudioSource
      value: 
      objectReference: {fileID: 0}
    m_RemovedComponents: []
  m_SourcePrefab: {fileID: 100100000, guid: 863bd1191007cfc4684fe0f342e04e8a, type: 3}
--- !u!1001 &7620724735246587427
PrefabInstance:
  m_ObjectHideFlags: 0
  serializedVersion: 2
  m_Modification:
    m_TransformParent: {fileID: 0}
    m_Modifications:
    - target: {fileID: 2390671607309034499, guid: 2e8995d9de325954291edcf21dc6ad19,
        type: 3}
      propertyPath: viewIdField
      value: 0
      objectReference: {fileID: 0}
    - target: {fileID: 2390671607309034506, guid: 2e8995d9de325954291edcf21dc6ad19,
        type: 3}
      propertyPath: m_Name
      value: f3004556a90aa4c4fb6aab176c2e300d
      objectReference: {fileID: 0}
    - target: {fileID: 2390671607309034507, guid: 2e8995d9de325954291edcf21dc6ad19,
        type: 3}
      propertyPath: m_LocalPosition.x
      value: 0
      objectReference: {fileID: 0}
    - target: {fileID: 2390671607309034507, guid: 2e8995d9de325954291edcf21dc6ad19,
        type: 3}
      propertyPath: m_LocalPosition.y
      value: 0
      objectReference: {fileID: 0}
    - target: {fileID: 2390671607309034507, guid: 2e8995d9de325954291edcf21dc6ad19,
        type: 3}
      propertyPath: m_LocalPosition.z
      value: 0
      objectReference: {fileID: 0}
    - target: {fileID: 2390671607309034507, guid: 2e8995d9de325954291edcf21dc6ad19,
        type: 3}
      propertyPath: m_LocalRotation.x
      value: 0
      objectReference: {fileID: 0}
    - target: {fileID: 2390671607309034507, guid: 2e8995d9de325954291edcf21dc6ad19,
        type: 3}
      propertyPath: m_LocalRotation.y
      value: 0
      objectReference: {fileID: 0}
    - target: {fileID: 2390671607309034507, guid: 2e8995d9de325954291edcf21dc6ad19,
        type: 3}
      propertyPath: m_LocalRotation.z
      value: 0
      objectReference: {fileID: 0}
    - target: {fileID: 2390671607309034507, guid: 2e8995d9de325954291edcf21dc6ad19,
        type: 3}
      propertyPath: m_LocalRotation.w
      value: 1
      objectReference: {fileID: 0}
    - target: {fileID: 2390671607309034507, guid: 2e8995d9de325954291edcf21dc6ad19,
        type: 3}
      propertyPath: m_RootOrder
      value: 0
      objectReference: {fileID: 0}
    - target: {fileID: 2390671607309034507, guid: 2e8995d9de325954291edcf21dc6ad19,
        type: 3}
      propertyPath: m_LocalEulerAnglesHint.x
      value: 0
      objectReference: {fileID: 0}
    - target: {fileID: 2390671607309034507, guid: 2e8995d9de325954291edcf21dc6ad19,
        type: 3}
      propertyPath: m_LocalEulerAnglesHint.y
      value: 0
      objectReference: {fileID: 0}
    - target: {fileID: 2390671607309034507, guid: 2e8995d9de325954291edcf21dc6ad19,
        type: 3}
      propertyPath: m_LocalEulerAnglesHint.z
      value: 0
      objectReference: {fileID: 0}
    - target: {fileID: 3351128349224482101, guid: 2e8995d9de325954291edcf21dc6ad19,
        type: 3}
      propertyPath: viewIdField
      value: 2
      objectReference: {fileID: 0}
    - target: {fileID: 3473320718226422042, guid: 2e8995d9de325954291edcf21dc6ad19,
        type: 3}
      propertyPath: viewIdField
      value: 0
      objectReference: {fileID: 0}
    - target: {fileID: 3920921084504064946, guid: 2e8995d9de325954291edcf21dc6ad19,
        type: 3}
      propertyPath: viewIdField
      value: 1
      objectReference: {fileID: 0}
    m_RemovedComponents: []
  m_SourcePrefab: {fileID: 100100000, guid: 2e8995d9de325954291edcf21dc6ad19, type: 3}
--- !u!4 &5255454389428269608 stripped
Transform:
  m_CorrespondingSourceObject: {fileID: 2390671607309034507, guid: 2e8995d9de325954291edcf21dc6ad19,
    type: 3}
  m_PrefabInstance: {fileID: 7620724735246587427}
  m_PrefabAsset: {fileID: 0}
