%YAML 1.1
%TAG !u! tag:unity3d.com,2011:
--- !u!1001 &5968058603924213044
PrefabInstance:
  m_ObjectHideFlags: 0
  serializedVersion: 2
  m_Modification:
    m_TransformParent: {fileID: 713974688051654049}
    m_Modifications:
    - target: {fileID: 3318462341501569666, guid: e0bf0736dd6192048b43ff1d0c9030d4,
        type: 3}
      propertyPath: m_Name
      value: AE_Fireball
      objectReference: {fileID: 0}
    - target: {fileID: 5262966289840937579, guid: e0bf0736dd6192048b43ff1d0c9030d4,
        type: 3}
      propertyPath: m_LocalPosition.x
      value: 0
      objectReference: {fileID: 0}
    - target: {fileID: 5262966289840937579, guid: e0bf0736dd6192048b43ff1d0c9030d4,
        type: 3}
      propertyPath: m_LocalPosition.y
      value: 0
      objectReference: {fileID: 0}
    - target: {fileID: 5262966289840937579, guid: e0bf0736dd6192048b43ff1d0c9030d4,
        type: 3}
      propertyPath: m_LocalPosition.z
      value: 0
      objectReference: {fileID: 0}
    - target: {fileID: 5262966289840937579, guid: e0bf0736dd6192048b43ff1d0c9030d4,
        type: 3}
      propertyPath: m_LocalRotation.x
      value: 0
      objectReference: {fileID: 0}
    - target: {fileID: 5262966289840937579, guid: e0bf0736dd6192048b43ff1d0c9030d4,
        type: 3}
      propertyPath: m_LocalRotation.y
      value: 0
      objectReference: {fileID: 0}
    - target: {fileID: 5262966289840937579, guid: e0bf0736dd6192048b43ff1d0c9030d4,
        type: 3}
      propertyPath: m_LocalRotation.z
      value: 0
      objectReference: {fileID: 0}
    - target: {fileID: 5262966289840937579, guid: e0bf0736dd6192048b43ff1d0c9030d4,
        type: 3}
      propertyPath: m_LocalRotation.w
      value: 1
      objectReference: {fileID: 0}
    - target: {fileID: 5262966289840937579, guid: e0bf0736dd6192048b43ff1d0c9030d4,
        type: 3}
      propertyPath: m_RootOrder
      value: 3
      objectReference: {fileID: 0}
    - target: {fileID: 5262966289840937579, guid: e0bf0736dd6192048b43ff1d0c9030d4,
        type: 3}
      propertyPath: m_LocalEulerAnglesHint.x
      value: 0
      objectReference: {fileID: 0}
    - target: {fileID: 5262966289840937579, guid: e0bf0736dd6192048b43ff1d0c9030d4,
        type: 3}
      propertyPath: m_LocalEulerAnglesHint.y
      value: 0
      objectReference: {fileID: 0}
    - target: {fileID: 5262966289840937579, guid: e0bf0736dd6192048b43ff1d0c9030d4,
        type: 3}
      propertyPath: m_LocalEulerAnglesHint.z
      value: 0
      objectReference: {fileID: 0}
    - target: {fileID: 7290110033933449270, guid: e0bf0736dd6192048b43ff1d0c9030d4,
        type: 3}
      propertyPath: _epicenter
      value: 
      objectReference: {fileID: 713974688051654049}
    - target: {fileID: 7290110033933449270, guid: e0bf0736dd6192048b43ff1d0c9030d4,
        type: 3}
      propertyPath: randomAudioSource
      value: 
      objectReference: {fileID: 0}
    m_RemovedComponents: []
  m_SourcePrefab: {fileID: 100100000, guid: e0bf0736dd6192048b43ff1d0c9030d4, type: 3}
--- !u!1001 &6008881593441738708
PrefabInstance:
  m_ObjectHideFlags: 0
  serializedVersion: 2
  m_Modification:
    m_TransformParent: {fileID: 0}
    m_Modifications:
    - target: {fileID: 5446453011447394148, guid: e2338f205d12ce64297ca6afffaf29c6,
        type: 3}
      propertyPath: viewIdField
      value: 0
      objectReference: {fileID: 0}
    - target: {fileID: 6524407214152233588, guid: e2338f205d12ce64297ca6afffaf29c6,
        type: 3}
      propertyPath: m_Name
      value: 7358432d917e53a46b2cd855a61d797e
      objectReference: {fileID: 0}
    - target: {fileID: 6524407214152233589, guid: e2338f205d12ce64297ca6afffaf29c6,
        type: 3}
      propertyPath: m_LocalPosition.x
      value: 0
      objectReference: {fileID: 0}
    - target: {fileID: 6524407214152233589, guid: e2338f205d12ce64297ca6afffaf29c6,
        type: 3}
      propertyPath: m_LocalPosition.y
      value: 0
      objectReference: {fileID: 0}
    - target: {fileID: 6524407214152233589, guid: e2338f205d12ce64297ca6afffaf29c6,
        type: 3}
      propertyPath: m_LocalPosition.z
      value: 0
      objectReference: {fileID: 0}
    - target: {fileID: 6524407214152233589, guid: e2338f205d12ce64297ca6afffaf29c6,
        type: 3}
      propertyPath: m_LocalRotation.x
      value: 0
      objectReference: {fileID: 0}
    - target: {fileID: 6524407214152233589, guid: e2338f205d12ce64297ca6afffaf29c6,
        type: 3}
      propertyPath: m_LocalRotation.y
      value: 0
      objectReference: {fileID: 0}
    - target: {fileID: 6524407214152233589, guid: e2338f205d12ce64297ca6afffaf29c6,
        type: 3}
      propertyPath: m_LocalRotation.z
      value: 0
      objectReference: {fileID: 0}
    - target: {fileID: 6524407214152233589, guid: e2338f205d12ce64297ca6afffaf29c6,
        type: 3}
      propertyPath: m_LocalRotation.w
      value: 1
      objectReference: {fileID: 0}
    - target: {fileID: 6524407214152233589, guid: e2338f205d12ce64297ca6afffaf29c6,
        type: 3}
      propertyPath: m_RootOrder
      value: 0
      objectReference: {fileID: 0}
    - target: {fileID: 6524407214152233589, guid: e2338f205d12ce64297ca6afffaf29c6,
        type: 3}
      propertyPath: m_LocalEulerAnglesHint.x
      value: 0
      objectReference: {fileID: 0}
    - target: {fileID: 6524407214152233589, guid: e2338f205d12ce64297ca6afffaf29c6,
        type: 3}
      propertyPath: m_LocalEulerAnglesHint.y
      value: 0
      objectReference: {fileID: 0}
    - target: {fileID: 6524407214152233589, guid: e2338f205d12ce64297ca6afffaf29c6,
        type: 3}
      propertyPath: m_LocalEulerAnglesHint.z
      value: 0
      objectReference: {fileID: 0}
    - target: {fileID: 6524407214152233597, guid: e2338f205d12ce64297ca6afffaf29c6,
        type: 3}
      propertyPath: viewIdField
      value: 0
      objectReference: {fileID: 0}
    m_RemovedComponents: []
  m_SourcePrefab: {fileID: 100100000, guid: e2338f205d12ce64297ca6afffaf29c6, type: 3}
--- !u!4 &713974688051654049 stripped
Transform:
  m_CorrespondingSourceObject: {fileID: 6524407214152233589, guid: e2338f205d12ce64297ca6afffaf29c6,
    type: 3}
  m_PrefabInstance: {fileID: 6008881593441738708}
  m_PrefabAsset: {fileID: 0}
