%YAML 1.1
%TAG !u! tag:unity3d.com,2011:
--- !u!1001 &8761210950262635268
PrefabInstance:
  m_ObjectHideFlags: 0
  serializedVersion: 2
  m_Modification:
    m_TransformParent: {fileID: 0}
    m_Modifications:
    - target: {fileID: -1669657719617352621, guid: abdbb7244794e884690f50b1145d68e3,
        type: 3}
      propertyPath: _clips.weightedItems.Array.size
      value: 1
      objectReference: {fileID: 0}
    - target: {fileID: -1669657719617352621, guid: abdbb7244794e884690f50b1145d68e3,
        type: 3}
      propertyPath: _clips.weightedItems.Array.data[0].weight
      value: 1
      objectReference: {fileID: 0}
    - target: {fileID: -1669657719617352621, guid: abdbb7244794e884690f50b1145d68e3,
        type: 3}
      propertyPath: _clips.weightedItems.Array.data[0].clip
      value: 
      objectReference: {fileID: 8300000, guid: 5a054403644399049999912e072717f7, type: 3}
    - target: {fileID: 2071020874562503474, guid: abdbb7244794e884690f50b1145d68e3,
        type: 3}
      propertyPath: _abilityData
      value: 
      objectReference: {fileID: 11400000, guid: 78e962edde1d42440bf9e6cde1e6dd42,
        type: 2}
    - target: {fileID: 2071020874562503474, guid: abdbb7244794e884690f50b1145d68e3,
        type: 3}
      propertyPath: _attackPrefab
      value: 
      objectReference: {fileID: 3421277926732202127, guid: e0e023024bc5bb54c8f08c93b4aad749,
        type: 3}
    - target: {fileID: 2071020874562503474, guid: abdbb7244794e884690f50b1145d68e3,
        type: 3}
      propertyPath: isMultiAttack
      value: 1
      objectReference: {fileID: 0}
    - target: {fileID: 2071020874562503474, guid: abdbb7244794e884690f50b1145d68e3,
        type: 3}
      propertyPath: _abilityPrefab
      value: 
      objectReference: {fileID: 3421277926732202127, guid: e0e023024bc5bb54c8f08c93b4aad749,
        type: 3}
    - target: {fileID: 3503762046354825583, guid: abdbb7244794e884690f50b1145d68e3,
        type: 3}
      propertyPath: m_LocalPosition.x
      value: 0
      objectReference: {fileID: 0}
    - target: {fileID: 3503762046354825583, guid: abdbb7244794e884690f50b1145d68e3,
        type: 3}
      propertyPath: m_LocalPosition.y
      value: 0
      objectReference: {fileID: 0}
    - target: {fileID: 3503762046354825583, guid: abdbb7244794e884690f50b1145d68e3,
        type: 3}
      propertyPath: m_LocalPosition.z
      value: 0
      objectReference: {fileID: 0}
    - target: {fileID: 3503762046354825583, guid: abdbb7244794e884690f50b1145d68e3,
        type: 3}
      propertyPath: m_LocalRotation.x
      value: 0
      objectReference: {fileID: 0}
    - target: {fileID: 3503762046354825583, guid: abdbb7244794e884690f50b1145d68e3,
        type: 3}
      propertyPath: m_LocalRotation.y
      value: 0
      objectReference: {fileID: 0}
    - target: {fileID: 3503762046354825583, guid: abdbb7244794e884690f50b1145d68e3,
        type: 3}
      propertyPath: m_LocalRotation.z
      value: 0
      objectReference: {fileID: 0}
    - target: {fileID: 3503762046354825583, guid: abdbb7244794e884690f50b1145d68e3,
        type: 3}
      propertyPath: m_LocalRotation.w
      value: 1
      objectReference: {fileID: 0}
    - target: {fileID: 3503762046354825583, guid: abdbb7244794e884690f50b1145d68e3,
        type: 3}
      propertyPath: m_RootOrder
      value: 0
      objectReference: {fileID: 0}
    - target: {fileID: 3503762046354825583, guid: abdbb7244794e884690f50b1145d68e3,
        type: 3}
      propertyPath: m_LocalEulerAnglesHint.x
      value: 0
      objectReference: {fileID: 0}
    - target: {fileID: 3503762046354825583, guid: abdbb7244794e884690f50b1145d68e3,
        type: 3}
      propertyPath: m_LocalEulerAnglesHint.y
      value: 0
      objectReference: {fileID: 0}
    - target: {fileID: 3503762046354825583, guid: abdbb7244794e884690f50b1145d68e3,
        type: 3}
      propertyPath: m_LocalEulerAnglesHint.z
      value: 0
      objectReference: {fileID: 0}
    - target: {fileID: 6312807641066041734, guid: abdbb7244794e884690f50b1145d68e3,
        type: 3}
      propertyPath: m_Name
      value: AE_Earth Shield
      objectReference: {fileID: 0}
    m_RemovedComponents:
    - {fileID: -1669657719617352621, guid: abdbb7244794e884690f50b1145d68e3, type: 3}
    - {fileID: 8411004584385784408, guid: abdbb7244794e884690f50b1145d68e3, type: 3}
  m_SourcePrefab: {fileID: 100100000, guid: abdbb7244794e884690f50b1145d68e3, type: 3}
