%YAML 1.1
%TAG !u! tag:unity3d.com,2011:
--- !u!114 &2115876122443275899
MonoBehaviour:
  m_ObjectHideFlags: 0
  m_CorrespondingSourceObject: {fileID: 0}
  m_PrefabInstance: {fileID: 0}
  m_PrefabAsset: {fileID: 0}
  m_GameObject: {fileID: 7031023869018247505}
  m_Enabled: 1
  m_EditorHideFlags: 0
  m_Script: {fileID: 11500000, guid: f375e94e1ab8c1144a5ab17e7c0f91e3, type: 3}
  m_Name: 
  m_EditorClassIdentifier: 
  _openMsgType: 3
  _closeButton: {fileID: 9068215812640793994}
--- !u!1001 &4257815237835765237
PrefabInstance:
  m_ObjectHideFlags: 0
  serializedVersion: 2
  m_Modification:
    m_TransformParent: {fileID: 0}
    m_Modifications:
    - target: {fileID: 2197459528190451662, guid: 893e4c23271e4664489f9cf81742a6b4,
        type: 3}
      propertyPath: m_Color.r
      value: 1
      objectReference: {fileID: 0}
    - target: {fileID: 2197459528190451662, guid: 893e4c23271e4664489f9cf81742a6b4,
        type: 3}
      propertyPath: m_Color.g
      value: 1
      objectReference: {fileID: 0}
    - target: {fileID: 2197459528190451662, guid: 893e4c23271e4664489f9cf81742a6b4,
        type: 3}
      propertyPath: m_Color.b
      value: 1
      objectReference: {fileID: 0}
    - target: {fileID: 2197459528190451662, guid: 893e4c23271e4664489f9cf81742a6b4,
        type: 3}
      propertyPath: m_Sprite
      value: 
      objectReference: {fileID: 21300000, guid: af31c54474da1c748bc063aa49fd3907,
        type: 3}
    - target: {fileID: 2197459528190451662, guid: 893e4c23271e4664489f9cf81742a6b4,
        type: 3}
      propertyPath: m_Type
      value: 2
      objectReference: {fileID: 0}
    - target: {fileID: 2197459528190451662, guid: 893e4c23271e4664489f9cf81742a6b4,
        type: 3}
      propertyPath: m_PixelsPerUnitMultiplier
      value: 0.22
      objectReference: {fileID: 0}
    - target: {fileID: 6522895142877275300, guid: 893e4c23271e4664489f9cf81742a6b4,
        type: 3}
      propertyPath: m_Name
      value: QuestsPanel Variant
      objectReference: {fileID: 0}
    - target: {fileID: 6522895143217076128, guid: 893e4c23271e4664489f9cf81742a6b4,
        type: 3}
      propertyPath: m_Color.r
      value: 1
      objectReference: {fileID: 0}
    - target: {fileID: 6522895143217076128, guid: 893e4c23271e4664489f9cf81742a6b4,
        type: 3}
      propertyPath: m_Color.g
      value: 1
      objectReference: {fileID: 0}
    - target: {fileID: 6522895143217076128, guid: 893e4c23271e4664489f9cf81742a6b4,
        type: 3}
      propertyPath: m_Color.b
      value: 1
      objectReference: {fileID: 0}
    - target: {fileID: 6522895143217076128, guid: 893e4c23271e4664489f9cf81742a6b4,
        type: 3}
      propertyPath: m_Type
      value: 2
      objectReference: {fileID: 0}
    - target: {fileID: 6522895143217076128, guid: 893e4c23271e4664489f9cf81742a6b4,
        type: 3}
      propertyPath: m_PixelsPerUnitMultiplier
      value: 0.2
      objectReference: {fileID: 0}
    - target: {fileID: 6522895143217076128, guid: 893e4c23271e4664489f9cf81742a6b4,
        type: 3}
      propertyPath: m_Sprite
      value: 
      objectReference: {fileID: 21300000, guid: af31c54474da1c748bc063aa49fd3907,
        type: 3}
    - target: {fileID: 6522895144356275992, guid: 893e4c23271e4664489f9cf81742a6b4,
        type: 3}
      propertyPath: m_LocalPosition.x
      value: 0
      objectReference: {fileID: 0}
    - target: {fileID: 6522895144356275992, guid: 893e4c23271e4664489f9cf81742a6b4,
        type: 3}
      propertyPath: m_LocalPosition.y
      value: 0
      objectReference: {fileID: 0}
    - target: {fileID: 6522895144356275992, guid: 893e4c23271e4664489f9cf81742a6b4,
        type: 3}
      propertyPath: m_LocalPosition.z
      value: 0
      objectReference: {fileID: 0}
    - target: {fileID: 6522895144356275992, guid: 893e4c23271e4664489f9cf81742a6b4,
        type: 3}
      propertyPath: m_LocalRotation.x
      value: 0
      objectReference: {fileID: 0}
    - target: {fileID: 6522895144356275992, guid: 893e4c23271e4664489f9cf81742a6b4,
        type: 3}
      propertyPath: m_LocalRotation.y
      value: 0
      objectReference: {fileID: 0}
    - target: {fileID: 6522895144356275992, guid: 893e4c23271e4664489f9cf81742a6b4,
        type: 3}
      propertyPath: m_LocalRotation.z
      value: 0
      objectReference: {fileID: 0}
    - target: {fileID: 6522895144356275992, guid: 893e4c23271e4664489f9cf81742a6b4,
        type: 3}
      propertyPath: m_LocalRotation.w
      value: 1
      objectReference: {fileID: 0}
    - target: {fileID: 6522895144356275992, guid: 893e4c23271e4664489f9cf81742a6b4,
        type: 3}
      propertyPath: m_RootOrder
      value: 0
      objectReference: {fileID: 0}
    - target: {fileID: 6522895144356275992, guid: 893e4c23271e4664489f9cf81742a6b4,
        type: 3}
      propertyPath: m_LocalEulerAnglesHint.x
      value: 0
      objectReference: {fileID: 0}
    - target: {fileID: 6522895144356275992, guid: 893e4c23271e4664489f9cf81742a6b4,
        type: 3}
      propertyPath: m_LocalEulerAnglesHint.y
      value: 0
      objectReference: {fileID: 0}
    - target: {fileID: 6522895144356275992, guid: 893e4c23271e4664489f9cf81742a6b4,
        type: 3}
      propertyPath: m_LocalEulerAnglesHint.z
      value: 0
      objectReference: {fileID: 0}
    - target: {fileID: 6522895144373020615, guid: 893e4c23271e4664489f9cf81742a6b4,
        type: 3}
      propertyPath: m_SortingOrder
      value: 6
      objectReference: {fileID: 0}
    - target: {fileID: 7681079352029129032, guid: 893e4c23271e4664489f9cf81742a6b4,
        type: 3}
      propertyPath: _fadeDuration
      value: 0.5
      objectReference: {fileID: 0}
    - target: {fileID: 9057777124162333921, guid: 893e4c23271e4664489f9cf81742a6b4,
        type: 3}
      propertyPath: m_IsActive
      value: 1
      objectReference: {fileID: 0}
    m_RemovedComponents: []
  m_SourcePrefab: {fileID: 100100000, guid: 893e4c23271e4664489f9cf81742a6b4, type: 3}
--- !u!1 &7031023869018247505 stripped
GameObject:
  m_CorrespondingSourceObject: {fileID: 6522895142877275300, guid: 893e4c23271e4664489f9cf81742a6b4,
    type: 3}
  m_PrefabInstance: {fileID: 4257815237835765237}
  m_PrefabAsset: {fileID: 0}
--- !u!114 &9068215812640793994 stripped
MonoBehaviour:
  m_CorrespondingSourceObject: {fileID: 5102026809813946495, guid: 893e4c23271e4664489f9cf81742a6b4,
    type: 3}
  m_PrefabInstance: {fileID: 4257815237835765237}
  m_PrefabAsset: {fileID: 0}
  m_GameObject: {fileID: 0}
  m_Enabled: 1
  m_EditorHideFlags: 0
  m_Script: {fileID: 11500000, guid: 4e29b1a8efbd4b44bb3f3716e73f07ff, type: 3}
  m_Name: 
  m_EditorClassIdentifier: 
