%YAML 1.1
%TAG !u! tag:unity3d.com,2011:
--- !u!65 &212053748836465369
BoxCollider:
  m_ObjectHideFlags: 0
  m_CorrespondingSourceObject: {fileID: 0}
  m_PrefabInstance: {fileID: 0}
  m_PrefabAsset: {fileID: 0}
  m_GameObject: {fileID: 3180548794260413347}
  m_Material: {fileID: 0}
  m_IsTrigger: 1
  m_Enabled: 1
  serializedVersion: 2
  m_Size: {x: 2, y: 3, z: 4}
  m_Center: {x: 0, y: 6, z: 0}
--- !u!95 &1861552985417044067
Animator:
  serializedVersion: 3
  m_ObjectHideFlags: 0
  m_CorrespondingSourceObject: {fileID: 0}
  m_PrefabInstance: {fileID: 0}
  m_PrefabAsset: {fileID: 0}
  m_GameObject: {fileID: 5567074643467943956}
  m_Enabled: 1
  m_Avatar: {fileID: 0}
  m_Controller: {fileID: 0}
  m_CullingMode: 0
  m_UpdateMode: 0
  m_ApplyRootMotion: 0
  m_LinearVelocityBlending: 0
  m_WarningMessage: 
  m_HasTransformHierarchy: 1
  m_AllowConstantClipSamplingOptimization: 1
  m_KeepAnimatorControllerStateOnDisable: 0
--- !u!1001 &211048866430979534
PrefabInstance:
  m_ObjectHideFlags: 0
  serializedVersion: 2
  m_Modification:
    m_TransformParent: {fileID: 0}
    m_Modifications:
    - target: {fileID: 159486736837104861, guid: 8bc751e4cc7a8ba43918ec7f317556f9,
        type: 3}
      propertyPath: animator
      value: 
      objectReference: {fileID: 0}
    - target: {fileID: 159486736837104861, guid: 8bc751e4cc7a8ba43918ec7f317556f9,
        type: 3}
      propertyPath: clip
      value: 
      objectReference: {fileID: -5937992940702847738, guid: 75ea21751120f63488c5af9d19c897aa,
        type: 3}
    - target: {fileID: 159486736837104861, guid: 8bc751e4cc7a8ba43918ec7f317556f9,
        type: 3}
      propertyPath: m_Enabled
      value: 1
      objectReference: {fileID: 0}
    - target: {fileID: 2815379730436226738, guid: 8bc751e4cc7a8ba43918ec7f317556f9,
        type: 3}
      propertyPath: _animations.Array.size
      value: 4
      objectReference: {fileID: 0}
    - target: {fileID: 2815379730436226738, guid: 8bc751e4cc7a8ba43918ec7f317556f9,
        type: 3}
      propertyPath: _animator
      value: 
      objectReference: {fileID: 1861552985417044067}
    - target: {fileID: 2815379730436226738, guid: 8bc751e4cc7a8ba43918ec7f317556f9,
        type: 3}
      propertyPath: _animations.Array.data[0]._animationClip
      value: 
      objectReference: {fileID: -8489567021099676070, guid: c2c585ba52bb20746ac4393b0c766495,
        type: 3}
    - target: {fileID: 2815379730436226738, guid: 8bc751e4cc7a8ba43918ec7f317556f9,
        type: 3}
      propertyPath: _animations.Array.data[1]._animationClip
      value: 
      objectReference: {fileID: -3996332026654853673, guid: 77a0883c57f740841ab62183a0142a91,
        type: 3}
    - target: {fileID: 2815379730436226738, guid: 8bc751e4cc7a8ba43918ec7f317556f9,
        type: 3}
      propertyPath: _animations.Array.data[2]._animationClip
      value: 
      objectReference: {fileID: -5878616588946182826, guid: 7cac018a6e581e44fa1bfd5b812e02ee,
        type: 3}
    - target: {fileID: 2815379730436226738, guid: 8bc751e4cc7a8ba43918ec7f317556f9,
        type: 3}
      propertyPath: _animations.Array.data[3]._animationClip
      value: 
      objectReference: {fileID: -3592686455443467230, guid: 8c1ce3fe0685f1a44b13348f8472393d,
        type: 3}
    - target: {fileID: 2815379730436226738, guid: 8bc751e4cc7a8ba43918ec7f317556f9,
        type: 3}
      propertyPath: _animations.Array.data[4]._animationClip
      value: 
      objectReference: {fileID: 0}
    - target: {fileID: 2815379730436226738, guid: 8bc751e4cc7a8ba43918ec7f317556f9,
        type: 3}
      propertyPath: _animations.Array.data[5]._animationClip
      value: 
      objectReference: {fileID: 0}
    - target: {fileID: 3372738267075991121, guid: 8bc751e4cc7a8ba43918ec7f317556f9,
        type: 3}
      propertyPath: viewIdField
      value: 0
      objectReference: {fileID: 0}
    - target: {fileID: 3372738267075991122, guid: 8bc751e4cc7a8ba43918ec7f317556f9,
        type: 3}
      propertyPath: m_LocalPosition.x
      value: 0
      objectReference: {fileID: 0}
    - target: {fileID: 3372738267075991122, guid: 8bc751e4cc7a8ba43918ec7f317556f9,
        type: 3}
      propertyPath: m_LocalPosition.y
      value: 0
      objectReference: {fileID: 0}
    - target: {fileID: 3372738267075991122, guid: 8bc751e4cc7a8ba43918ec7f317556f9,
        type: 3}
      propertyPath: m_LocalPosition.z
      value: 0
      objectReference: {fileID: 0}
    - target: {fileID: 3372738267075991122, guid: 8bc751e4cc7a8ba43918ec7f317556f9,
        type: 3}
      propertyPath: m_LocalRotation.x
      value: 0
      objectReference: {fileID: 0}
    - target: {fileID: 3372738267075991122, guid: 8bc751e4cc7a8ba43918ec7f317556f9,
        type: 3}
      propertyPath: m_LocalRotation.y
      value: 0
      objectReference: {fileID: 0}
    - target: {fileID: 3372738267075991122, guid: 8bc751e4cc7a8ba43918ec7f317556f9,
        type: 3}
      propertyPath: m_LocalRotation.z
      value: 0
      objectReference: {fileID: 0}
    - target: {fileID: 3372738267075991122, guid: 8bc751e4cc7a8ba43918ec7f317556f9,
        type: 3}
      propertyPath: m_LocalRotation.w
      value: 1
      objectReference: {fileID: 0}
    - target: {fileID: 3372738267075991122, guid: 8bc751e4cc7a8ba43918ec7f317556f9,
        type: 3}
      propertyPath: m_RootOrder
      value: 0
      objectReference: {fileID: 0}
    - target: {fileID: 3372738267075991122, guid: 8bc751e4cc7a8ba43918ec7f317556f9,
        type: 3}
      propertyPath: m_LocalEulerAnglesHint.x
      value: 0
      objectReference: {fileID: 0}
    - target: {fileID: 3372738267075991122, guid: 8bc751e4cc7a8ba43918ec7f317556f9,
        type: 3}
      propertyPath: m_LocalEulerAnglesHint.y
      value: 0
      objectReference: {fileID: 0}
    - target: {fileID: 3372738267075991122, guid: 8bc751e4cc7a8ba43918ec7f317556f9,
        type: 3}
      propertyPath: m_LocalEulerAnglesHint.z
      value: 0
      objectReference: {fileID: 0}
    - target: {fileID: 3372738267075991123, guid: 8bc751e4cc7a8ba43918ec7f317556f9,
        type: 3}
      propertyPath: _triggerCollider
      value: 
      objectReference: {fileID: 212053748836465369}
    - target: {fileID: 3372738267075991149, guid: 8bc751e4cc7a8ba43918ec7f317556f9,
        type: 3}
      propertyPath: m_Name
      value: e9e4944b91a5a4143be057b224e3ee71
      objectReference: {fileID: 0}
    - target: {fileID: 3372738268313813714, guid: 8bc751e4cc7a8ba43918ec7f317556f9,
        type: 3}
      propertyPath: m_LocalPosition.y
      value: 3.7
      objectReference: {fileID: 0}
    - target: {fileID: 3372738268313813714, guid: 8bc751e4cc7a8ba43918ec7f317556f9,
        type: 3}
      propertyPath: m_LocalPosition.z
      value: 0
      objectReference: {fileID: 0}
    m_RemovedComponents: []
  m_SourcePrefab: {fileID: 100100000, guid: 8bc751e4cc7a8ba43918ec7f317556f9, type: 3}
--- !u!1 &3180548794260413347 stripped
GameObject:
  m_CorrespondingSourceObject: {fileID: 3372738267075991149, guid: 8bc751e4cc7a8ba43918ec7f317556f9,
    type: 3}
  m_PrefabInstance: {fileID: 211048866430979534}
  m_PrefabAsset: {fileID: 0}
--- !u!4 &3180548794260413340 stripped
Transform:
  m_CorrespondingSourceObject: {fileID: 3372738267075991122, guid: 8bc751e4cc7a8ba43918ec7f317556f9,
    type: 3}
  m_PrefabInstance: {fileID: 211048866430979534}
  m_PrefabAsset: {fileID: 0}
--- !u!1001 &4495672092430342429
PrefabInstance:
  m_ObjectHideFlags: 0
  serializedVersion: 2
  m_Modification:
    m_TransformParent: {fileID: 3180548794260413340}
    m_Modifications:
    - target: {fileID: -4216859302048453862, guid: fc11e1fae7de37444b408275519113f0,
        type: 3}
      propertyPath: m_LocalPosition.x
      value: 0
      objectReference: {fileID: 0}
    - target: {fileID: -4216859302048453862, guid: fc11e1fae7de37444b408275519113f0,
        type: 3}
      propertyPath: m_LocalPosition.y
      value: 5
      objectReference: {fileID: 0}
    - target: {fileID: -4216859302048453862, guid: fc11e1fae7de37444b408275519113f0,
        type: 3}
      propertyPath: m_LocalPosition.z
      value: 0
      objectReference: {fileID: 0}
    - target: {fileID: -4216859302048453862, guid: fc11e1fae7de37444b408275519113f0,
        type: 3}
      propertyPath: m_LocalRotation.x
      value: 0
      objectReference: {fileID: 0}
    - target: {fileID: -4216859302048453862, guid: fc11e1fae7de37444b408275519113f0,
        type: 3}
      propertyPath: m_LocalRotation.y
      value: 0.7071068
      objectReference: {fileID: 0}
    - target: {fileID: -4216859302048453862, guid: fc11e1fae7de37444b408275519113f0,
        type: 3}
      propertyPath: m_LocalRotation.z
      value: 0
      objectReference: {fileID: 0}
    - target: {fileID: -4216859302048453862, guid: fc11e1fae7de37444b408275519113f0,
        type: 3}
      propertyPath: m_LocalRotation.w
      value: 0.7071068
      objectReference: {fileID: 0}
    - target: {fileID: -4216859302048453862, guid: fc11e1fae7de37444b408275519113f0,
        type: 3}
      propertyPath: m_RootOrder
      value: 1
      objectReference: {fileID: 0}
    - target: {fileID: -4216859302048453862, guid: fc11e1fae7de37444b408275519113f0,
        type: 3}
      propertyPath: m_LocalEulerAnglesHint.x
      value: 0
      objectReference: {fileID: 0}
    - target: {fileID: -4216859302048453862, guid: fc11e1fae7de37444b408275519113f0,
        type: 3}
      propertyPath: m_LocalEulerAnglesHint.y
      value: 90
      objectReference: {fileID: 0}
    - target: {fileID: -4216859302048453862, guid: fc11e1fae7de37444b408275519113f0,
        type: 3}
      propertyPath: m_LocalEulerAnglesHint.z
      value: 0
      objectReference: {fileID: 0}
    - target: {fileID: -927199367670048503, guid: fc11e1fae7de37444b408275519113f0,
        type: 3}
      propertyPath: m_Name
      value: H_helicopter
      objectReference: {fileID: 0}
    m_RemovedComponents: []
  m_SourcePrefab: {fileID: 100100000, guid: fc11e1fae7de37444b408275519113f0, type: 3}
--- !u!1 &5567074643467943956 stripped
GameObject:
  m_CorrespondingSourceObject: {fileID: -927199367670048503, guid: fc11e1fae7de37444b408275519113f0,
    type: 3}
  m_PrefabInstance: {fileID: 4495672092430342429}
  m_PrefabAsset: {fileID: 0}
