%YAML 1.1
%TAG !u! tag:unity3d.com,2011:
--- !u!1001 &3747487991631116373
PrefabInstance:
  m_ObjectHideFlags: 0
  serializedVersion: 2
  m_Modification:
    m_TransformParent: {fileID: 0}
    m_Modifications:
    - target: {fileID: 819729052715256946, guid: 802f7b51fae4c24478da8f75457498e3,
        type: 3}
      propertyPath: m_Name
      value: CE_Pyroblast
      objectReference: {fileID: 0}
    - target: {fileID: 1486521361503659171, guid: 802f7b51fae4c24478da8f75457498e3,
        type: 3}
      propertyPath: m_LocalPosition.x
      value: 0
      objectReference: {fileID: 0}
    - target: {fileID: 1486521361503659171, guid: 802f7b51fae4c24478da8f75457498e3,
        type: 3}
      propertyPath: m_LocalPosition.y
      value: 0
      objectReference: {fileID: 0}
    - target: {fileID: 1486521361503659171, guid: 802f7b51fae4c24478da8f75457498e3,
        type: 3}
      propertyPath: m_LocalPosition.z
      value: 0
      objectReference: {fileID: 0}
    - target: {fileID: 1486521361503659171, guid: 802f7b51fae4c24478da8f75457498e3,
        type: 3}
      propertyPath: m_LocalRotation.x
      value: 0
      objectReference: {fileID: 0}
    - target: {fileID: 1486521361503659171, guid: 802f7b51fae4c24478da8f75457498e3,
        type: 3}
      propertyPath: m_LocalRotation.y
      value: 0
      objectReference: {fileID: 0}
    - target: {fileID: 1486521361503659171, guid: 802f7b51fae4c24478da8f75457498e3,
        type: 3}
      propertyPath: m_LocalRotation.z
      value: 0
      objectReference: {fileID: 0}
    - target: {fileID: 1486521361503659171, guid: 802f7b51fae4c24478da8f75457498e3,
        type: 3}
      propertyPath: m_LocalRotation.w
      value: 1
      objectReference: {fileID: 0}
    - target: {fileID: 1486521361503659171, guid: 802f7b51fae4c24478da8f75457498e3,
        type: 3}
      propertyPath: m_RootOrder
      value: 0
      objectReference: {fileID: 0}
    - target: {fileID: 1486521361503659171, guid: 802f7b51fae4c24478da8f75457498e3,
        type: 3}
      propertyPath: m_LocalEulerAnglesHint.x
      value: -90
      objectReference: {fileID: 0}
    - target: {fileID: 1486521361503659171, guid: 802f7b51fae4c24478da8f75457498e3,
        type: 3}
      propertyPath: m_LocalEulerAnglesHint.y
      value: 0
      objectReference: {fileID: 0}
    - target: {fileID: 1486521361503659171, guid: 802f7b51fae4c24478da8f75457498e3,
        type: 3}
      propertyPath: m_LocalEulerAnglesHint.z
      value: 0
      objectReference: {fileID: 0}
    - target: {fileID: 1486521361503659171, guid: 802f7b51fae4c24478da8f75457498e3,
        type: 3}
      propertyPath: m_LocalScale.x
      value: 5
      objectReference: {fileID: 0}
    - target: {fileID: 1486521361503659171, guid: 802f7b51fae4c24478da8f75457498e3,
        type: 3}
      propertyPath: m_LocalScale.y
      value: 5
      objectReference: {fileID: 0}
    - target: {fileID: 1486521361503659171, guid: 802f7b51fae4c24478da8f75457498e3,
        type: 3}
      propertyPath: m_LocalScale.z
      value: 5
      objectReference: {fileID: 0}
    - target: {fileID: 3448445883046493047, guid: 802f7b51fae4c24478da8f75457498e3,
        type: 3}
      propertyPath: m_Materials.Array.data[0]
      value: 
      objectReference: {fileID: 2100000, guid: 23fe90d523f0bb341acb23bab1f33473, type: 2}
    m_RemovedComponents: []
  m_SourcePrefab: {fileID: 100100000, guid: 802f7b51fae4c24478da8f75457498e3, type: 3}
