[
  {
    "id":"1",
    "action":"Окраснил",
    "type":"vector"
  },
  {
    "id":"2",
    "action":"Очернил",
    "type":"vector"
  },
  {
    "id":"3",
    "action":"Вскрылся комиссаром",
    "type":"self"
  },
  {
    "id":"4",
    "action":"Выставил",
    "type":"vector"
  },
  {
    "id":"5",
    "action":"Проверил",
    "type":"vector"
  }
]