{
  BitmapFont: { default-font: { file: font2.fnt } },
  Color: {
    green: { a: 1, b: 0, g: 1, r: 0 },
    white: { a: 1, b: 1, g: 1, r: 1 },
    red: { a: 1, b: 0, g: 0, r: 1 },
    black: { a: 1, b: 0, g: 0, r: 0 },
    gray: { a: 1, b: 0.8, g: 0.8, r: 0.8 },
    purple: { a: 1, b: 0.462, g: 0.05, r: 0.662 },
    neon: { a: 1, b: 0.819, g: 0.8, r: 0.454 },
  },
  LabelStyle: {
    default: { font: default-font, fontColor: neon }
  },

}