[
    {
        "_id": "LG1201",
        "product_name": "Puppy mini & medium breeds (adult weight up to 30 kg)",
        "category": "Low Grain",
        "composition": "COMPOSITION : dehydrated meat : chicken (31%), rice (20%), peas (16%), chicken fat (13,5%), corn (10%), dehydrated fish (2%), carob pod (2%), salmon oil (1,5% including 5% DHA), beet pulp (1,5%), dehydrated eggs (1%), brewer's yeast, sodium chloride, fructo and manno-oligosaccharides, ascophyllum nodosum, plants (thyme, chamomile flower, fennel, echinacea), yucca schidigera extract.",
        "additives": "VITAMINS : vitamin A : 20.000UI, vitamin D3 : 1.500UI, vitamin E : 100UI. TRACE ELEMENTS : copper (copper sulphate penta hydrate) : 2 mg, iron (ferrous sulphate monohydrate) : 33 mg, iodine (potassium iodide) : 3,3 mg, selenium (sodium selenite) : 0,24 mg, manganese (manganese oxide) : 40 mg, zinc (zinc oxide) : 110 mg, copper (hydrated amino acid copper chelate) : 5 mg, zinc (zinc chelate of hydrated amino acid) : 8 mg, with natural antioxidants from plant extracts.",
        "constituents": "ANALYTICAL CONSTITUENTS : proteins : 30%, fat content : 20% (including omega-6 unsaturated fatty acids : 3,00%, omega-3 unsaturated fatty acids : 0,45%), moisture : 8%, inorganic matter : 7,5%, crude fibres : 2,5%, calcium : 1,65%, phosphorus : 1,1%.",
        "weight": "4KG - 12KG",
        "formula": "F3"
    }, 
    {
        "_id": "LG1202",
        "product_name": "Puppy large breeds (> 30 kg)",
        "category": "Low grain",
        "composition": "COMPOSITION : dehydrated meat : chicken (30%), rice (20%), peas (15%), chicken fat (10%), corn (10%), dehydrated salmon (5%), carob pod (4,5%), salmon oil (1,5% including 5% DHA), beet pulp (1,5%), brewer's yeast (1%), sodium chloride, fructo and manno-oligosaccharides, chondroitin sulphate and glucosamine, ascophyllum nodosum, plants (thyme, chamomile flower, fennel, echinacea), yucca schidigera extract.",
        "additives": "VITAMINS : vitamin A : 20.000UI, vitamin D3 : 1.500UI, vitamin E : 100UI. TRACE ELEMENTS : copper (copper sulphate penta hydrate) : 2 mg, iron (ferrous sulphate monohydrate) : 33 mg, iodine (potassium iodide) : 3,3 mg, selenium (sodium selenite) : 0,24 mg, manganese (manganese oxide) : 40 mg, zinc (zinc oxide) : 110 mg, copper (hydrated amino acid copper chelate) : 5 mg, zinc (zinc chelate of hydrated amino acid): 8 mg, with natural antioxidants of plant extracts.",
        "constituents": "ANALYTICAL CONSTITUENTS : proteins : 30%, fat content : 16% (including omega-6 unsaturated fatty acids : 2,3%, omega-3 unsaturated fatty acids : 0,4%), inorganic matter : 8%, moisture : 8%, crude fiber : 2,5%, calcium : 1,5%, phosphorus : 1%.",
        "weight": "12 KG",
        "formula": "F2"
    },
    {
        "_id": "LG1203",
        "product_name": "Adult Mini Breeds (< 10 kg)",
        "category": "Low grain",
        "composition": "COMPOSITION : dehydrated meat : chicken (31%), rice (20%), peas (16%), chicken fat (13,5%), corn (10%), dehydrated fish (2%), carob pod (2%), salmon oil (1,5% including 5% DHA), beet pulp (1,5%), dehydrated eggs (1%), brewer's yeast, sodium chloride, fructo and manno-oligosaccharides, ascophyllum nodosum, plants (thyme, chamomile flower, fennel, echinacea), yucca schidigera extract.",
        "additives": "VITAMINS : vitamin A : 20.000UI, vitamin D3 : 1.500UI, vitamin E : 100UI. TRACE ELEMENTS : copper (copper sulphate penta hydrate) : 2 mg, iron (ferrous sulphate monohydrate) : 33 mg, iodine (potassium iodide) : 3,3 mg, selenium (sodium selenite) : 0,24 mg, manganese (manganese oxide) : 40 mg, zinc (zinc oxide) : 110 mg, copper (hydrated amino acid copper chelate) : 5 mg, zinc (zinc chelate of hydrated amino acid) : 8 mg, with natural antioxidants from plant extracts.",
        "constituents": "ANALYTICAL CONSTITUENTS : proteins : 30%, fat content : 20% (including omega-6 unsaturated fatty acids : 3,00%, omega-3 unsaturated fatty acids : 0,45%), moisture : 8%, inorganic matter : 7,5%, crude fibres : 2,5%, calcium : 1,65%, phosphorus : 1,1%.",
        "weight": "4KG - 12KG",
        "formula": "F3"
    },
    {
        "_id": "LG1204",
        "product_name": "Adult Medium Breeds (from 10 kg to 30 kg)",
        "category": "Low grain",
        "composition": "COMPOSITION : dehydrated meat : chicken (30%), rice (20%), peas (15%), chicken fat (10%), corn (10%), dehydrated salmon (5%), carob pod (4,5%), salmon oil (1,5% including 5% DHA), beet pulp (1,5%), brewer's yeast (1%), sodium chloride, fructo and manno-oligosaccharides, chondroitin sulphate and glucosamine, ascophyllum nodosum, plants (thyme, chamomile flower, fennel, echinacea), yucca schidigera extract.",
        "additives": "VITAMINS : vitamin A : 20.000UI, vitamin D3 : 1.500UI, vitamin E : 100UI. TRACE ELEMENTS : copper (copper sulphate penta hydrate) : 2 mg, iron (ferrous sulphate monohydrate) : 33 mg, iodine (potassium iodide) : 3,3 mg, selenium (sodium selenite) : 0,24 mg, manganese (manganese oxide) : 40 mg, zinc (zinc oxide) : 110 mg, copper (hydrated amino acid copper chelate) : 5 mg, zinc (zinc chelate of hydrated amino acid): 8 mg, with natural antioxidants of plant extracts.",
        "constituents": "ANALYTICAL CONSTITUENTS : proteins : 30%, fat content : 16% (including omega-6 unsaturated fatty acids : 2,3%, omega-3 unsaturated fatty acids : 0,4%), inorganic matter : 8%, moisture : 8%, crude fiber : 2,5%, calcium : 1,5%, phosphorus : 1%.",
        "weight": "4KG - 12KG",
        "formula": "F2"
    },
    {
        "_id": "LG1205",
        "product_name": "Adult Large Breeds > 30 kg",
        "category": "Low grain",
        "composition": "COMPOSITION : dehydrated meat : chicken (33%), rice (20%), peas (16%), chicken fat (10%), corn (10%), dehydrated fish (2,5%), carob pod (2,5%), beet pulp (2%), salmon oil (1,5% including 5% DHA), brewer's yeast (1%), dehydrated eggs, sodium chloride, fructo and manno-oligosaccharides, chondroitin sulphate and glucosamine, ascophyllum nodosum, plants (thyme, chamomile flower, fennel, echinacea), yucca schidigera extract.",
        "additives": "VITAMINS : vitamin A : 20.000UI, vitamin D3 : 1.500UI, vitamin E : 100UI. TRACE ELEMENTS : copper (copper sulphate penta hydrate) : 2 mg, iron (ferrous sulphate monohydrate) : 33 mg, iodine (potassium iodide) : 3,3 mg, selenium (sodium selenite) : 0,24 mg, manganese (manganese oxide) : 40 mg, zinc (zinc oxide) : 110 mg, copper (hydrated amino acid copper chelate) : 5 mg, zinc (zinc chelate of hydrated amino acid) : 8 mg, with natural antioxidants of plant extracts.",
        "constituents": "ANALYTICAL CONSTITUENTS : proteins : 30%, fat content : 18% (including omega-6 unsaturated fatty acids : 2,60% and omega-3 unsaturated fatty acids : 0,44%), inorganic matter : 8%, moisture : 8%, crude fibres : 2,5%, calcium : 1,65%, phosphorus : 1,1%.",
        "weight": "12 KG",
        "formula": "F4"
    },
    {
        "_id": "LG1206",
        "product_name": "Active Adult all breeds",
        "category": "Low grain",
        "composition": "COMPOSITION : dehydrated meat : chicken (32%), rice (19%), peas (15,5%), chicken fat (10%), salmon oil (4% including 5% DHA), corn (10%), dehydrated fish (2,5%), carob pod (2,5%), beet pulp (2%), brewer's yeast (1%), dehydrated eggs, sodium chloride, fructo and manno-oligosaccharides, chondroitin sulphate and glucosamine, ascophyllum nodosum, plants (thyme, chamomile flower, fennel, echinacea), yucca schidigera extract.",
        "additives": "VITAMINS : vitamin A : 20.000UI, vitamin D3 : 1.500UI, vitamin E : 100UI. TRACE ELEMENTS : copper (copper sulphate penta hydrate) : 2 mg, iron (ferrous sulphate monohydrate) : 33 mg, iodine (potassium iodide) : 3,3 mg, selenium (sodium selenite) : 0,24 mg, manganese (manganese oxide) : 40 mg, zinc (zinc oxide) : 110 mg, copper (hydrated amino acid copper chelate) : 5 mg, zinc (zinc chelate of hydrated amino acid) : 8 mg, with natural antioxidants of plant extracts.",
        "constituents": "ANALYTICAL CONSTITUENTS : proteins : 29%, fat content : 21% (including omega-6 unsaturated fatty acids : 3,08% and omega-3 unsaturated fatty acids : 0,87%), inorganic matter : 8%, moisture : 8%, crude fibres : 2,0%, calcium : 1,65%, phosphorus : 1,1%.",
        "weight": "12 KG",
        "formula": "F4"
    },
    {
        "_id": "LG1207",
        "product_name": "Adult all breeds - Salmon and Rice",
        "category": "Low grain",
        "composition": "COMPOSITION : dehydrated meat : chicken (30%), rice (20%), peas (15%), chicken fat (10%), corn (10%), dehydrated salmon (5%), carob pod (4,5%), salmon oil (1,5% including 5% DHA), beet pulp (1,5%), brewer's yeast (1%), sodium chloride, fructo and manno-oligosaccharides, chondroitin sulphate and glucosamine, ascophyllum nodosum, plants (thyme, chamomile flower, fennel, echinacea), yucca schidigera extract.",
        "additives": "VITAMINS : vitamin A : 20.000UI, vitamin D3 : 1.500UI, vitamin E : 100UI. TRACE ELEMENTS : copper (copper sulphate penta hydrate) : 2 mg, iron (ferrous sulphate monohydrate) : 33 mg, iodine (potassium iodide) : 3,3 mg, selenium (sodium selenite) : 0,24 mg, manganese (manganese oxide) : 40 mg, zinc (zinc oxide) : 110 mg, copper (hydrated amino acid copper chelate) : 5 mg, zinc (zinc chelate of hydrated amino acid): 8 mg, with natural antioxidants of plant extracts.",
        "constituents": "ANALYTICAL CONSTITUENTS : proteins : 30%, fat content : 16% (including omega-6 unsaturated fatty acids : 2,3%, omega-3 unsaturated fatty acids : 0,4%), inorganic matter : 8%, moisture : 8%, crude fiber : 2,5%, calcium : 1,5%, phosphorus : 1%.",
        "weight": "12 KG",
        "formula": "F2"
    },
    {
        "_id": "LG1208",
        "product_name": "Adult sensitive dog all breeds - Lamb & Rice",
        "category": "Low grain",
        "composition": "COMPOSITION : dehydrated meat : chicken (30%), rice (20%), peas (15%), chicken fat (10%), corn (10%), dehydrated salmon (5%), carob pod (4,5%), salmon oil (1,5% including 5% DHA), beet pulp (1,5%), brewer's yeast (1%), sodium chloride, fructo and manno-oligosaccharides, chondroitin sulphate and glucosamine, ascophyllum nodosum, plants (thyme, chamomile flower, fennel, echinacea), yucca schidigera extract.",
        "additives": "VITAMINS : vitamin A : 20.000UI, vitamin D3 : 1.500UI, vitamin E : 100UI. TRACE ELEMENTS : copper (copper sulphate penta hydrate) : 2 mg, iron (ferrous sulphate monohydrate) : 33 mg, iodine (potassium iodide) : 3,3 mg, selenium (sodium selenite) : 0,24 mg, manganese (manganese oxide) : 40 mg, zinc (zinc oxide) : 110 mg, copper (hydrated amino acid copper chelate) : 5 mg, zinc (zinc chelate of hydrated amino acid): 8 mg, with natural antioxidants of plant extracts.",
        "constituents": "ANALYTICAL CONSTITUENTS : proteins : 30%, fat content : 16% (including omega-6 unsaturated fatty acids : 2,3%, omega-3 unsaturated fatty acids : 0,4%), inorganic matter : 8%, moisture : 8%, crude fiber : 2,5%, calcium : 1,5%, phosphorus : 1%.",
        "weight": "4KG - 12KG",
        "formula": "F1"
    },
    {
        "_id": "LG1209",
        "product_name": "Overweighted-Sterilized Dog all breeds",
        "category": "Low grain",
        "composition": "COMPOSITION : dehydrated meat : chicken (30%), rice (20%), peas (15%), chicken fat (10%), corn (10%), dehydrated salmon (5%), carob pod (4,5%), salmon oil (1,5% including 5% DHA), beet pulp (1,5%), brewer's yeast (1%), sodium chloride, fructo and manno-oligosaccharides, chondroitin sulphate and glucosamine, ascophyllum nodosum, plants (thyme, chamomile flower, fennel, echinacea), yucca schidigera extract.",
        "additives": "VITAMINS : vitamin A : 20.000UI, vitamin D3 : 1.500UI, vitamin E : 100UI. TRACE ELEMENTS : copper (copper sulphate penta hydrate) : 2 mg, iron (ferrous sulphate monohydrate) : 33 mg, iodine (potassium iodide) : 3,3 mg, selenium (sodium selenite) : 0,24 mg, manganese (manganese oxide) : 40 mg, zinc (zinc oxide) : 110 mg, copper (hydrated amino acid copper chelate) : 5 mg, zinc (zinc chelate of hydrated amino acid): 8 mg, with natural antioxidants of plant extracts.",
        "constituents": "ANALYTICAL CONSTITUENTS : proteins : 30%, fat content : 16% (including omega-6 unsaturated fatty acids : 2,3%, omega-3 unsaturated fatty acids : 0,4%), inorganic matter : 8%, moisture : 8%, crude fiber : 2,5%, calcium : 1,5%, phosphorus : 1%.",
        "weight": "12KG",
        "formula": "F1"
    },
    {
        "_id": "LG1210",
        "product_name": "Mature Dog > 8 all breeds",
        "category": "Low grain",
        "composition": "COMPOSITION : dehydrated meat : chicken (30%), rice (20%), peas (15%), chicken fat (10%), corn (10%), dehydrated salmon (5%), carob pod (4,5%), salmon oil (1,5% including 5% DHA), beet pulp (1,5%), brewer's yeast (1%), sodium chloride, fructo and manno-oligosaccharides, chondroitin sulphate and glucosamine, ascophyllum nodosum, plants (thyme, chamomile flower, fennel, echinacea), yucca schidigera extract.",
        "additives": "VITAMINS : vitamin A : 20.000UI, vitamin D3 : 1.500UI, vitamin E : 100UI. TRACE ELEMENTS : copper (copper sulphate penta hydrate) : 2 mg, iron (ferrous sulphate monohydrate) : 33 mg, iodine (potassium iodide) : 3,3 mg, selenium (sodium selenite) : 0,24 mg, manganese (manganese oxide) : 40 mg, zinc (zinc oxide) : 110 mg, copper (hydrated amino acid copper chelate) : 5 mg, zinc (zinc chelate of hydrated amino acid): 8 mg, with natural antioxidants of plant extracts.",
        "constituents": "ANALYTICAL CONSTITUENTS : proteins : 30%, fat content : 16% (including omega-6 unsaturated fatty acids : 2,3%, omega-3 unsaturated fatty acids : 0,4%), inorganic matter : 8%, moisture : 8%, crude fiber : 2,5%, calcium : 1,5%, phosphorus : 1%.",
        "weight": "12KG",
        "formula": "F1"
    }
]
