[
    {
        "_id": "WET01",
        "product_name": "TENDER CHUNKS IN GRAVY FOR ADULT CAT",
        "category": "Made without grain",
        "cat": "wet",
        "product_1": "Tender chunks with salmon in gravy",
        "product_2": "Tender chunks with cod in gravy",
        "composition_1": "<strong>COMPOSITION :</strong> pork 20% (including livers and lungs), poultry 15% (including hearts, livers, meats, necks), salmon 8% (18% in chunks), pea fiber, fish oil 0.2%.",
        "composition_2": "<strong>COMPOSITION :</strong> pork 20% (including livers and lungs), poultry 15% (including livers, hearts, meats, necks), cod 8% (18% in chunks),  pea fiber, fish oil 0.2%.",
        "additives_1": "<strong>ADDITIVES :</strong> Nutritional additives (by Kg) : vitamin D3 : 167 IU, vitamin E : 33 mg, vitamin B1: 2.57mg, taurine : 241.6 mg, copper (E4) : 0.64 mg, manganese (E5) : 1.97 mg, zinc (E6) : 16.70  mg, iodine (E2)  : 0.16 mg, omega 3 : 722.9  mg. Technological additives : Cassia gum : 99 mg.",
        "additives_2": "<strong>ADDITIVES :</strong> Nutritional  additives (by Kg) : vitamin D3 : 167 IU, vitamin E : 33 mg, vitamin B1: 2.57mg, taurine : 241.6 mg, copper (E4) : 0.64 mg, manganese (E5) : 1.97 mg, zinc (E6) : 16.70  mg, iodine (E2)  : 0.16 mg, omega 3 : 722.9  mg. Technological Additives : Cassia gum : 99 mg.",
        "constituents_1": "<strong>ANALYTICAL CONSTITUENTS :</strong> crude protein : 10.0%, crude fiber : 0.5%, fat content : 4.5%, crude ash : 2.0%, moisture : 81.0%, metabolisable energy : 86 Kcal.",
        "constituents_2": "<strong>ANALYTICAL CONSTITUENTS :</strong> crude protein : 10.0%, crude fiber : 0.5%, fat content : 4.5%, crude ash : 2.0%, moisture : 81.0%, metabolisable energy : 86 Kcal.",
        "weight": "2 packs of 24 pouches (12 x 85g salmon and 12 x 85g cod)",
        "weight1": "2 packs x 24 pouches"
    },
    {
        "_id": "WET02",
        "product_name": "TENDER CHUNKS IN GRAVY FOR ADULT CAT",
        "category": "Made without grain",
        "cat": "wet",
        "product_1": "Tender chunks with chicken in gravy",
        "product_2": "Tender chunks with turkey in gravy",
        "composition_1": "<strong>COMPOSITION :</strong> poultry 25% (chicken (including 24% in chunks) and turkey : including livers, hearts, meats, necks), pork 20% (including livers, lungs), pea fiber, fish oil 0.2%.",
        "composition_2": "<strong>COMPOSITION :</strong> poultry 25% (turkey (including 24% in chunks) and chicken : including livers, hearts, meats, necks), pork 20% (including livers, lungs), pea fiber, fish oil 0.2%.",
        "additives_1": "<strong>ADDITIVES :</strong> Nutritional additives (by Kg) : vitamin D3 : 167 IU, vitamin E : 33 mg, vitamin B1: 2.57mg, taurine : 241.6 mg, copper (E4) : 0.64 mg, manganese (E5) : 1.97 mg, zinc (E6) : 16.70  mg, iodine (E2)  : 0.16 mg, omega 3 : 722.9  mg. Technological Additives : Cassia gum : 99 mg.",
        "additives_2": "<strong>ADDITIVES :</strong> Nutritional additives (by Kg) : vitamin D3 : 167 IU, vitamin E : 33 mg, vitamin B1: 2.57mg, taurine : 241.6 mg, copper (E4) : 0.64 mg, manganese (E5) : 1.97 mg, zinc (E6) : 16.70  mg, iodine (E2)  : 0.16 mg, omega 3 : 722.9  mg. Technological Additives : Cassia gum : 99 mg.",
        "constituents_1": "<strong>ANALYTICAL CONSTITUENTS :</strong> crude protein : 10.0%, crude fiber : 0.5%, fat content : 4.5%, crude ash : 2.0%, moisture : 81.0%, metabolisable energy : 86 Kcal.",
        "constituents_2": "<strong>ANALYTICAL CONSTITUENTS :</strong> crude protein : 10.0%, crude fiber : 0.5%, fat content : 4.5%, crude ash : 2.0%, moisture : 81.0%, metabolisable energy : 86 Kcal.",
        "weight": "2 packs of 24 pouches (12 x 85g chicken and 12 x 85g turkey)",
        "weight1": "2 packs x 24 pouches"
    },
    {
        "_id": "WET03",
        "product_name": "FILLETS IN GRAVY RICH IN CHICKEN FOR ADULT CAT & KITTEN",
        "category": "Made without grain",
        "cat": "wet",
        "composition": "<strong>COMPOSITION :</strong> poultry 39% (chicken (60% in fillets) and turkey : including meats), pork 7% (including livers), pea fiber, fish oil 0.1%.",
        "additives": "<strong>ADDITIVES :</strong> vitamin A : 0.44 mg, vitamin B1 : 3.80 mg,  vitamine E : 32 mg, taurine : 426.6 mg, copper (E4) : 0.63 mg, manganese (E5) : 2.03 mg, zinc (E6) : 9.14 mg, iodine (E2) : 0.30 mg, iron (E1) : 10.15 mg, omega 3 : 374.6 mg. Technological Additives : Cassia gum : 97 mg.",
        "constituents": "<strong>ANALYTICAL CONSTITUENTS :</strong> crude protein : 10.0%, crude fiber : 0.5%, fat content : 4.0%, crude ash : 2.0%, moisture : 80.0%, metabolisable energy : 87 Kcal.",
        "weight": "2 packs of 24 pouches (24 x 85g chicken)",
        "weight1": "2 packs x 24 pouches"
    },
    {
        "_id": "LOT3WET04",
        "product_name": "NATURAL MOUSSE WITH CHICKEN & SOLE",
        "category": "Made without grain",
        "cat": "wet",
        "composition": "<strong>COMPOSITION :</strong> poultry 45% (chicken and turkey), pork 13% (including liver and lung), calcium, phosphorus.",
        "additives": "<strong>ADDITIVES :</strong> Nutritional additives (by Kg) : Vitamin D3 : 356UI, Vitamin E : 27,5 mg, Vitamin B1 : 3400UI, Taurine : 270 mg, zinc (zinc sulfate monohydrate) : 10,2 mg, iron (iron sulfate (II) monohydrate) : 8,1 mg, manganese (manganous sulfate monohydrate) : 0,9 mg, copper (copper sulphate (II) pentahydrate) : 0,52 mg.",
        "constituents": "<strong>ANALYTICAL CONSTITUENTS :</strong> crude protein : 11%, fat content : 7%, crude ash : 2%, crude fiber : 0,2%, moisture : 78%, calcium : 0,13%, phosphorus : 0,12%.",
        "weight": "3 packs of 12 tins (18 x 85g chicken and 18 x 85g sole)",
        "weight1": "3 packs x 12 tins"
    }
]
