Abrak,Rogue,Trial,365,100,3.65,
Achander,Priest,Raider,2191,811,2.7,
Afktroll,Warrior,Alter,0,100,0,
Agroman,Warrior,Miembro,0,100,0,
Aipod,Rogue,Miembro,0,100,0,
Akhmat,Warrior,Raider,2229,367,6.07,
Akrhos,Warrior,Miembro,0,100,0,
Alamirion,Warlock,Raider,1891,806,2.34,
Alhava,Druid,Miembro,0,100,0,
Alireth,Priest,Raider,1898,1081,1.75,
Alixx,Mage,Oficial,2205,723,3.04,
Alteisen,Warrior,Miembro,0,100,0,
Alyssea,Mage,Alter,0,100,0,
Alïxx,Priest,Oficial,2205,723,3.04,
Ambulancía,Priest,Miembro,37,100,0.37,
Amoxicilina,Priest,Miembro,0,100,0,
Andebel,Hunter,Miembro,0,100,0,
Antxon,Mage,Raider,1521,315,4.82,
Apolo,Hunter,Miembro,170,100,1.7,
Apölla,Warrior,Alter,0,100,0,
Aquarius,Druid,Miembro,9,100,0.09,
Aquetepincho,Rogue,Alter,0,100,0,
Artemissa,Hunter,Alter,0,100,0,
Artengo,Rogue,Miembro,0,100,0,
Ascherit,Warrior,Alter,0,100,0,
Askert,Priest,Miembro,0,100,0,
Auba,Mage,Alter,0,100,0,
Axeripper,Warrior,Alter,0,100,0,
Baldbanco,Warrior,Alter,0,100,0,
Baldnavajera,Rogue,Alter,0,100,0,
Baldsumm,Warlock,Alter,0,100,0,
Banknh,Warrior,Oficial,0,100,0,
Baradia,Mage,Alter,0,100,0,
Bellota,Warlock,Miembro,0,100,0,
Bersebank,Rogue,Miembro,0,100,0,
Bersërker,Hunter,Miembro,1192,639,1.86,
Biørn,Warrior,Miembro,0,100,0,
Biørnson,Mage,Miembro,0,100,0,
Blackflower,Druid,Alter,0,100,0,
Blowup,Warrior,Alter,0,100,0,
Bonanit,Warrior,Miembro,0,100,0,
Bradykardia,Mage,Alter,0,100,0,
Bullfighter,Shaman,Alter,0,100,0,
Bxxb,Rogue,Miembro,0,100,0,
Bäbayaga,Warrior,Miembro,62,100,0.62,
Bóreas,Mage,Alter,0,100,0,
Calderilla,Warrior,Alter,0,100,0,
Calendari,Mage,Miembro,0,100,0,
Caparazon,Warrior,Miembro,0,100,0,
Capator,Warlock,Alter,0,100,0,
Capitalismo,Shaman,Alter,0,100,0,
Ceniza,Rogue,Miembro,0,100,0,
Chamantafox,Shaman,Alter,0,100,0,
Charlyflow,Warlock,Alter,0,100,0,
Cherpos,Warlock,Miembro,11,100,0.11,
Clickareth,Priest,Alter,0,100,0,
Clikeraso,Hunter,Miembro,0,100,0,
Cloro,Mage,Miembro,0,100,0,
Cloroformo,Rogue,Miembro,0,100,0,
Cloudio,Rogue,Miembro,60,100,0.6,
Clínex,Warrior,Miembro,0,100,0,
Coldzera,Warrior,Oficial,1646,172,9.56,
Coronavirüs,Priest,Alter,0,100,0,
Creedfury,Warrior,Miembro,0,100,0,
Curitas,Priest,Miembro,0,100,0,
Detroitsmash,Shaman,Miembro,0,100,0,
Diecisiete,Hunter,Miembro,0,100,0,
Dinojoworge,Druid,Miembro,0,100,0,
Dodoswilly,Warrior,Miembro,0,100,0,
Dolios,Rogue,Alter,170,100,1.7,
Dolorete,Warrior,Miembro,0,100,0,
Dondralord,Warrior,Alter,0,100,0,
Dondïablo,Warlock,Raider,1845,651,2.83,
Donramön,Druid,Miembro,0,100,0,
Doriyaki,Rogue,Oficial,62,100,0.62,
Dragah,Hunter,Alter,0,100,0,
Draggha,Warrior,Raider,835,100,8.35,
Drakulean,Shaman,Miembro,0,100,0,
Dralax,Warlock,Alter,0,100,0,
Dralord,Rogue,Oficial,0,100,0,
Dralordenp,Warlock,Alter,0,100,0,
Drekter,Mage,Miembro,0,100,0,
Drepz,Mage,Miembro,0,100,0,
Drestone,Warlock,Alter,0,100,0,
Drogg,Warrior,Alter,0,100,0,
Drolard,Shaman,Alter,0,100,0,
Drunklord,Druid,Alter,0,100,0,
Dryada,Rogue,Miembro,0,100,0,
Duguy,Mage,Admin,30,100,0.3,
Dylengo,Shaman,Miembro,7,100,0.07,
Dys,Warrior,Alter,0,100,0,
Dërb,Priest,Miembro,0,100,0,
Echanterbank,Warlock,Alter,0,100,0,
Elenø,Warrior,Miembro,0,100,0,
Elnath,Rogue,Raider,2244,1128,1.98,
Elrasta,Druid,Miembro,0,100,0,
Elratero,Rogue,Alter,0,100,0,
Elsosio,Priest,Admin,2287,884,2.58,
Eltostadora,Warrior,Alter,0,100,0,
Eltrick,Warrior,Alter,0,100,0,
Elvyne,Priest,Raider,2309,796,2.9,
Elwito,Warrior,Miembro,0,100,0,
Elxamu,Warlock,Oficial,0,100,0,
Elyune,Shaman,Alter,0,100,0,
Escorbuto,Mage,Miembro,0,100,0,
Eskepeto,Shaman,Raider,2141,1038,2.06,
Esteso,Shaman,Miembro,0,100,0,
Ethernity,Rogue,Alter,0,100,0,
Etorki,Warrior,Miembro,0,100,0,
Fandungo,Rogue,Miembro,0,100,0,
Fatbunny,Warrior,Raider,2277,322,7.07,
Ferdìnand,Druid,Alter,0,100,0,
Fooddbank,Shaman,Alter,0,100,0,
Freeday,Shaman,Alter,0,100,0,
Frigorífico,Mage,Alter,0,100,0,
Frigélida,Mage,Miembro,0,100,0,
Furroberto,Druid,Miembro,0,100,0,
Fys,Priest,Alter,0,100,0,
Fâded,Rogue,Miembro,0,100,0,
Fórggès,Priest,Miembro,0,100,0,
Førgges,Warrior,Miembro,0,100,0,
Fúlgore,Shaman,Raider,1899,1207,1.57,
Gaeld,Warlock,Alter,0,100,0,
Gartontos,Warrior,Alter,0,100,0,
Gitanoeterno,Warlock,Miembro,0,100,0,
Gixon,Hunter,Oficial,0,100,0,
Gojever,Warlock,Miembro,0,100,0,
Gominola,Warrior,Alter,0,100,0,
Gorgri,Hunter,Miembro,0,100,0,
Gorhara,Warrior,Miembro,0,100,0,
Greenbad,Shaman,Miembro,0,100,0,
Greyak,Hunter,Alter,0,100,0,
Guldruk,Rogue,Alter,333,100,3.33,
Guldrukk,Shaman,Miembro,333,100,3.33,
Gurukuka,Hunter,Admin,2377,884,2.68,
Guspira,Mage,Alter,2309,796,2.9,
Gyntonic,Mage,Alter,0,100,0,
Gys,Hunter,Alter,0,100,0,
Hadhes,Mage,Miembro,0,100,0,
Halisco,Shaman,Miembro,0,100,0,
Hazariel,Druid,Alter,0,100,0,
Heiisenberg,Warlock,Alter,0,100,0,
Herigan,Mage,Miembro,0,100,0,
Hijoviento,Shaman,Alter,0,100,0,
Howakhan,Druid,Alter,0,100,0,
Howbank,Priest,Admin,0,100,0,
Hòlyshìt,Priest,Alter,0,100,0,
Icyal,Mage,Alter,1898,1081,1.75,
Igneleth,Warlock,Alter,0,100,0,
Infect,Rogue,Alter,0,100,0,
Infernoise,Warlock,Alter,0,100,0,
Inquisidora,Mage,Alter,0,100,0,
Irush,Hunter,Alter,0,100,0,
Iskancita,Mage,Alter,0,100,0,
Iskandor,Warrior,Miembro,63,100,0.63,
Itadori,Hunter,Miembro,0,100,0,
Ivarhuesado,Rogue,Raider,1871,1025,1.82,
Jacksparcow,Warrior,Miembro,0,100,0,
Jiburk,Hunter,Alter,2156,385,5.6,
Joeysongoku,Rogue,Miembro,0,100,0,
Juantamâriz,Mage,Alter,0,100,0,
Kalifronia,Mage,Alter,0,100,0,
Kamykaza,Hunter,Alter,0,100,0,
Kanarisbot,Shaman,Alter,0,100,0,
Kapinga,Rogue,Admin,0,100,0,
Kapulica,Priest,Alter,0,100,0,
Kardio,Warrior,Oficial,2049,385,5.32,
Karonte,Hunter,Miembro,0,100,0,
Kathz,Hunter,Alter,403,100,4.03,
Katuor,Warrior,Alter,0,100,0,
Kazallin,Rogue,Raider,1206,565,2.13,
Kebabdepollo,Mage,Alter,0,100,0,
Kerrikaberga,Mage,Alter,0,100,0,
Khronus,Druid,Alter,0,100,0,
Kielhyre,Shaman,Alter,0,100,0,
Kimira,Druid,Alter,0,100,0,
Krams,Warrior,Miembro,0,100,0,
Krimen,Warrior,Miembro,0,100,0,
Krimz,Warrior,Admin,2243,432,5.19,
Kräms,Mage,Miembro,0,100,0,
Kubabara,Warlock,Miembro,0,100,0,
Kuroshima,Rogue,Miembro,0,100,0,
Kushína,Warlock,Miembro,0,100,0,
Kymeh,Mage,Miembro,0,100,0,
Kyos,Hunter,Miembro,0,100,0,
Kóco,Hunter,Alter,0,100,0,
Kôê,Warlock,Raider,1397,496,2.81,
Lagente,Warrior,Miembro,0,100,0,
Larila,Rogue,Oficial,0,100,0,
Lasossia,Mage,Admin,2377,884,2.68,
Latinmaster,Druid,Miembro,0,100,0,
Lavandeira,Priest,Alter,0,100,0,
Lavenenö,Priest,Alter,0,100,0,
Legendario,Shaman,Alter,2076,1038,2,
Legolasz,Hunter,Alter,0,100,0,
Linkx,Warlock,Miembro,0,100,0,
Linnala,Warlock,Alter,0,100,0,
Litlecaprice,Mage,Miembro,0,100,0,
Lorey,Mage,Alter,1845,651,2.83,
Loxyy,Warlock,Alter,0,100,0,
Lucía,Warrior,Miembro,0,100,0,
Línnea,Mage,Alter,0,100,0,
Løreley,Hunter,Miembro,0,100,0,
Magopipi,Mage,Miembro,328,198,1.65,
Magotrol,Mage,Miembro,0,100,0,
Makeiro,Rogue,Raider,113,100,1.12,
Malborik,Warlock,Alter,0,100,0,
Malborus,Mage,Alter,0,100,0,
Malborø,Shaman,Alter,0,100,0,
Malbøra,Rogue,Miembro,0,100,0,
Malganix,Warlock,Miembro,0,100,0,
Mamachuka,Druid,Alter,0,100,0,
Manhúr,Warlock,Alter,2159,1128,1.91,
Manuelito,Priest,Alter,0,100,0,
Mardoxslim,Warrior,Miembro,0,100,0,
Mascachapas,Druid,Miembro,0,100,0,
Mcmardigan,Warrior,Miembro,0,100,0,
Melvyn,Mage,Raider,1682,711,2.36,
Mentrarg,Warlock,Miembro,0,100,0,
Meroitic,Warlock,Alter,0,100,0,
Micolapiz,Druid,Alter,0,100,0,
Midnighhtt,Warrior,Raider,885,133,6.65,
Milanuncios,Hunter,Alter,0,100,0,
Miscuyones,Shaman,Alter,0,100,0,
Misery,Warlock,Miembro,0,100,0,
Mitja,Priest,Miembro,0,100,0,
Miyazaki,Warrior,Oficial,2230,750,2.97,
Mochazo,Warrior,Miembro,0,100,0,
Mommel,Mage,Alter,0,100,0,
Moranï,Warrior,Alter,0,100,0,
Motor,Warrior,Raider,1919,120,15.99,
Moxyy,Mage,Alter,0,100,0,
Mugfa,Warlock,Miembro,0,100,0,
Munay,Warlock,Alter,0,100,0,
Muutilador,Warrior,Miembro,0,100,0,
Naiit,Mage,Alter,0,100,0,
Natalee,Priest,Alter,0,100,0,
Necrofobia,Priest,Alter,0,100,0,
Neytyry,Hunter,Alter,0,100,0,
Northenlight,Mage,Oficial,2095,1022,2.04,
Nothealing,Druid,Alter,0,100,0,
Nyxie,Warrior,Miembro,0,100,0,
Nyzh,Warrior,Oficial,2298,443,5.18,
Nëgan,Hunter,Alter,0,100,0,
Ojáncanu,Hunter,Oficial,2105,878,2.39,
Orcvocacion,Warlock,Admin,0,100,0,
Orxyy,Warrior,Alter,0,100,0,
Oxyo,Warrior,Alter,0,100,0,
Oxyy,Priest,Raider,1592,751,2.11,
Pandemico,Warlock,Alter,0,100,0,
Parajcj,Priest,Alter,54,100,0.54,
Patinete,Mage,Alter,0,100,0,
Pelaná,Shaman,Alter,0,100,0,
Penky,Hunter,Alter,0,100,0,
Perxita,Druid,Miembro,0,100,0,
Petrolislava,Priest,Miembro,0,100,0,
Picarton,Rogue,Miembro,0,100,0,
Pitimini,Warlock,Alter,0,100,0,
Poisongirl,Warlock,Alter,0,100,0,
Pompidu,Hunter,Alter,0,100,0,
Portalmän,Mage,Alter,0,100,0,
Potatoo,Rogue,Alter,1592,751,2.11,
Powershell,Mage,Alter,885,133,6.65,
Prisa,Hunter,Oficial,0,100,0,
Proyectotaut,Warlock,Alter,0,100,0,
Psicodelic,Warlock,Alter,0,100,0,
Pulgarcito,Shaman,Alter,2191,811,2.7,
Pulkoa,Warlock,Miembro,2,100,0.02,
Puñaladäs,Rogue,Alter,0,100,0,
Pálca,Druid,Alter,0,100,0,
Pënky,Rogue,Miembro,0,100,0,
Púlgas,Druid,Miembro,0,100,0,
Qtcuretumamy,Druid,Alter,0,100,0,
Queimada,Warlock,Alter,0,100,0,
Quiroz,Hunter,Miembro,0,100,0,
Qys,Rogue,Alter,0,100,0,
Rabal,Rogue,Miembro,0,100,0,
Rakyur,Warlock,Miembro,0,100,0,
Randgris,Priest,Alter,0,100,0,
Rauxa,Priest,Alter,0,100,0,
Razguit,Shaman,Miembro,54,100,0.54,
Rañapés,Shaman,Alter,0,100,0,
Reckiem,Warlock,Miembro,0,100,0,
Rego,Hunter,Alter,0,100,0,
Revoltbank,Warlock,Alter,0,100,0,
Revoltela,Priest,Admin,0,100,0,
Revoltice,Mage,Admin,0,100,0,
Revoltijo,Druid,Simio Mayor,2188,707,3.09,
Revoltiyo,Hunter,Admin,2188,707,3.09,
Revoltoy,Rogue,Alter,0,100,0,
Rimeblood,Mage,Miembro,0,100,0,
Rogkar,Warlock,Admin,2063,340,6.06,
Rogkär,Warrior,Admin,0,100,0,
Rognär,Hunter,Admin,0,100,0,
Roguetauren,Mage,Alter,15,100,0.15,
Routak,Druid,Alter,0,100,0,
Rølan,Mage,Miembro,0,100,0,
Sacerkeiro,Priest,Alter,0,100,0,
Salava,Rogue,Alter,0,100,0,
Sanadora,Priest,Alter,0,100,0,
Sanbenyto,Warlock,Miembro,0,100,0,
Sanguango,Rogue,Alter,0,100,0,
Scanor,Mage,Alter,0,100,0,
Selzzie,Warrior,Raider,1360,454,2.99,
Shamarisco,Shaman,Alter,2158,432,4.99,
Shibah,Warrior,Oficial,0,100,0,
Shokuvudar,Shaman,Alter,0,100,0,
Shurmana,Druid,Miembro,0,100,0,
Shusue,Priest,Miembro,28,100,0.28,
Skrp,Hunter,Alter,0,100,0,
Slayersbank,Rogue,Alter,0,100,0,
Soji,Priest,Alter,2129,367,5.8,
Sojiclickeru,Rogue,Alter,0,100,0,
Sombras,Rogue,Miembro,0,100,0,
Somvra,Druid,Alter,0,100,0,
Sopaderana,Warlock,Miembro,0,100,0,
Sopadsobre,Mage,Alter,0,100,0,
Sosio,Warrior,Alter,0,100,0,
Soxyy,Shaman,Alter,0,100,0,
Srdralord,Warrior,Alter,0,100,0,
Stanton,Mage,Miembro,0,100,0,
Sterleen,Rogue,Miembro,2,100,0.02,
Stickers,Warlock,Alter,0,100,0,
Summforu,Warrior,Alter,0,100,0,
Sumnormal,Warlock,Alter,0,100,0,
Suriy,Warrior,Miembro,0,100,0,
Sykalito,Mage,Alter,0,100,0,
Sykod,Rogue,Oficial,2296,1210,1.89,
Sylva,Hunter,Miembro,44,100,0.44,
Sylvainas,Shaman,Miembro,0,100,0,
Sylvanoss,Mage,Miembro,0,100,0,
Synnam,Mage,Miembro,0,100,0,
Szaalenden,Shaman,Alter,0,100,0,
Sádica,Hunter,Miembro,0,100,0,
Särumän,Mage,Alter,0,100,0,
Tattoogirl,Rogue,Alter,1302,385,3.38,
Taudarion,Druid,Raider,1605,1011,1.58,
Tepicopaleña,Rogue,Raider,1411,315,4.47,
Tetardas,Priest,Alter,0,100,0,
Tetropots,Warrior,Alter,0,100,0,
Tetrosi,Warlock,Admin,2212,894,2.47,
Thebanco,Warrior,Admin,0,100,0,
Thetruco,Shaman,Admin,2212,894,2.47,
Thetrucodad,Shaman,Miembro,0,100,0,
Thorhos,Warrior,Miembro,0,100,0,
Thrallroom,Shaman,Miembro,0,100,0,
Thruna,Warrior,Alter,0,100,0,
Tifaret,Mage,Alter,44,100,0.44,
Tiraflexas,Hunter,Alter,1532,553,2.77,
Tiromuerto,Hunter,Alter,0,100,0,
Tocamelfelpu,Druid,Alter,0,100,0,
Tolocursach,Warrior,Alter,0,100,0,
Tomaso,Mage,Alter,0,100,0,
Toroloka,Rogue,Alter,0,100,0,
Toroloko,Warrior,Raider,2213,385,5.74,
Torolokò,Shaman,Alter,0,100,0,
Tpman,Mage,Alter,0,100,0,
Trasno,Rogue,Alter,0,100,0,
Tripitosa,Mage,Miembro,0,100,0,
Trolarky,Mage,Miembro,0,100,0,
Trololoo,Priest,Miembro,0,100,0,
Tsukvyomi,Mage,Raider,2079,978,2.12,
Tsutey,Hunter,Alter,0,100,0,
Tupakok,Shaman,Alter,0,100,0,
Turek,Warrior,Miembro,0,100,0,
Turik,Druid,Admin,2063,340,6.06,
Tusa,Priest,Alter,0,100,0,
Tuturulo,Mage,Miembro,11,100,0.11,
Twister,Hunter,Alter,0,100,0,
Tyranittar,Warrior,Miembro,0,100,0,
Töroloko,Warlock,Alter,0,100,0,
Törolöcö,Warlock,Alter,0,100,0,
Uncensored,Warlock,Miembro,0,100,0,
Vacaloura,Druid,Admin,0,100,0,
Vaka,Shaman,Miembro,0,100,0,
Vanthras,Mage,Miembro,0,100,0,
Vasily,Hunter,Alter,0,100,0,
Vedra,Warrior,Miembro,0,100,0,
Vegetto,Warrior,Miembro,0,100,0,
Velka,Shaman,Alter,0,100,0,
Verva,Hunter,Miembro,0,100,0,
Vidriagón,Druid,Miembro,0,100,0,
Volkaz,Hunter,Miembro,0,100,0,
Volumedtevy,Rogue,Raider,1607,553,2.9,
Vultz,Mage,Alter,403,100,4.03,
Vîscus,Warlock,Alter,0,100,0,
Wacho,Mage,Alter,0,100,0,
Wîzard,Mage,Trial,0,100,0,
Xamakens,Priest,Alter,0,100,0,
Xamani,Shaman,Raider,2142,1125,1.9,
Xamau,Shaman,Oficial,2160,1022,2.11,
Xammy,Shaman,Miembro,0,100,0,
Xoselit,Druid,Raider,2143,856,2.5,
Xperl,Mage,Alter,0,100,0,
Xulailolalá,Warlock,Oficial,20,100,0.2,
Xxole,Warlock,Miembro,73,100,0.73,
Xxolencio,Rogue,Alter,0,100,0,
Xxoletank,Warrior,Alter,0,100,0,
Xxolickerbb,Warrior,Alter,0,100,0,
Xxøle,Mage,Alter,0,100,0,
Xys,Mage,Oficial,2298,443,5.18,
Yerita,Warrior,Raider,1390,385,3.61,
Yisuj,Priest,Miembro,0,100,0,
Yotecuroxd,Shaman,Miembro,0,100,0,
Yyggdrassil,Hunter,Miembro,46,100,0.46,
Zascajin,Warrior,Miembro,0,100,0,
Zhirános,Mage,Alter,0,100,0,
Zoxyy,Hunter,Alter,0,100,0,
Zulgoro,Shaman,Alter,0,100,0,
Ànima,Warlock,Alter,0,100,0,
Áse,Priest,Miembro,0,100,0,
Ânitta,Rogue,Alter,0,100,0,
Ålëxändrïä,Druid,Miembro,0,100,0,
Îcefox,Mage,Miembro,403,100,4.03,
Ðazeroth,Druid,Alter,0,100,0,
Ñaka,Druid,Miembro,0,100,0,
Ômpare,Hunter,Raider,995,450,2.21,
Örgrim,Warrior,Alter,0,100,0,
