{"Wall": {
  "args": {
    "0": {
      "name": "name",
      "type": "String",
      "value": "left"
    },
    "1": {
      "name": "name",
      "type": "String",
      "value": "up"
    }
  },
  "method": "delete"
}}