<?xml version="1.0" encoding="utf-8"?>
<!-- Generator: Adobe Illustrator 22.0.1, SVG Export Plug-In . SVG Version: 6.00 Build 0)  -->
<svg version="1.1" id="Layer_1" xmlns="http://www.w3.org/2000/svg" xmlns:xlink="http://www.w3.org/1999/xlink" x="0px" y="0px"
	 viewBox="0 0 85.3 85.1" style="enable-background:new 0 0 85.3 85.1;" xml:space="preserve">
<style type="text/css">
	.st0{fill:#ff1654;}
</style>
<path id="Прямоугольник_скругл._углы_4_копия_2" class="st0" d="M49.7,2.6l32.7,29.7
	c3.5,3.1,3.9,8.4,0.9,11.9c-0.3,0.3-0.6,0.6-0.9,0.9c-4,3.6-10.1,3.6-14.1,0L51.4,29.9v45.3c0,5.5-4.4,10-9.9,10c0,0,0,0,0,0l0,0
	c-5.5,0-10-4.4-10-9.9c0,0,0,0,0,0V32L17,45.1c-4,3.6-10.1,3.6-14.1,0c-3.5-3-3.9-8.4-0.9-11.9c0.3-0.3,0.6-0.6,0.9-0.9L35.6,2.6
	C39.6-0.9,45.6-0.9,49.7,2.6z"/>
</svg>
