<svg width="32" height="32" viewBox="0 0 32 32" fill="none" xmlns="http://www.w3.org/2000/svg">
    <circle cx="16" cy="16" r="15" stroke="white" stroke-width="2"/>
    <path fill-rule="evenodd" clip-rule="evenodd" d="M17 10C17 9.44772 16.5523 9 16 9C15.4477 9 15 9.44772 15 10V15H10C9.44771 15 9 15.4477 9 16C9 16.5523 9.44771 17 10 17H15V22C15 22.5523 15.4477 23 16 23C16.5523 23 17 22.5523 17 22V17H22C22.5523 17 23 16.5523 23 16C23 15.4477 22.5523 15 22 15H17V10Z" fill="white"/>
</svg>
