<!-- Generated by IcoMoon.io -->
<svg version="1.1" xmlns="http://www.w3.org/2000/svg" width="32" height="32" viewBox="0 0 32 32">
<title>android</title>
<path d="M27.75 10q-0.813 0-1.375 0.594t-0.563 1.406v7.75q0 0.813 0.563 1.375t1.375 0.563 1.375-0.563 0.563-1.375v-7.75q0-0.813-0.563-1.406t-1.375-0.594zM4.25 10q-0.813 0-1.375 0.594t-0.563 1.406v7.75q0 0.813 0.563 1.375t1.375 0.563 1.375-0.563 0.563-1.375v-7.75q0-0.813-0.563-1.406t-1.375-0.594zM7.375 10.063v14.125q0 0.625 0.438 1.094t1.063 0.469h1.75v4.25q0 0.813 0.563 1.406t1.375 0.594 1.375-0.594 0.563-1.406v-4.25h3.063v4.25q0 0.813 0.563 1.406t1.375 0.594 1.375-0.594 0.563-1.406v-4.25h1.75q0.625 0 1.063-0.469t0.438-1.094v-14.125h-17.313zM20.125 2.75l1.563-2.313q0.25-0.25-0.063-0.375-0.125-0.188-0.375 0.063l-1.625 2.438q-1.75-0.688-3.625-0.688t-3.625 0.688l-1.625-2.438q-0.25-0.25-0.375-0.063-0.313 0.125-0.063 0.375l1.563 2.313q-4.188 2-4.563 6.063h17.375q-0.375-4.063-4.563-6.063zM12.375 6.438q-0.438 0-0.719-0.281t-0.281-0.656q0-1 1-1 0.375 0 0.656 0.281t0.281 0.719q0 0.375-0.281 0.656t-0.656 0.281zM19.75 6.438q-0.375 0-0.656-0.281t-0.281-0.656q0-0.438 0.281-0.719t0.656-0.281q1 0 1 1 0 0.375-0.281 0.656t-0.719 0.281z"></path>
</svg>
