<!-- Generated by IcoMoon.io -->
<svg version="1.1" xmlns="http://www.w3.org/2000/svg" width="32" height="32" viewBox="0 0 32 32">
<title>tag</title>
<path d="M21.37 12.891c1.296 0 2.348-1.055 2.348-2.357s-1.051-2.357-2.348-2.357c-1.296 0-2.348 1.055-2.348 2.357s1.051 2.357 2.348 2.357zM12.849 32c-1.483 0-2.965-0.62-4.077-1.736l-7.042-7.070c-1.112-1.116-1.73-2.481-1.73-4.093 0-1.488 0.618-2.977 1.73-4.093l14.703-14.636c0.247-0.248 0.494-0.372 0.865-0.372h13.467c0.741 0 1.236 0.496 1.236 1.24v13.519c0 0.372-0.124 0.62-0.371 0.868l-14.826 14.76c-0.988 1.116-2.471 1.612-3.954 1.612zM3.459 16.868c-0.618 0.62-0.988 1.488-0.988 2.357s0.371 1.736 0.988 2.356l7.042 7.070c0.618 0.62 1.483 0.868 2.348 0.868s1.73-0.372 2.224-0.868l14.332-14.388v-11.783h-11.614l-14.332 14.388z"></path>
</svg>
