<svg width="48" height="48" viewBox="0 0 48 48" fill="none" xmlns="http://www.w3.org/2000/svg">
<circle cx="24" cy="24" r="24" fill="#DEDEDE"/>
<path fill-rule="evenodd" clip-rule="evenodd" d="M25 15C25 14.4477 24.5523 14 24 14C23.4477 14 23 14.4477 23 15V23L15 23C14.4477 23 14 23.4477 14 24C14 24.5523 14.4477 25 15 25L23 25V33C23 33.5523 23.4477 34 24 34C24.5523 34 25 33.5523 25 33V25L33 25C33.5523 25 34 24.5523 34 24C34 23.4477 33.5523 23 33 23L25 23V15Z" fill="#32414A"/>
</svg>
