<!-- Generated by IcoMoon.io -->
<svg version="1.1" xmlns="http://www.w3.org/2000/svg" width="32" height="32" viewBox="0 0 32 32">
<title>mark-done-c</title>
<path d="M27.319 27.315c-3.024 3.021-7.044 4.685-11.319 4.685s-8.294-1.664-11.319-4.685c-6.24-6.239-6.24-16.391 0-22.63 3.025-3.022 7.045-4.685 11.319-4.685s8.295 1.663 11.321 4.685c6.24 6.239 6.24 16.391-0.001 22.63zM25.563 6.441c-2.555-2.552-5.952-3.957-9.564-3.957-3.611 0-7.007 1.405-9.562 3.957-5.271 5.271-5.271 13.848 0 19.118 2.555 2.553 5.95 3.959 9.562 3.959 3.613 0 7.008-1.406 9.564-3.959 5.271-5.27 5.271-13.847 0-19.118zM14.762 21.093c-0.234 0.234-0.546 0.363-0.879 0.363s-0.643-0.129-0.877-0.362l-4.22-4.218c-0.484-0.484-0.484-1.272 0-1.755 0.236-0.235 0.546-0.364 0.879-0.364s0.644 0.129 0.879 0.364l3.34 3.338 7.56-7.555c0.234-0.235 0.546-0.364 0.878-0.364 0.331 0 0.643 0.129 0.878 0.364 0.484 0.483 0.484 1.272-0.001 1.755l-8.437 8.434z"></path>
</svg>
