<!-- Generated by IcoMoon.io -->
<svg version="1.1" xmlns="http://www.w3.org/2000/svg" width="32" height="32" viewBox="0 0 32 32">
<title>search</title>
<path d="M30.72 32q-0.512 0-0.896-0.384l-7.040-7.040-0.64 0.512q-3.808 2.816-8.32 2.816-3.712-0.064-6.944-1.984-3.136-1.888-4.96-5.024-1.92-3.232-1.92-6.976t1.92-7.008q1.856-3.136 4.992-4.992 3.264-1.92 7.040-1.92t7.040 1.92q3.136 1.856 4.992 4.992 1.92 3.264 1.92 7.040 0 4.512-2.816 8.32l-0.512 0.64 7.040 7.040q0.384 0.384 0.384 0.896t-0.384 0.896q-0.512 0.256-0.896 0.256zM13.952 2.816q-3.008 0-5.632 1.536-2.496 1.472-3.968 3.968-1.536 2.624-1.536 5.632t1.536 5.632q1.472 2.496 3.968 3.968 2.624 1.536 5.632 1.536t5.632-1.536q2.496-1.472 3.968-3.968 1.536-2.624 1.536-5.632t-1.536-5.632q-1.504-2.496-4.032-3.968-2.592-1.536-5.568-1.536z"></path>
</svg>
