<?xml version="1.0" encoding="utf-8"?>
<!-- Generator: Adobe Illustrator 22.0.1, SVG Export Plug-In . SVG Version: 6.00 Build 0)  -->
<svg version="1.1" id="Слой_1" xmlns="http://www.w3.org/2000/svg" xmlns:xlink="http://www.w3.org/1999/xlink" x="0px" y="0px"
	 viewBox="0 0 57.1 44.6" style="enable-background:new 0 0 57.1 44.6;" xml:space="preserve">
<style type="text/css">
	.st0{fill:#ff1654;}
</style>
<path class="st0" d="M56.7,24L29.1,0.3c-0.2-0.2-0.4-0.2-0.5-0.3c-0.3-0.1-0.5,0-0.6,0.1c-0.3,0.2-0.5,0.5-0.5,0.9v8.1L9.8,11.7
	l-8.2-7C1.4,4.5,1.2,4.5,1.1,4.4c-0.3-0.1-0.5,0-0.6,0.1C0.2,4.7,0,5,0,5.4v11.1c0,0.5,0.3,0.8,0.6,0.9l8.9,4.9c0,0,0,0,0.1,0
	c0.1,0.1,0.2,0.1,0.4,0.1l8.1-1.2l2.1,1.7l-9.9,1.4h-0.1c-0.1,0-0.3,0.1-0.4,0.1l-0.2,0.2c-0.1,0.1-0.2,0.3-0.2,0.6v2.7
	c0,0.5,0.3,0.8,0.6,0.9l8.9,4.9l0,0c0.1,0.1,0.2,0.1,0.4,0.1l8.3-1.2v1.3l-8,1.2h-0.2c-0.1,0-0.3,0.1-0.4,0.1l-0.2,0.2
	c-0.1,0.1-0.2,0.3-0.2,0.6v2.7c0,0.5,0.3,0.8,0.6,0.9l8.9,4.9l0,0c0.1,0.1,0.2,0.1,0.4,0.1c0,0,0.1,0,0.2,0l27.5-4.1
	c0.5,0,0.9-0.4,0.9-1V24.6C57.1,24.5,56.9,24.2,56.7,24z M55,38.5v0.6l-25.5,3.8v-0.6L55,38.5z M27.5,41.9v0.3l-7-3.9v-0.2
	L27.5,41.9z M27.5,30.4V31l-7.3,1.1v-0.6L27.5,30.4z M18.2,31.2v0.4l-7-3.8v-0.4L18.2,31.2z M29.5,40.2V36l17.4-2.6l6,3.3L29.5,40.2
	z M36.5,16.1v0.6l-17.9,2.6L18,18.8L36.5,16.1z M37.5,18.6c0.5,0,0.9-0.4,0.9-1v-2.8c0-0.4-0.3-0.6-0.6-0.6l-8.3-4.6V3.5l25.6,21.9
	v10.4l-7.5-4.1c-0.2-0.2-0.5-0.2-0.7-0.2l-17.4,2.6v-1.6L46.8,30c0.5,0,0.9-0.4,0.9-1v-2.8c0-0.4-0.3-0.6-0.6-0.6l-8.8-4.8
	c-0.2-0.2-0.5-0.2-0.7-0.2l-15,2.2l-2.1-1.7L37.5,18.6z M45.8,27.7v0.6l-16.2,2.4v-0.6L45.8,27.7z M37.6,22.7l6,3.3l-14.8,2.2
	l-4.2-3.5L37.6,22.7z M22,25l4.2,3.5l-6.8,1l-6-3.3L22,25z M27.5,36.3v3.4L22.6,37L27.5,36.3z M15.9,17.1l-4.2-3.6l16.6-2.4l6,3.3
	L15.9,17.1z M10.9,19.8l4.4-0.6l0.6,0.5l-5,0.7V19.8z M9,19.5v0.3L2,16v-0.3L9,19.5z M9.2,13.9l4.2,3.6l-3.2,0.4l-6-3.3L9.2,13.9z
	 M1.9,12.9V7.7l5.2,4.5L1.9,12.9z"/>
</svg>
