<?xml version="1.0" encoding="utf-8"?>
<!-- Generator: Adobe Illustrator 22.0.1, SVG Export Plug-In . SVG Version: 6.00 Build 0)  -->
<svg version="1.1" id="Layer_1" xmlns="http://www.w3.org/2000/svg" xmlns:xlink="http://www.w3.org/1999/xlink" x="0px" y="0px"
	 viewBox="0 0 112.4 88.3" style="enable-background:new 0 0 112.4 88.3;" xml:space="preserve">
<style type="text/css">
	.st0{fill:#FFFFFF;}
</style>
<path id="Прямоугольник_3_копия_2" class="st0" d="M112.1,50.8l0.1-12.5L0.1,37.6L0,50.1L112.1,50.8z M112.4,0.7
	L0.3,0L0.2,12.5l112.1,0.7L112.4,0.7z M56.1,88l55.8,0.3l0.1-12.5l-55.8-0.3L56.1,88z"/>
</svg>
