<?xml version="1.0" encoding="UTF-8"?>
<!DOCTYPE svg PUBLIC "-//W3C//DTD SVG 1.1//EN" "http://www.w3.org/Graphics/SVG/1.1/DTD/svg11.dtd">
<!-- Creator: CorelDRAW X8 -->
<svg xmlns="http://www.w3.org/2000/svg" xml:space="preserve" width="12.6998mm" height="12.6998mm" version="1.1" style="shape-rendering:geometricPrecision; text-rendering:geometricPrecision; image-rendering:optimizeQuality; fill-rule:evenodd; clip-rule:evenodd"
viewBox="0 0 1270 1270"
 xmlns:xlink="http://www.w3.org/1999/xlink">
 <defs>
  <style type="text/css">
   <![CDATA[
    .str0 {stroke:#FF4174;stroke-width:30}
    .fil0 {fill:none}
   ]]>
  </style>
 </defs>
 <g id="Слой_x0020_1">
  <metadata id="CorelCorpID_0Corel-Layer"/>
  <path class="fil0 str0" d="M353 708l45 139 0 402 616 -145 -7 -310 -26 -65 26 -1 -6 -309 -33 -79 3 -40 28 0 -2 -38 -39 -29c0,-18 0,-47 0,-65l-626 -131 4 72 60 58 3 56 -52 -7 2 45 56 95 -13 349 -39 3z"/>
  <polyline class="fil0 str0" points="353,708 394,756 1007,728 "/>
  <line class="fil0 str0" x1="398" y1="847" x2="1007" y2= "794" />
  <line class="fil0 str0" x1="405" y1="356" x2="1001" y2= "419" />
  <polyline class="fil0 str0" points="398,1187 336,1189 337,1219 398,1249 "/>
  <line class="fil0 str0" x1="349" y1="261" x2="968" y2= "340" />
  <line class="fil0 str0" x1="347" y1="216" x2="971" y2= "300" />
  <line class="fil0 str0" x1="392" y1="705" x2="394" y2= "756" />
  <line class="fil0 str0" x1="347" y1="216" x2="336" y2= "109" />
  <polygon class="fil0 str0" points="392,84 537,114 544,134 399,102 "/>
  <polygon class="fil0 str0" points="599,125 605,145 740,173 732,152 "/>
  <polygon class="fil0 str0" points="787,163 795,185 910,213 897,192 "/>
 </g>
</svg>
