<!-- Generated by IcoMoon.io -->
<svg version="1.1" xmlns="http://www.w3.org/2000/svg" width="26" height="32" viewBox="0 0 26 32">
<title>bag</title>
<path d="M22.368 9.664h-18.304q-0.512 0-0.88 0.368t-0.368 0.88l-2.816 19.84q0 0.512 0.368 0.88t0.88 0.368h23.936q0.512 0 0.88-0.368t0.368-0.88l-2.816-19.84q0-0.512-0.368-0.88t-0.88-0.368zM23.936 29.536h-21.44l2.56-17.568h16.32zM13.216 0q-1.088-0.032-2.112 0.368t-1.808 1.184-1.184 1.808-0.368 2.112v8.544q0.064 0.448 0.416 0.752t0.816 0.304 0.816-0.304 0.416-0.752v0l0.032-8.576q-0.032-0.608 0.176-1.152t0.64-0.976 0.976-0.64 1.152-0.176h0.032q0.608-0.032 1.168 0.176t0.992 0.64 0.64 0.992 0.176 1.168v8.544h0.032q0.064 0.448 0.416 0.752t0.816 0.304 0.816-0.304 0.416-0.752v-8.544q0.032-1.088-0.368-2.112t-1.184-1.808-1.808-1.184-2.112-0.368z"></path>
</svg>
