<?xml version="1.0" encoding="utf-8"?>
<!-- Generator: Adobe Illustrator 22.0.1, SVG Export Plug-In . SVG Version: 6.00 Build 0)  -->
<svg version="1.1" id="Layer_1" xmlns="http://www.w3.org/2000/svg" xmlns:xlink="http://www.w3.org/1999/xlink" x="0px" y="0px"
	 viewBox="0 0 43.8 61.1" style="enable-background:new 0 0 43.8 61.1;" xml:space="preserve">
<style type="text/css">
	.st0{fill:#ff1654;}
</style>
<path id="Прямоугольник_539_копия" class="st0" d="M12.2,0l31.5,30.6L12.2,61.1L0,49.3l19.3-18.8L0,11.8L12.2,0z"
	/>
</svg>
