<?xml version="1.0" encoding="UTF-8"?>
<!DOCTYPE svg PUBLIC "-//W3C//DTD SVG 1.1//EN" "http://www.w3.org/Graphics/SVG/1.1/DTD/svg11.dtd">
<!-- Creator: CorelDRAW X8 -->
<svg xmlns="http://www.w3.org/2000/svg" xml:space="preserve" width="12.6998mm" height="12.6998mm" version="1.1" style="shape-rendering:geometricPrecision; text-rendering:geometricPrecision; image-rendering:optimizeQuality; fill-rule:evenodd; clip-rule:evenodd"
viewBox="0 0 1270 1270"
 xmlns:xlink="http://www.w3.org/1999/xlink">
 <defs>
  <style type="text/css">
   <![CDATA[
    .str0 {stroke:#FF4174;stroke-width:30}
    .fil0 {fill:none}
   ]]>
  </style>
 </defs>
 <g id="Слой_x0020_1">
  <metadata id="CorelCorpID_0Corel-Layer"/>
  <g id="_636998880">
   <polygon class="fil0 str0" points="449,1166 1202,971 1200,910 452,1106 "/>
   <path class="fil0 str0" d="M449 1166l-178 -145c-49,-35 -93,-246 -34,-317 24,-17 54,-18 80,7 70,47 100,288 23,306 -34,2 -90,-71 -99,-159 -2,-81 15,-115 52,-93 48,37 52,103 41,163 -11,29 -55,4 -56,-48 4,-41 22,-37 27,-20"/>
   <polyline class="fil0 str0" points="341,1018 1058,839 1200,910 "/>
   <path class="fil0 str0" d="M1058 839c106,-80 90,-215 -21,-282l-771 135"/>
   <line class="fil0 str0" x1="340" y1="1017" x2="452" y2= "1106" />
   <polyline class="fil0 str0" points="847,107 757,52 284,111 273,691 "/>
   <line class="fil0 str0" x1="457" y1="282" x2="393" y2= "230" />
   <polyline class="fil0 str0" points="284,111 345,176 337,680 279,692 "/>
   <polyline class="fil0 str0" points="345,176 847,107 848,198 "/>
   <polyline class="fil0 str0" points="807,169 903,210 903,581 903,581 "/>
   <polyline class="fil0 str0" points="823,176 393,230 393,670 456,659 457,282 903,210 "/>
  </g>
 </g>
</svg>
