<?xml version="1.0" encoding="utf-8"?>
<!-- Generator: Adobe Illustrator 22.0.1, SVG Export Plug-In . SVG Version: 6.00 Build 0)  -->
<svg version="1.1" id="Layer_1" xmlns="http://www.w3.org/2000/svg" xmlns:xlink="http://www.w3.org/1999/xlink" x="0px" y="0px"
	 viewBox="0 0 223.5 228.4" style="enable-background:new 0 0 223.5 228.4;" xml:space="preserve">
<style type="text/css">
	.st0{fill:#ff1654;}
</style>
<g transform="translate(0,-952.36218)">
	<path class="st0" d="M134.1,952.4c15.9,38.7,54.4,6.5,74.5,29.8C203.8,941.9,172.8,974.2,134.1,952.4z M181.3,987.1
		c-4.2,0-7.4,4.2-7.4,7.4v56.1l-19.9,10.7V1039c0-2.5-1.2-5-3.5-6.5c-2.2-1.5-5-1.5-7.2-0.2l-58.8,29.5v-22.6c0-2.5-1.2-5-3.5-6.5
		c-2.2-1.5-5-1.5-7.2-0.2l-69.5,34.8c-2.5,1.2-4.2,4-4.2,6.7v99.3c0,4,3.5,7.4,7.4,7.4H216c4,0,7.4-3.5,7.4-7.4V994.6
		c0-4-3.5-7.4-7.4-7.4L181.3,987.1L181.3,987.1z M188.7,1002h19.9v163.9H14.9v-87.4l54.6-27.3v22.8c0,2.5,1.5,5,3.5,6.2
		c2.2,1.2,5,1.5,7.2,0.2l58.8-29.3v22.8c0,2.5,1.5,5,3.7,6.5c2.2,1.2,5,1.2,7.2,0.2l34.8-18.6c2.2-1.2,4-4,4-6.5V1002L188.7,1002z
		 M34.8,1098.9c-4,0-7.4,3.5-7.4,7.4v29.8c0,4,3.5,7.4,7.4,7.4h34.8c4,0,7.4-3.5,7.4-7.4v-29.8c0-4-3.5-7.4-7.4-7.4H34.8z
		 M94.4,1098.9c-4,0-7.4,3.5-7.4,7.4v29.8c0,4,3.5,7.4,7.4,7.4h34.8c4,0,7.4-3.5,7.4-7.4v-29.8c0-4-3.5-7.4-7.4-7.4H94.4z
		 M153.9,1098.9c-4,0-7.4,3.5-7.4,7.4v29.8c0,4,3.5,7.4,7.4,7.4h34.8c4,0,7.4-3.5,7.4-7.4v-29.8c0-4-3.5-7.4-7.4-7.4H153.9z
		 M42.2,1113.8h19.9v14.9H42.2V1113.8z M101.8,1113.8h19.9v14.9h-19.9V1113.8z M161.4,1113.8h19.9v14.9h-19.9V1113.8z"/>
</g>
</svg>
