<?xml version="1.0" encoding="utf-8"?>
<!-- Generator: Adobe Illustrator 22.0.1, SVG Export Plug-In . SVG Version: 6.00 Build 0)  -->
<svg version="1.1" id="Layer_1" xmlns="http://www.w3.org/2000/svg" xmlns:xlink="http://www.w3.org/1999/xlink" x="0px" y="0px"
	 viewBox="0 0 185.9 185.9" style="enable-background:new 0 0 185.9 185.9;" xml:space="preserve">
<style type="text/css">
	.st0{fill:#247BA0;}
</style>
<path class="st0" d="M104.6,185.9h81.3v-81.3h-81.3V185.9z M161.5,127.8v8.7h-32.6v-8.7H161.5z M128.9,154.1h32.6v8.7h-32.6V154.1z"
	/>
<path class="st0" d="M104.6,81.3h81.3V0h-81.3V81.3z M128.3,29.8l6.1-6.1l10.9,10.9l10.9-10.9l6.1,6.1l-10.9,10.9l10.9,10.9
	l-6.1,6.1l-10.9-10.9l-10.9,10.9l-6.1-6.1l10.9-10.9L128.3,29.8z"/>
<path class="st0" d="M81.3,104.6H0v81.3h81.3V104.6z M56.8,149.6H24.6v-8.7h32.2L56.8,149.6L56.8,149.6z"/>
<path class="st0" d="M81.3,0H0v81.3h81.3V0z M57,45H45v12h-8.7V45h-12v-8.7h12v-12H45v12h12V45z"/>
</svg>
