<!-- Generated by IcoMoon.io -->
<svg version="1.1" xmlns="http://www.w3.org/2000/svg" width="17" height="32" viewBox="0 0 17 32">
<title>up-small-1</title>
<path d="M8.313 5.648l7.84 7.84q0.48 0.48 0.48 1.184t-0.48 1.184-1.152 0.48-1.152-0.48l-3.84-3.84v12.64q0 0.672-0.512 1.184t-1.184 0.48-1.152-0.48-0.48-1.184v-12.64l-3.84 3.84q-0.48 0.48-1.184 0.48t-1.184-0.48-0.48-1.184 0.48-1.184z"></path>
</svg>
