<!-- Generated by IcoMoon.io -->
<svg version="1.1" xmlns="http://www.w3.org/2000/svg" width="32" height="32" viewBox="0 0 32 32">
<title>purse</title>
<path d="M30.592 13.824v-3.456q0-0.992-0.496-1.888t-1.344-1.488-1.872-0.72q-0.128-1.024-0.72-1.872t-1.52-1.344-1.984-0.496h-18.432q-1.12 0-2.096 0.576t-1.552 1.552-0.576 2.096v18.432q0 1.12 0.576 2.096t1.552 1.552 2.096 0.576v-0.128h22.144q1.12 0 2.096-0.576t1.552-1.552 0.576-2.096v-3.456q0.704-0.384 1.12-1.040t0.416-1.392v-2.944q0-0.736-0.416-1.392t-1.12-1.040zM28.032 25.088q0 0.672-0.496 1.168t-1.168 0.496h-22.144q-0.672 0-1.168-0.496t-0.496-1.168v-18.432q0-0.672 0.496-1.168t1.168-0.496h18.432q0.576 0 1.024 0.352t0.64 0.928h-19.456q-0.576 0-0.928 0.352t-0.352 0.912 0.384 0.928 0.896 0.368h21.504q0.672 0 1.168 0.496t0.496 1.168v2.944h-2.432q-1.12 0-2.096 0.576t-1.552 1.552-0.576 2.096 0.576 2.096 1.552 1.552 2.096 0.576h2.432v3.2zM29.568 19.2q0 0.096-0.080 0.176t-0.176 0.080h-3.712q-0.672 0-1.168-0.496t-0.496-1.168 0.496-1.168 1.168-0.496v-0.128h3.712q0.096 0 0.176 0.080t0.080 0.176v2.944zM25.728 16.512q-0.576 0-0.928 0.352t-0.352 0.928 0.352 0.928 0.928 0.352 0.928-0.352 0.352-0.928-0.352-0.928-0.928-0.352z"></path>
</svg>
