{
  "cards": [
    {
      "id": 1,
      "title": "sunt aut facere repellat provident occaecati excepturi optio reprehenderit",
      "category": "IT",
      "image": "https://2krota.ru/wp-content/uploads/2018/12/1600x1200_362600_www.ArtFile.ru_.jpg"
    },
    {
      "id": 2,
      "title": "qui est esse",
      "category": "IT",
      "image": "https://bipbap.ru/wp-content/uploads/2017/09/5114e7b13c84a77355cbec162ca7ff45.jpg"
    },
    {
      "id": 3,
      "title": "ea molestias quasi exercitationem repellat qui ipsa sit aut",
      "category": "IT",
      "image": "https://sun9-39.userapi.com/c849120/v849120369/35ea3/dHPpfJBYYQs.jpg?ava=1"
    }
  ],
  "articles": [
    {
      "id": 1,
      "title": "sunt aut facere repellat provident occaecati excepturi optio reprehenderit",
      "preview": "Образование и карьера в IT",
      "description": "quia et suscipit\nsuscipit recusandae consequuntur expedita et cum\nreprehenderit molestiae ut ut quas totam\nnostrum rerum est autem sunt rem eveniet architecto",
      "sections": [
        {
          "title": "test",
          "paragraphs": [
            "this is paragraph",
            "another"
          ]
        }
      ]
    },
    {
      "id": 2,
      "title": "Тест заголовка",
      "preview": "Небольшое описание-введение",
      "description": "Nunc tristique, tortor eu elementum tempus, mi neque varius sem, sit amet faucibus mauris purus ac neque. Aenean blandit elit quis pharetra pulvinar. Vivamus dapibus, leo quis consectetur maximus, metus lorem iaculis risus, ut feugiat magna neque sed lorem. Ut volutpat eros libero, id tempus mi aliquam non. Quisque molestie a lacus sit amet feugiat. Orci varius natoque penatibus et magnis dis parturient montes, nascetur ridiculus mus. Nulla sed venenatis diam. Vestibulum ante ipsum primis in faucibus orci luctus et ultrices posuere cubilia Curae; Sed convallis semper ipsum, id eleifend magna semper sit amet.",
      "sections": [
        {
          "title": "test",
          "paragraphs": [
            "this is paragraph",
            "another"
          ]
        }
      ]
    },
    {
      "id": 3,
      "title": "Тест заголовка",
      "preview": "Небольшое описание-введение",
      "description": "Cras rutrum quis nisi vitae semper. Pellentesque tristique interdum nisl id bibendum. Sed nec sapien sed lorem eleifend faucibus. Praesent sit amet nibh vitae est rutrum tempor et eget massa. Cras ut lorem orci. Sed at nulla eu justo laoreet eleifend a non ex. Nullam ultricies, nulla at lobortis varius, sem tortor sagittis tortor, eget egestas risus mi id tortor. Phasellus id eros lacus. Sed viverra urna orci, eu feugiat libero euismod et. Proin bibendum ultrices consequat. Sed vitae venenatis ex. Maecenas nisl purus, fringilla a ipsum vitae, convallis vehicula tellus. Praesent quis dignissim ligula. Aliquam quis libero pharetra, congue justo at, elementum nisl. Aliquam in aliquet diam. Vestibulum elementum ex mollis sem tempus convallis.",
      "sections": [
        {
          "title": "test",
          "paragraphs": [
            "this is paragraph",
            "another"
          ]
        }
      ]
    }
  ]
}