27
Total DFT energy = -108013.601095077
O   4.25248986   -0.00002088   3.77676679 
Si   -0.65265261   1.40235593   -0.55378289 
O   -2.18953546   1.34161746   -0.02196553 
O   -0.25039126   -2.67311898   -1.49295186 
Si   1.19373796   3.43933406   -1.59573778 
O   1.49494129   4.64381145   -2.45428049 
O   2.85872672   1.32951570   1.74106807 
Si   1.98839953   -1.39843991   0.36425835 
O   1.49490233   -4.64393393   -2.45420550 
O   -0.42317303   -0.00004794   -1.36858790 
Si   -0.65266326   -1.40243389   -0.55375571 
O   -0.25036456   2.67301864   -1.49300289 
O   2.26079441   2.67047154   -0.61834571 
Si   3.40290645   -0.00002771   2.52924929 
O   -3.91214142   -0.00000657   1.66656752 
O   2.85871817   -1.32958009   1.74108943 
Si   -3.09137844   -0.00002247   0.21888237 
O   0.38899178   -1.45544956   0.70912437 
O   2.31665860   -0.00004821   -0.42228428 
Si   1.19370759   -3.43944265   -1.59567916 
O   -2.18954387   -1.34167266   -0.02193577 
O   0.38900111   1.45538641   0.70909807 
Si   1.98840920   1.39835869   0.36423549 
O   2.26077238   -2.67057122   -0.61830279 
Si   -5.35738499   -0.00001474   0.84219738 
O   -6.81225828   -0.00000962   1.24286466 
O   -4.53767020   -0.00002885   -0.60558355 
