4
Total DFT energy = -15007.052391437
O   -0.00000000   1.42743720   -0.00000000 
O   -0.00000000   -1.42743720   0.00000000 
Mg   0.00000000   0.00000000   -1.21301467 
Mg   0.00000000   0.00000000   1.21301467 
