28
Total DFT energy = -108065.075430682
Mg   -0.89593426   -1.82364173   0.66211841 
O   0.09242345   4.91790586   3.59432882 
O   -2.51942847   2.28512935   1.74155445 
O   -4.54515197   -1.01989968   1.87561138 
Si   1.16833140   -0.70692387   1.79466517 
Si   0.33255615   3.34587296   3.39074342 
O   0.49520954   -2.15867689   2.15083087 
Mg   2.05132036   1.50967492   2.69665920 
O   0.60161384   2.73678900   1.91127659 
Mg   -0.74987298   -1.49932209   3.62007226 
O   1.37102557   2.49486505   4.33851442 
Mg   -2.95712024   -0.36651102   4.65533166 
O   -2.72342216   -2.01413748   3.60129912 
Mg   -1.72436740   5.12443751   3.89801955 
O   -2.04316879   -0.42024279   1.72902017 
O   -2.50856186   -2.82377437   0.97611541 
Si   -2.72223597   2.62937541   3.32677776 
O   0.33876696   -0.24630396   0.44578309 
Si   -3.12489107   -1.76878299   2.01156639 
Mg   -0.04052201   1.06492893   4.76809382 
O   -3.55912412   1.33670348   3.86891664 
O   -1.14427401   -0.37906378   5.22139013 
O   -3.25387052   4.10786976   3.67592254 
O   -1.14386978   2.63059373   3.98677235 
Mg   -0.76726118   1.18306956   1.46875979 
O   0.40269340   0.23747928   3.01076229 
O   2.66287483   -0.15331165   1.92086233 
Mg   -3.73192874   0.70226649   1.87463296 
