72
Total DFT energy = -270263.029792512
Mg   2.03272178   5.70472258   -2.09436683 
Mg   -1.80250217   6.45500930   0.92976084 
O   1.89122320   3.98990021   2.10992712 
O   2.36349041   6.91747309   -0.58330532 
O   -2.02216965   -2.15854161   -2.45174736 
O   -1.47259144   7.86695201   -0.38190923 
Mg   -0.05772061   -2.62436075   -2.63838214 
Mg   -0.85367733   1.61291981   2.02113094 
O   -3.78606515   -0.08908246   -3.75366211 
Mg   -2.57941883   3.68551303   0.76005000 
Mg   0.36486260   0.61713957   -7.97439671 
O   -2.86668477   2.12168864   2.14173770 
Mg   1.50438002   2.67476089   0.54568740 
O   -2.15332575   4.99113871   2.32237135 
O   1.83348816   4.14154535   -0.77289006 
O   -2.31655029   5.16872764   -0.55493949 
Mg   -2.69495399   4.15458113   -4.90690446 
O   -0.44043717   2.94999191   3.58693002 
Mg   -1.09893664   2.43956897   -6.54765974 
Mg   2.12598333   5.48271158   0.72343107 
Mg   -2.67702058   3.93996770   -2.08793677 
O   -0.53998852   3.16217010   0.69077241 
Mg   0.45744602   7.44103238   -0.48415659 
O   -3.10767893   2.67504570   -3.58606592 
Mg   -0.23344297   4.68958402   -0.67146217 
O   -3.02251794   2.41141479   -0.72101712 
Mg   -1.63820623   -0.92284367   -0.96449405 
O   0.20076560   -0.93866783   -6.84889294 
Mg   -1.82567266   -0.45699078   -6.73160445 
O   -2.12067180   -1.91805501   -5.46378458 
Mg   -1.02041556   2.14962711   -3.68635003 
O   0.39639375   -1.41163361   -1.07636975 
Mg   -3.21757869   0.87811501   0.58818315 
O   0.91408266   1.93077647   -6.66827200 
Mg   -0.12692538   4.50951986   2.20507028 
O   0.36388006   -1.11625001   -3.97159470 
Mg   -0.93217040   1.90284592   -0.84018660 
O   -0.62912459   3.41276153   -2.18755520 
Mg   0.74234419   -0.10213963   0.38039121 
Mg   -3.98533420   -1.65224223   -2.43217338 
O   1.16573752   1.12343883   1.92995848 
O   -3.66604846   -0.40606673   -0.86300906 
Mg   1.42271795   2.50931270   3.25166690 
O   -3.84385304   0.06258996   -6.63645300 
Mg   -2.41004584   -3.38855898   -4.04233196 
O   -0.47997989   -3.81447375   -4.14465425 
Mg   0.62682300   0.36695802   -5.28659490 
O   -4.31610276   -2.86501215   -3.94322467 
O   -1.51218556   1.10245987   -8.11346415 
Mg   -3.45703696   1.37772610   -5.07224377 
O   0.16803058   5.97054620   0.93722870 
Mg   -0.15022170   -2.40250654   -5.45631866 
O   -1.41262369   0.89035611   -5.21729350 
Mg   -3.37981953   1.12832451   -2.22308665 
O   1.06986889   1.64106719   -3.80551103 
O   1.15499783   1.37740579   -0.94039309 
Mg   -2.31746837   3.43533595   3.44786459 
Mg   -4.07861838   -1.43024410   -5.24996510 
O   0.06956941   6.21104087   -2.07478876 
Mg   -3.37535600   1.54316505   -7.77821200 
O   -1.32346263   0.63978036   -2.33901214 
Mg   1.42731933   2.92408921   -2.30343639 
O   -3.11836208   2.92903021   -6.45647156 
Mg   -1.71916993   -0.63710184   -3.85511218 
O   1.71347869   4.45853291   -3.66354969 
Mg   -0.31437770   4.97532320   -3.56204100 
O   -0.70264472   3.73280966   -5.09729128 
Mg   1.26495648   3.17437465   -5.11473059 
O   -2.34899197   5.46409234   -3.45018550 
Mg   -1.89486524   6.67686249   -1.88819243 
O   -1.24996225   0.31967293   0.57074271 
Mg   0.72438719   0.11254282   -2.43860337 
