36
Total DFT energy = -144022.381720639
O   1.40428235   0.57447851   2.77730070 
Si   -0.00004114   0.00063165   2.13544183 
Si   2.49536304   0.82517706   1.57674034 
O   0.58105635   -1.27942462   1.34560084 
Si   -2.49540514   -0.82424642   1.57707034 
O   3.60591806   -0.26105822   1.32634129 
O   1.65599062   0.86639292   -0.00023035 
O   2.66378701   2.48586544   1.39239083 
Si   1.79744724   2.61311209   -0.00074178 
O   -1.40441331   -0.57282028   2.77755762 
O   -0.58110272   1.28020021   1.34478366 
Si   -0.93533566   2.10782578   -0.00068720 
O   0.31426879   3.25856737   -0.00098510 
Si   2.49546878   0.82424683   -1.57712643 
Si   0.93538635   -2.10782774   0.00063086 
O   -1.65593549   -0.86639485   0.00017540 
Si   3.90013331   -1.36232514   0.00050348 
O   2.66387467   2.48504129   -1.39374648 
O   -3.60594616   0.26183821   1.32593941 
Si   -1.79739367   -2.61311330   0.00068346 
O   -2.66381354   -2.48504338   1.39369193 
Si   0.00009775   -0.00063452   -2.13549807 
Si   -2.49530365   -0.82517194   -1.57679886 
O   5.25041777   -2.05472652   0.00075939 
O   3.60600813   -0.26183893   -1.32599839 
Si   -3.90007432   1.36232769   -0.00055229 
O   -2.50627925   2.36790107   -0.00080899 
O   -0.58101675   1.27941289   -1.34565259 
O   2.50633238   -2.36788422   0.00075960 
O   0.58114274   -1.28021186   -1.34484385 
O   1.40446890   0.57282232   -2.77760617 
O   -0.31421392   -3.25857213   0.00092536 
O   -2.66372948   -2.48586255   -1.39245051 
O   -3.60585300   0.26106942   -1.32640020 
O   -5.25036191   2.05472324   -0.00080387 
O   -1.40422514   -0.57447737   -2.77736520 
