56
XYZ
O            -3.030502685    -3.048184822    -0.903961413
Mg           -3.689923755    -2.952248608     0.871020651
O            -3.961950460    -1.004043955     0.907674025
Mg           -3.099876018    -1.110132280    -0.980958774
Mg           -3.936890699     0.964874839     0.744363021
O            -3.947892886     2.955508619     0.615917356
Mg           -3.153816833     2.760628505    -1.097387540
O            -3.160493339     0.843275666    -1.180549966
O             0.537105560    -3.121132020    -1.883892680
Mg            2.250139480    -2.967186490    -2.728816930
Mg            1.487539950    -3.071987980    -0.090061090
O             2.561985010    -2.984161110     1.699517750
O             3.355428170    -3.051548560    -1.130779900
Mg            4.148369160    -2.813672170     0.616826080
O            -0.344430340     1.190411462     3.853887973
O            -1.482334351     3.220147343     2.060795532
Mg           -0.229541973     3.116284532     3.611879266
Mg           -3.071924635     3.046629012     1.993199149
O            -3.038965783     1.047103093     2.142057089
Mg           -1.434254074     1.085505453     2.214518048
O             2.530723750     1.123518470     1.593568870
O             1.375472190     3.149541060    -0.323261570
Mg            2.465647650     3.154888800     1.396015850
Mg            0.482720170     2.935346380    -2.091615810
O             0.409400220     0.921847410    -2.059065710
Mg            1.463686190     1.038527930    -0.244924710
O             4.136832500     3.110895070     0.381931990
Mg            3.189087040     3.045776930    -1.344571630
O             2.178158650     2.918604710    -3.043535770
Mg            2.221990970     0.956920960    -3.007864520
O             3.297577290     0.999746820    -1.292256530
Mg            4.232072580     1.151368940     0.493067270
O             1.480777677     3.275938086     3.105696389
Mg           -0.522893537     3.112256154     0.567305475
O            -1.307778762     3.065400151    -1.230061577
Mg           -1.284446902     0.935894251    -1.056784367
O            -0.508999567     1.054787584     0.667130365
Mg            1.507406138     1.190851809     3.180719262
Mg            0.476006420    -1.073737490    -1.951891850
O             1.506985100    -0.998374180    -0.163333340
Mg            2.549766530    -0.887223050     1.641147630
Mg           -3.006181581    -0.989730810     2.240674569
O            -1.421838281    -0.912038859     2.338065778
Mg           -0.255121823    -0.877579170     3.855207275
Mg           -0.475047467    -1.015041926     0.749080575
O             1.550127541    -0.818360638     3.264561076
O            -1.258821632    -1.070107849    -0.949364847
Mg            3.315760690    -0.962002780    -1.205451140
O             4.345720980    -0.889027840     0.604507160
O             2.288255960    -1.057884010    -3.008900290
Mg            1.542101383    -2.861699048     3.202855015
O            -0.431753727    -3.109469416     0.784633585
O            -0.186610677    -2.846225036     3.858329368
Mg           -1.314914671    -2.978670230     2.365990542
Mg           -1.216700922    -3.150403529    -0.971976307
O            -2.959345017    -3.043819150     2.352885862
