6
Total DFT energy = -22514.051584297
O   -1.16216156   1.53552574   0.00505383 
Mg   -1.66347601   -0.23164745   0.00152071 
O   -0.72610147   -1.81158327   0.00413883 
Mg   1.05522740   -1.36258087   0.01177196 
O   1.95500818   0.23903733   0.01667106 
Mg   0.67488446   1.55648452   0.01267761 
