45
Total DFT energy = -180032.235169852
Si   -1.74804941   -2.03125330   0.63755192 
O   -0.03830358   2.89453228   -0.80395882 
Si   -1.40728294   2.01188724   -0.61241959 
O   2.42543498   -2.99247929   0.97631192 
Si   3.66457031   -2.02637336   0.56514465 
O   -3.10906801   -1.13254057   -2.26810122 
O   -2.86878031   2.64300422   -0.12081334 
O   -1.16802592   -1.17389751   -0.61675294 
O   0.81153293   -0.96639515   1.42211717 
O   2.99878038   -0.47242176   0.12694170 
O   -0.26467359   0.72877646   3.01893719 
Si   -1.58698001   -0.50702101   -2.04381386 
O   -1.91364289   -1.11598701   1.98064241 
O   0.97467546   0.59636367   -1.26245816 
Si   3.75640661   0.21874911   1.58101358 
O   4.47480296   1.49169327   0.99728475 
O   1.39290297   1.72421453   1.11054968 
Si   4.44665691   2.16888246   -0.61995535 
O   -1.03776752   1.06000684   0.65730318 
O   -0.26533594   -0.91516906   -2.95491103 
Si   3.77833693   -0.60339616   -1.46554004 
O   1.16203855   -2.12787604   -1.03623167 
O   2.79798389   2.48933359   -0.91159064 
Si   -1.59922753   0.48907292   2.06776028 
O   5.45565969   3.27460244   -0.87594417 
Si   1.09289439   -0.82107803   -2.01764844 
O   -0.49533913   -3.09974236   0.85895861 
O   2.63682967   -0.81232905   -2.61087829 
Si   0.93528045   -2.32912282   0.55914623 
O   -1.68462856   1.11637817   -1.95594432 
O   4.48923460   -1.28811693   1.77469323 
O   -3.03078414   1.31005986   2.23371731 
O   4.36955221   -2.08525514   -0.91617683 
Si   1.33592547   1.99844221   -0.49784791 
O   2.61518107   0.31937999   2.74731527 
O   -3.25206393   -2.46536827   0.08614868 
Si   1.09500663   0.48836846   2.10742065 
O   4.66097401   0.69749994   -1.53439877 
Si   -3.86906069   -1.20552941   -0.79851224 
Si   -3.69709204   1.49317753   0.72645225 
O   -3.34777949   0.10331717   -0.01720633 
O   -5.33240485   1.47351162   0.60800358 
Si   -6.29673309   0.32768054   -0.08766106 
O   -5.48577901   -0.94920278   -0.75635949 
O   -7.80432851   0.43146748   -0.11134274 
