54
Total DFT energy = -216041.631316682
Si   -4.94112769   -1.55545257   -0.00005647 
O   -2.27292335   -1.26332459   -0.00011659 
Si   -2.73980469   -1.44386584   -1.54342440 
O   -2.95821681   -0.00052584   2.26978331 
Si   2.73977455   1.44384469   1.54344029 
O   4.22118178   2.17776528   1.35581409 
Si   -2.73993911   1.44412642   -1.54294132 
O   -4.22141755   2.17784290   -1.35506932 
O   -4.22110035   -2.17824182   1.35541558 
O   -1.40892861   -2.13329659   2.21985587 
Si   2.73990892   -1.44414634   1.54295726 
Si   -4.94127060   1.55498768   0.00046552 
O   -4.22130272   2.17738357   1.35614996 
O   -1.40912279   2.13239686   2.22057817 
Si   -0.00015282   1.64490308   -1.49089794 
O   -4.22121289   -2.17778549   -1.35579792 
Si   -2.73967764   -1.44439004   1.54316880 
O   2.27301176   -1.26313948   -0.00029109 
Si   -2.73981158   1.44360297   1.54365521 
O   -2.27304248   1.26312126   0.00030715 
O   -4.52060747   -0.00021314   0.00017718 
O   -6.57477850   -1.39786864   0.00006452 
Si   -7.45779774   -0.00034895   0.00048662 
O   -6.57490741   1.39725185   0.00053412 
O   -8.96983749   -0.00041944   0.00079499 
O   2.95836859   -0.00026251   2.26955559 
Si   2.73978213   -1.44362288   -1.54363864 
Si   2.73964850   1.44436877   -1.54315242 
O   2.27289296   1.26330243   0.00013255 
O   2.95818853   0.00050519   -2.26976707 
O   4.22107060   2.17822135   -1.35539841 
O   4.22127241   -2.17740478   -1.35613259 
O   4.22138603   -2.17786415   1.35508550 
Si   -0.00000257   -1.64441738   -1.49145800 
O   -1.40910985   -2.13254565   -2.22045120 
O   1.40889760   2.13326877   -2.21984166 
O   1.40909165   -2.13241033   -2.22056383 
O   -1.40930131   2.13314996   -2.21973252 
O   -2.95839804   0.00024198   -2.26953957 
O   -0.00009532   0.00024317   -1.49444846 
O   0.00008906   -2.29757020   -0.00038257 
Si   4.94124076   -1.55500867   -0.00044846 
Si   4.94109807   1.55543189   0.00007364 
O   4.52057783   0.00019233   -0.00016089 
O   6.57474869   1.39784763   -0.00004272 
Si   7.45776797   0.00032780   -0.00044187 
O   6.57487735   -1.39727303   -0.00051244 
O   8.96980765   0.00039798   -0.00071281 
Si   -0.00002973   1.64439685   1.49147347 
Si   0.00012064   -1.64492368   1.49091335 
O   1.40907803   2.13251834   2.22046853 
O   1.40926951   -2.13316377   2.21974991 
O   -0.00011509   2.29754956   0.00039802 
O   0.00002863   -0.00026373   1.49446399 
