56
Total DFT energy = -210199.653574093
O   -2.75203484   -3.08690077   -2.42721278 
Mg   -4.14573129   -3.04638072   -1.14246784 
O   -4.44666665   -1.10278204   -1.19448179 
Mg   -2.82065416   -1.14827192   -2.48884456 
Mg   -4.39268954   0.87002719   -1.28961277 
O   -4.38711182   2.86321928   -1.36959005 
Mg   -2.89920399   2.72347666   -2.54029539 
O   -2.82627643   0.80915609   -2.65545094 
O   0.53710556   -3.12113202   -1.88389268 
Mg   2.25013948   -2.96718649   -2.72881693 
Mg   1.48753995   -3.07198798   -0.09006109 
O   2.56198501   -2.98416111   1.69951775 
O   3.35542817   -3.05154856   -1.13077990 
Mg   4.14836916   -2.81367217   0.61682608 
O   -0.97916099   1.14996101   3.64337180 
O   -2.06227345   3.17908893   1.75114174 
Mg   -0.94104011   3.06954639   3.33597401 
Mg   -3.18173747   2.97487085   0.15279299 
O   -3.16573153   0.97377746   0.28209081 
Mg   -2.03141976   1.04293332   1.88725046 
O   2.53072375   1.12351847   1.59356887 
O   1.37547219   3.14954106   -0.32326157 
Mg   2.46564765   3.15488880   1.39601585 
Mg   0.48272017   2.93534638   -2.09161581 
O   0.40940022   0.92184741   -2.05906571 
Mg   1.46368619   1.03852793   -0.24492471 
O   4.13683250   3.11089507   0.38193199 
Mg   3.18908704   3.04577693   -1.34457163 
O   2.17815865   2.91860471   -3.04353577 
Mg   2.22199097   0.95692096   -3.00786452 
O   3.29757729   0.99974682   -1.29225653 
Mg   4.23207258   1.15136894   0.49306727 
O   0.76421242   3.21633405   2.46920667 
Mg   -0.33084933   3.12542305   0.65755876 
O   -1.41595991   3.06256647   -1.26267160 
Mg   -1.39262805   0.93306057   -1.08939439 
O   -0.31695536   1.06795448   0.75738365 
Mg   0.79704844   1.13259209   2.57343492 
Mg   0.47600642   -1.07373749   -1.95189185 
O   1.50698510   -0.99837418   -0.16333334 
Mg   2.54976653   -0.88722305   1.64114763 
Mg   -3.13739502   -1.06393637   0.36216546 
O   -2.02925839   -0.95597556   1.98705071 
Mg   -0.91401211   -0.91889344   3.65601671 
Mg   -0.28300326   -1.00187503   0.83933386 
O   0.84875337   -0.87540842   2.67855284 
O   -1.36700278   -1.07294153   -0.98197487 
Mg   3.31576069   -0.96200278   -1.20545114 
O   4.34572098   -0.88902784   0.60450716 
O   2.28825596   -1.05788401   -3.00890029 
Mg   0.80068860   -2.91909424   2.66663809 
O   -0.23970952   -3.09630252   0.87488687 
O   -0.86673888   -2.88806787   3.67569853 
Mg   -1.91161665   -3.02200915   2.01609039 
Mg   -1.32488207   -3.15323721   -1.00458633 
O   -3.09853167   -3.11899091   0.45862491 
