60
Total DFT energy = -240047.854343091
Si   -5.19662188   -0.97444883   1.54780363 
O   -2.62879928   0.10645168   1.49452955 
Si   -2.56507584   -1.51683198   1.49123231 
O   -4.24997663   1.77519170   0.00037486 
Si   3.53596598   1.34595662   -1.44777635 
O   4.95901007   0.87750951   -2.17089907 
Si   -2.56508489   -1.51620699   -1.49186919 
O   -4.02201745   -1.94921132   -2.16894942 
O   -5.05621936   0.54200481   2.18688661 
O   -0.25199273   2.97815868   2.02751520 
Si   3.53597751   1.34536069   1.44831727 
Si   -5.19663447   -0.97380318   -1.54819207 
O   -5.05623508   0.54291705   -2.18664410 
O   -0.25200131   2.97900567   -2.02627125 
Si   0.23695147   -1.16148681   -1.63507756 
O   -4.02200366   -1.95011983   2.16814285 
Si   -3.75043750   1.28602918   1.47211641 
O   2.75255936   -0.06686611   1.27210380 
Si   -3.75044780   1.28664382   -1.47157443 
O   -2.62880779   0.10707772   -1.49448560 
O   -4.76092642   -0.79317443   -0.00015840 
O   -6.70123622   -1.59918154   1.38148745 
Si   -7.52503708   -1.95524301   -0.00038421 
O   -6.70124381   -1.59860549   -1.38211538 
O   -8.91358665   -2.55286222   -0.00053247 
O   3.88893133   2.02036169   0.00040805 
Si   2.94768886   -1.66686169   1.44527192 
Si   2.94767567   -1.66626582   -1.44596654 
O   2.75254860   -0.06634181   -1.27213480 
O   3.00288087   -2.42269681   -0.00050366 
O   4.43890616   -1.77341105   -2.17236301 
O   4.43892700   -1.77430437   2.17160886 
O   4.95903025   0.87661614   2.17123140 
Si   0.23696161   -1.16217006   1.63459665 
O   -1.13800254   -1.86160619   2.20571922 
O   1.53284487   -2.04598143   -2.17275590 
O   1.53285964   -2.04688167   2.17190664 
O   -1.13801146   -1.86068361   -2.20649750 
O   -2.48153754   -2.16105569   -0.00045310 
O   0.23144533   -1.19949346   -0.00024807 
O   0.29029072   0.39516271   2.13642108 
Si   5.40911768   -0.58739977   1.55141875 
Si   5.40910206   -0.58676232   -1.55169403 
O   4.97859624   -0.50813103   -0.00011926 
O   7.01047937   -0.90139637   -1.39219014 
Si   7.88152109   -1.08106746   -0.00025306 
O   7.01049307   -0.90196579   1.39176706 
O   9.36217911   -1.38594632   -0.00031708 
Si   0.86344422   1.83315440   -1.60918199 
Si   0.86345534   1.83248331   1.60994911 
O   2.36679469   2.20362067   -2.21656852 
O   2.36681028   2.20270367   2.21747524 
O   0.29027668   0.39605409   -2.13625111 
O   1.09372289   1.86705747   0.00038955 
Si   -1.65080556   2.99403376   -1.18808378 
O   -2.97163159   2.60746134   -2.09131982 
O   -2.97162190   2.60658704   2.09241447 
Si   -1.65079919   2.99353904   1.18933699 
O   -1.82482697   4.16832098   0.00087143 
O   -1.50455944   1.84846100   0.00038751 
