<svg width="57" height="87" viewBox="0 0 57 87" fill="none" xmlns="http://www.w3.org/2000/svg">
<path d="M56 57.9189C56 73.3257 43.677 85.802 28.5008 85.802C13.3045 85.802 1 73.3257 1 57.9189C1 57.4864 1.01679 57.0743 1.03527 56.6418C1.19314 52.8461 2.12277 49.1243 3.76587 45.71C4.83057 43.0332 6.08839 40.3173 7.36469 37.586C10.7872 30.2317 14.3172 22.7888 14.3172 15.3817C14.3167 13.4929 14.6833 11.6226 15.3959 9.87754C16.1086 8.13246 17.1533 6.54686 18.4705 5.21131C19.7876 3.87575 21.3514 2.81642 23.0725 2.09383C24.7935 1.37124 26.6381 0.999553 28.5008 1C36.3198 1 42.6845 7.43652 42.6845 15.3834C42.6845 22.7905 46.2128 30.2317 49.6353 37.586C50.9116 40.3173 52.1711 43.0332 53.2341 45.7117C54.67 49.3965 55.7531 53.0473 55.9647 56.6435C55.9815 57.0743 56 57.4864 56 57.9189Z" fill="#B1CC33"/>
<path d="M28.5009 72.1746C36.3371 72.1746 42.6896 65.7334 42.6896 57.7878C42.6896 49.8422 36.3371 43.401 28.5009 43.401C20.6646 43.401 14.3121 49.8422 14.3121 57.7878C14.3121 65.7334 20.6646 72.1746 28.5009 72.1746Z" fill="#A57939" stroke="#A57939" stroke-width="2" stroke-miterlimit="10" stroke-linecap="round" stroke-linejoin="round"/>
<path d="M42.6829 57.7793C42.6829 65.7313 36.3417 72.1763 28.5009 72.1763C28.5009 72.1763 44.7602 59.8703 28.5009 43.3993C32.262 43.3997 35.869 44.9149 38.5286 47.6116C41.1881 50.3083 42.6824 53.9656 42.6829 57.7793V57.7793Z" fill="#6A462F"/>
<path d="M56 57.9189C56 73.3257 43.677 85.802 28.5008 85.802C13.3045 85.802 1 73.3257 1 57.9189C1 57.4864 1.01679 57.0743 1.03527 56.6418C1.19314 52.8461 2.12277 49.1243 3.76587 45.71C4.83057 43.0332 6.08839 40.3173 7.36469 37.586C10.7872 30.2317 14.3172 22.7888 14.3172 15.3817C14.3167 13.4929 14.6833 11.6226 15.3959 9.87754C16.1086 8.13246 17.1533 6.54686 18.4705 5.21131C19.7876 3.87575 21.3514 2.81642 23.0725 2.09383C24.7935 1.37124 26.6381 0.999553 28.5008 1C36.3198 1 42.6845 7.43652 42.6845 15.3834C42.6845 22.7905 46.2128 30.2317 49.6353 37.586C50.9116 40.3173 52.1711 43.0332 53.2341 45.7117C54.67 49.3965 55.7531 53.0473 55.9647 56.6435C55.9815 57.0743 56 57.4864 56 57.9189Z" stroke="black" stroke-width="2" stroke-miterlimit="10"/>
<path d="M28.5009 72.1746C36.3371 72.1746 42.6896 65.7334 42.6896 57.7878C42.6896 49.8422 36.3371 43.401 28.5009 43.401C20.6646 43.401 14.3121 49.8422 14.3121 57.7878C14.3121 65.7334 20.6646 72.1746 28.5009 72.1746Z" stroke="black" stroke-width="2" stroke-miterlimit="10" stroke-linecap="round" stroke-linejoin="round"/>
</svg>
