Julie Mirage: Soy : 100
Elon Carousel: Vinegar,Olives : 50
Adam Smith: none : 100
Alexandra Smith: none : 1000000000
Barbara Smith: Chocolate : 250
Christian Donnovan: Paprika : 500
Bernard Unfortunate: Potatoes : 15

























































