{
    "map": "levels/map-00.txt",
    "tiles": {
        "=": {"tile": 0},
        "%": {"tile": 2, "obstacle": false},
        "0": {"tile": 1, "obstacle": false}
    },
    "light": {
        "*": {"tile": 3}
    }
}
