# PALO CUBE RULES
[RULES INFO]
4;
[RULES2]
1;"['Dr','Line':'Запасы сырья и материалов','Measure':'Кол-во','Responsible':'#','Delivery':'#','cpObject':'#','cpLine':'#','Product':'#','cpUOM':'#'] = PALO.MARKER(""GPNSM-2-2"",""Costs2"",""Cr"",!'Time',!'Version',""Root"",!'Object',!'Line',!'Resource',""Root"",""Root"",""Root"",!'UOM',!'Measure') + PALO.MARKER(""GPNSM-2-2"",""Nodes"",""Delta"",!'Time',!'Version',!'Object',!'Line',!'Resource',!'UOM',!'Measure')";"";"['Cr','Responsible':'#','Delivery':'#','Object':'#','Line':'#','Resource':'#','UOM':'#'] = PALO.MARKER(""GPNSM-2-2"",""Costs2"",!'Balance',!'Time',!'Version',""Root"",!'Object',!'Line',!'Resource',""Root"",""Root"",""Root"",!'UOM',!'Measure')";1475512884;0;2;
3;"['Dr','Line':'Запасы сырья и материалов','Measure':'Кол-во','Responsible':'#','Delivery':'#','cpObject':'#','cpLine':'#','Product':'#','cpUOM':'#'] = PALO.MARKER(""GPNSM-2-2"",""Nodes"",""Cr"",!'Time',!'Version',!'Object',!'Line',!'Resource',!'UOM',!'Measure') + PALO.MARKER(""GPNSM-2-2"",""Nodes"",""Delta"",!'Time',!'Version',!'Object',!'Line',!'Resource',!'UOM',!'Measure')";"";"['Dr','Responsible':'#','Delivery':'#','cpObject':'#','cpLine':'#','Product':'#','cpUOM':'#'] = PALO.MARKER(""GPNSM-2-2"",""Costs2"",""Cr"",!'Time',!'Version',""Root"",!'Object',!'Line',!'Resource',""Root"",""Root"",""Root"",!'UOM',!'Measure')
---------------------------------
['Dr','Line':'Запасы сырья и материалов','Measure':'Кол-во','Responsible':'#','Delivery':'#','cpObject':'#','cpLine':'#','Product':'#','cpUOM':'#'] = PALO.MARKER(""GPNSM-2-2"",""Nodes"",""Cr"",!'Time',!'Version',!'Object',!'Line',!'Resource',!'UOM',!'Measure') + PALO.MARKER(""GPNSM-2-2"",""Nodes"",""Delta"",!'Time',!'Version',!'Object',!'Line',!'Resource',!'UOM',!'Measure')";1475512766;0;1;
# PALO CUBE RULES END
