# PALO CUBE RULES
[RULES INFO]
2;
[RULES2]
1;"['cpLine':'Запасы сырья и материалов','Measure':'Кол-во','Responsible':'#','Delivery':'#','Region':'#','Object':'#','Line':'#','Resource':'#','UOM':'#','Operation':'Закупка ТМЦ'] = PALO.MARKER(""GPNSM-2-3"",""Nodes2"",""Delta"",!'Version',!'Time',!'ReportingEntity',!'cpObject',!'cpLine',!'Product',!'cpUOM',!'Measure') + PALO.MARKER(""GPNSM-2-3"",""Nodes2"",""Cr"",!'Version',!'Time',!'ReportingEntity',!'cpObject',!'cpLine',!'Product',!'cpUOM',!'Measure')";"";"['cpLine':'Запасы сырья и материалов','Measure':'Кол-во','Responsible':'#','Delivery':'#','Object':'#','Line':'#','Resource':'#','UOM':'#','Operation':'Закупка ТМЦ'] = PALO.MARKER(""GPNSM-2-3"",""Nodes2"",""Delta"",!'Version',!'Time',!'ReportingEntity',!'cpObject',!'cpLine',!'Product',!'cpUOM',!'Measure')";1477064279;0;2;
2;"['Стоимость','Закупка ТМЦ'] = PALO.MARKER(""GPNSM-2-3"",""Prices2"",""Cr"",!'Version',!'Time',!'ReportingEntity',!'Responsible',!'Delivery',!'Region',!'Object',!'Line',!'Resource',!'UOM',!'cpObject',!'cpLine',!'Product',!'cpUOM',""Цена"") * ['Responsible':'#','Operation':'#','Delivery':'#','Region':'#','Object':'#','Line':'#','Resource':'#','UOM':'#','Кол-во']";"";"";1477062267;0;3;
# PALO CUBE RULES END
