# PALO CUBE DATA
# 
# Description of data: 
# TIME_STAMP;SIZE_DIMENSIONS;
[CUBE]
1477515554.455312;5,33,7,44,82,167,146,2739,17,167,144,2735,16,5;
# Description of data: 
# PATH;VALUE 
[NUMERIC]
0,0,0,9,88,106,107,197,11,143,22,197,1,3;855678.31570384;
0,0,0,9,88,106,107,198,11,143,22,198,1,3;855678.31570384;
0,0,0,9,88,106,107,199,11,143,22,199,1,3;855678.31570384;
0,0,0,9,165,68,107,111,11,143,22,111,4,3;3.42;
0,0,0,9,165,68,107,112,11,143,22,112,4,3;0.63;
0,0,0,9,165,68,107,114,11,143,22,114,3,3;2.45761988408944;
0,0,0,9,165,68,107,115,11,143,22,115,2,3;1161.82127732827;
0,0,0,9,165,68,107,116,11,143,22,116,4,3;5933;
0,0,0,9,165,68,107,117,11,143,22,117,4,3;1463.61872809348;
0,0,0,9,165,68,107,119,11,143,22,119,4,3;47.82;
0,0,0,9,165,68,107,184,11,143,22,184,1,3;157991.684163411;
0,0,0,9,165,68,107,185,11,143,22,185,1,3;516940.520446097;
0,0,0,9,165,68,107,186,11,143,22,186,1,3;237164.8492569;
0,0,0,9,165,68,107,187,11,143,22,187,1,3;1523248.2208589;
0,0,0,9,165,68,107,188,11,143,22,188,1,3;14000;
0,0,0,9,165,68,107,189,11,143,22,189,1,3;2966.10169491525;
0,0,0,9,165,68,107,191,11,143,22,191,1,3;62402.1669545384;
0,0,0,9,165,68,107,192,11,143,22,192,1,3;90177.9690449226;
0,0,0,9,165,68,107,193,11,143,22,193,1,3;45251.7;
0,0,0,9,165,68,107,194,11,143,22,194,1,3;80786.5885893745;
0,0,0,9,165,68,107,195,11,143,22,195,1,3;84954.6452933151;
0,0,0,9,165,68,107,201,11,143,22,201,1,3;8474.57627118644;
0,0,0,9,165,68,107,202,11,143,22,202,6,3;70593.23;
0,0,0,9,165,68,107,203,11,143,22,203,6,3;153370.856410256;
0,0,0,9,165,68,107,204,11,143,22,204,6,3;14467.803030303;
0,0,0,9,165,68,107,205,11,143,22,205,6,3;24817.8482477033;
0,0,0,9,165,68,107,206,11,143,22,206,6,3;135120.037513691;
0,0,0,9,165,68,107,207,11,143,22,207,1,3;31355.9322033898;
0,0,0,9,165,68,107,208,11,143,22,208,1,3;392000;
0,0,0,9,165,68,107,209,11,143,22,209,1,3;17128.4125953061;
0,0,0,9,165,68,107,210,11,143,22,210,1,3;16437.0307017544;
0,0,0,9,165,68,107,212,11,143,22,212,1,3;70554.9903660886;
0,0,0,9,165,68,107,214,11,143,22,214,1,3;439140.996697688;
0,0,0,9,165,68,107,215,11,143,22,215,1,3;89500.7318632151;
0,0,0,9,165,68,107,216,11,143,22,216,1,3;155953.45;
0,0,0,9,165,68,107,217,11,143,22,217,1,3;163743.660205245;
0,0,0,9,165,68,107,218,11,143,22,218,1,3;458352.901618929;
0,0,0,9,165,68,107,219,11,143,22,219,1,3;743989.321086262;
0,0,0,9,165,68,107,220,11,143,22,220,1,3;499211.472868217;
0,0,0,9,165,68,107,221,11,143,22,221,1,3;207368.493621984;
0,0,0,9,165,68,107,222,11,143,22,222,1,3;797295.274844721;
0,0,0,9,165,68,107,223,11,143,22,223,1,3;204232.39893617;
0,0,0,9,165,68,107,225,11,143,22,225,1,3;133149.454189022;
0,0,0,9,165,68,107,228,11,143,22,228,1,3;365746.253814853;
0,0,0,9,165,68,107,229,11,143,22,229,1,3;208313.375972374;
0,0,0,9,165,68,107,230,11,143,22,230,1,3;299663.47189419;
0,0,0,9,165,68,107,231,11,143,22,231,1,3;196828.414758684;
0,0,0,9,165,68,107,232,11,143,22,232,1,3;365746.253814853;
0,0,0,9,165,68,107,237,11,143,22,237,1,3;457255.384615385;
0,0,0,9,165,68,107,238,11,143,22,238,1,3;277345.503608409;
0,0,0,9,165,68,107,239,11,143,22,239,1,3;227281.185423552;
0,0,0,9,165,68,107,240,11,143,22,240,1,3;235814.691400832;
0,0,0,9,165,68,107,241,11,143,22,241,1,3;232696.883990958;
0,0,0,9,165,68,107,242,11,143,22,242,1,3;149328.308177044;
0,0,0,9,165,68,107,243,11,143,22,243,1,3;142000;
0,0,0,9,165,68,107,244,11,143,22,244,1,3;214101.03960396;
0,0,0,9,165,68,107,245,11,143,22,245,1,3;432412.400793651;
0,0,0,9,165,68,107,248,11,143,22,248,1,3;510713.701252236;
0,0,0,9,165,68,107,249,11,143,22,249,1,3;155234.018384767;
0,0,0,9,165,68,107,250,11,143,22,250,1,3;455293.468960359;
0,0,0,9,165,68,107,251,11,143,22,251,1,3;708246.666666667;
0,0,0,9,165,68,107,252,11,143,22,252,1,3;368162.685977617;
0,0,0,9,165,68,107,253,11,143,22,253,1,3;137901.379310345;
0,0,0,9,165,68,107,254,11,143,22,254,1,3;182442.450150489;
0,0,0,9,165,68,107,256,11,143,22,256,1,3;303668.714107366;
0,0,0,9,165,68,107,257,11,143,22,257,1,3;841111.333333333;
0,0,0,9,165,68,107,258,11,143,22,258,1,3;905424.078431373;
0,0,0,9,165,68,107,261,11,143,22,261,1,3;321806.431425458;
0,0,0,9,165,68,107,263,11,143,22,263,1,3;1315586.36363636;
0,0,0,9,165,68,107,264,11,143,22,264,1,3;147785;
0,0,0,9,165,68,107,265,11,143,22,265,1,3;1374673.83333333;
0,0,0,9,165,68,107,269,11,143,22,269,1,3;226217.494348154;
0,0,0,9,165,68,107,278,11,143,22,278,1,3;102858.992418416;
0,0,0,9,165,68,107,280,11,143,22,280,1,3;143900;
0,0,0,9,165,68,107,287,11,143,22,287,1,3;3810341.76470588;
0,0,0,9,165,68,107,288,11,143,22,288,1,3;570693.333333333;
0,0,0,9,165,68,107,305,11,143,22,305,7,3;22.6997613240178;
0,0,0,9,165,68,107,306,11,143,22,306,6,3;66.5003103662321;
0,0,0,9,165,68,107,307,11,143,22,307,8,3;9929.15925925926;
0,0,0,9,165,68,107,308,11,143,22,308,8,3;5625.46096941592;
0,0,0,9,165,68,107,309,11,143,22,309,8,3;3661.96470588235;
0,0,0,9,165,68,107,310,11,143,22,310,9,3;0.53;
0,0,0,9,165,68,107,311,11,143,22,311,8,3;77236.5993265993;
0,0,0,9,165,68,107,312,11,143,22,312,7,3;145;
0,0,0,9,165,68,107,313,11,143,22,313,9,3;1.14800001407763;
0,0,0,9,165,68,107,314,11,143,22,314,7,3;2.39401702896827;
0,0,0,9,165,68,107,315,11,143,22,315,7,3;1.14716961279461;
0,0,0,9,165,68,107,316,11,143,22,316,7,3;0.37;
0,0,0,9,165,68,107,317,11,143,22,317,6,3;68.22;
0,0,0,9,165,68,107,318,11,143,22,318,7,3;2.34;
0,0,0,9,165,68,107,319,11,143,22,319,4,3;2.85;
0,0,0,9,165,68,107,320,11,143,22,320,7,3;115;
0,0,0,9,165,68,107,321,11,143,22,321,9,3;1.99433801946547;
0,0,0,9,165,68,107,322,11,143,22,322,7,3;23.34;
0,0,0,9,165,68,107,323,11,143,22,323,9,3;0.575001271294177;
0,0,0,9,165,68,107,324,11,143,22,324,7,3;0.308739717522893;
0,0,0,9,165,68,107,325,11,143,22,325,7,3;23.34;
0,0,0,9,165,68,107,326,11,143,22,326,7,3;265;
0,0,0,9,165,68,107,327,11,143,22,327,7,3;433.71;
0,0,0,9,165,68,107,328,11,143,22,328,7,3;7.99049824561403;
0,0,0,9,165,68,107,329,11,143,22,329,9,3;7.97734777936963;
0,0,0,9,165,68,107,330,11,143,22,330,9,3;17.3;
0,0,0,9,165,68,107,331,11,143,22,331,7,3;5.16;
0,0,0,9,165,68,107,332,11,143,22,332,7,3;4.38586737844769;
0,0,0,9,165,68,107,333,11,143,22,333,1,3;86961.2124600143;
0,0,0,9,165,68,107,334,11,143,22,334,6,3;323.343253333333;
0,0,0,9,165,68,107,336,11,143,22,336,7,3;23.776;
0,0,0,9,165,68,107,337,11,143,22,337,7,3;20.15;
0,0,0,9,165,68,107,338,11,143,22,338,9,3;0.457998822836963;
0,0,0,9,165,68,107,339,11,143,22,339,7,3;0.972695253052144;
0,0,0,9,165,68,107,340,11,143,22,340,6,3;334.921085714286;
0,0,0,9,165,68,107,341,11,143,22,341,8,3;12260.0035087719;
0,0,0,9,165,68,107,342,11,143,22,342,9,3;2.38224669603524;
0,0,0,9,165,68,107,343,11,143,22,343,7,3;0.583133333333333;
0,0,0,9,165,68,107,344,11,143,22,344,7,3;7.05276156138003;
0,0,0,9,165,68,107,345,11,143,22,345,7,3;9.0117626857091;
0,0,0,9,165,68,107,346,11,143,22,346,7,3;18.6367918905976;
0,0,0,9,165,68,107,347,11,143,22,347,9,3;0.802742;
0,0,0,9,165,68,107,348,11,143,22,348,7,3;16.26;
0,0,0,9,165,68,107,349,11,143,22,349,7,3;23.7676051734663;
0,0,0,9,165,68,107,350,11,143,22,350,7,3;13.9182221458785;
0,0,0,9,165,68,107,351,11,143,22,351,7,3;297;
0,0,0,9,165,68,107,352,11,143,22,352,7,3;24.28;
0,0,0,9,165,68,107,353,11,143,22,353,7,3;15.4752547849863;
0,0,0,9,165,68,107,354,11,143,22,354,7,3;16.8699660945115;
0,0,0,9,165,68,107,355,11,143,22,355,4,3;2.85;
0,0,0,9,165,68,107,356,11,143,22,356,7,3;20.67;
0,0,0,9,165,68,107,357,11,143,22,357,7,3;26.4155723905724;
0,0,0,9,165,68,107,358,11,143,22,358,7,3;23.34;
0,0,0,9,165,68,107,359,11,143,22,359,7,3;20.9476654246434;
0,0,0,9,165,68,107,360,11,143,22,360,7,3;23.29;
0,0,0,9,165,68,107,383,11,143,22,383,1,3;89830.998147767;
0,0,0,9,165,68,107,398,11,143,22,367,7,3;12.05;
0,0,0,9,165,68,107,399,11,143,22,399,7,3;80.17;
0,0,0,9,165,68,107,400,11,143,22,400,7,3;168.73;
0,0,0,9,165,68,107,401,11,143,22,401,7,3;189.1;
0,0,0,9,165,68,107,402,11,143,22,402,7,3;924.015449803918;
0,0,0,9,165,68,107,409,11,143,22,409,7,3;83.64;
0,0,0,9,165,68,107,410,11,143,22,410,7,3;65.1270577690307;
0,0,0,9,165,68,107,411,11,143,22,411,7,3;217.69;
0,0,0,9,165,68,107,412,11,143,22,412,7,3;421.58;
0,0,0,9,165,68,107,413,11,143,22,413,7,3;364.4;
0,0,0,9,165,68,107,414,11,143,22,414,7,3;6250;
0,0,0,9,165,68,107,415,11,143,22,415,7,3;1030.44744367521;
0,0,0,9,165,106,107,183,11,143,22,183,1,3;855.67831570384;
0,0,0,9,166,68,107,224,11,143,22,224,1,3;207275.536270356;
0,0,0,9,166,68,107,226,11,143,22,226,1,3;316227.775419446;
0,0,0,9,166,68,107,227,11,143,22,227,1,3;202228.191168193;
0,0,0,9,166,68,107,234,11,143,22,234,1,3;688246.543647977;
0,0,0,9,166,68,107,235,11,143,22,235,1,3;245711.062459755;
0,0,0,9,166,68,107,236,11,143,22,236,1,3;185092.711121366;
0,0,0,9,166,68,107,246,11,143,22,246,1,3;283943.839416058;
0,0,0,9,166,68,107,247,11,143,22,247,1,3;343879.310797506;
0,0,0,9,166,68,107,255,11,143,22,255,1,3;251834.475553698;
0,0,0,9,166,68,107,259,11,143,22,259,1,3;288253.359413687;
0,0,0,9,166,68,107,262,11,143,22,262,1,3;380974.042651831;
0,0,0,9,166,68,107,267,11,143,22,267,1,3;148517.97752809;
0,0,0,9,166,68,107,268,11,143,22,268,1,3;327074.37900641;
0,0,0,9,166,68,107,275,11,143,22,275,1,3;198426.719812265;
0,0,1,6,88,167,107,2700,11,145,120,2701,1,3;777;
0,0,1,6,88,167,107,3033,11,145,40,3034,1,3;777;
0,0,1,6,88,167,107,3034,11,145,210,3035,1,3;777;
0,0,1,6,164,146,107,3036,11,145,22,3037,1,3;2825.72;
0,0,1,6,164,146,107,3037,11,145,22,3038,1,3;6378.49;
0,0,1,6,164,146,107,3038,11,145,22,3039,1,3;6378.49;
0,0,1,9,165,68,107,111,11,143,22,111,4,3;3.42;
0,0,1,9,165,68,107,112,11,143,22,112,4,3;0.63;
0,0,1,9,165,68,107,114,11,143,22,114,3,3;2.5071259854719;
0,0,1,9,165,68,107,115,11,143,22,115,2,3;1159.94914786967;
0,0,1,9,165,68,107,116,11,143,22,116,4,3;5933;
0,0,1,9,165,68,107,117,11,143,22,117,4,3;1839.91;
0,0,1,9,165,68,107,119,11,143,22,119,4,3;47.82;
0,0,1,9,165,68,107,183,11,143,22,183,1,3;1761.72222955061;
0,0,1,9,165,68,107,184,11,143,22,184,1,3;149713.791416738;
0,0,1,9,165,68,107,185,11,143,22,185,1,3;627399.516879601;
0,0,1,9,165,68,107,186,11,143,22,186,1,3;237271.887966805;
0,0,1,9,165,68,107,187,11,143,22,187,1,3;1644192.02290076;
0,0,1,9,165,68,107,188,11,143,22,188,1,3;14206.6869565217;
0,0,1,9,165,68,107,189,11,143,22,189,1,3;2542.99991492982;
0,0,1,9,165,68,107,191,11,143,22,191,1,3;63187.5499753208;
0,0,1,9,165,68,107,192,11,143,22,192,1,3;90177.9679144385;
0,0,1,9,165,68,107,193,11,143,22,193,1,3;45251.7030429557;
0,0,1,9,165,68,107,194,11,143,22,194,1,3;80786.5875785066;
0,0,1,9,165,68,107,195,11,143,22,195,1,3;79572.6741451058;
0,0,1,9,165,68,107,201,11,143,22,201,1,3;8516.87544483986;
0,0,1,9,165,68,107,202,11,143,22,202,6,3;70593.2296849088;
0,0,1,9,165,68,107,203,11,143,22,203,6,3;153370.855813954;
0,0,1,9,165,68,107,204,11,143,22,204,6,3;14470.2666666667;
0,0,1,9,165,68,107,205,11,143,22,205,6,3;25268.7962678937;
0,0,1,9,165,68,107,206,11,143,22,206,6,3;132843.052793439;
0,0,1,9,165,68,107,207,11,143,22,207,1,3;25424;
0,0,1,9,165,68,107,209,11,143,22,209,1,3;30907.9782340044;
0,0,1,9,165,68,107,210,11,143,22,210,1,3;16630.16;
0,0,1,9,165,68,107,212,11,143,22,212,1,3;70555;
0,0,1,9,165,68,107,214,11,143,22,214,1,3;439140.996294772;
0,0,1,9,165,68,107,215,11,143,22,215,1,3;86557.3742871954;
0,0,1,9,165,68,107,216,11,143,22,216,1,3;155953.457711443;
0,0,1,9,165,68,107,217,11,143,22,217,1,3;166565.569232934;
0,0,1,9,165,68,107,218,11,143,22,218,1,3;458352.898876405;
0,0,1,9,165,68,107,219,11,143,22,219,1,3;743989.31696905;
0,0,1,9,165,68,107,220,11,143,22,220,1,3;499211.52173913;
0,0,1,9,165,68,107,221,11,143,22,221,1,3;224713.104957736;
0,0,1,9,165,68,107,222,11,143,22,222,1,3;962544.009944948;
0,0,1,9,165,68,107,223,11,143,22,223,1,3;219799.956115245;
0,0,1,9,165,68,107,229,11,143,22,229,1,3;243760.971032346;
0,0,1,9,165,68,107,230,11,143,22,230,1,3;377006.663458454;
0,0,1,9,165,68,107,231,11,143,22,231,1,3;207687.724221778;
0,0,1,9,165,68,107,232,11,143,22,232,1,3;352621.431787944;
0,0,1,9,165,68,107,237,11,143,22,237,1,3;533824.666666667;
0,0,1,9,165,68,107,238,11,143,22,238,1,3;259573.613775065;
0,0,1,9,165,68,107,239,11,143,22,239,1,3;272755.869726129;
0,0,1,9,165,68,107,240,11,143,22,240,1,3;304979.442755826;
0,0,1,9,165,68,107,241,11,143,22,241,1,3;253622.954894926;
0,0,1,9,165,68,107,242,11,143,22,242,1,3;149098.260358821;
0,0,1,9,165,68,107,243,11,143,22,243,1,3;142000;
0,0,1,9,165,68,107,244,11,143,22,244,1,3;214410;
0,0,1,9,165,68,107,245,11,143,22,245,1,3;441140.944244604;
0,0,1,9,165,68,107,248,11,143,22,248,1,3;510713.699933614;
0,0,1,9,165,68,107,249,11,143,22,249,1,3;164174.07141471;
0,0,1,9,165,68,107,250,11,143,22,250,1,3;441487.479447805;
0,0,1,9,165,68,107,251,11,143,22,251,1,3;708246.666666667;
0,0,1,9,165,68,107,252,11,143,22,252,1,3;368162.685978107;
0,0,1,9,165,68,107,253,11,143,22,253,1,3;137901.320754717;
0,0,1,9,165,68,107,254,11,143,22,254,1,3;182442.450278441;
0,0,1,9,165,68,107,256,11,143,22,256,1,3;380917.764242207;
0,0,1,9,165,68,107,257,11,143,22,257,1,3;841111.5625;
0,0,1,9,165,68,107,258,11,143,22,258,1,3;969460.966850829;
0,0,1,9,165,68,107,261,11,143,22,261,1,3;312077.29656664;
0,0,1,9,165,68,107,263,11,143,22,263,1,3;1315587.14285714;
0,0,1,9,165,68,107,264,11,143,22,264,1,3;147785.000203293;
0,0,1,9,165,68,107,265,11,143,22,265,1,3;1374673.88111888;
0,0,1,9,165,68,107,269,11,143,22,269,1,3;213348.456692913;
0,0,1,9,165,68,107,277,11,143,22,277,1,3;121391.745454545;
0,0,1,9,165,68,107,278,11,143,22,278,1,3;86628.7463556851;
0,0,1,9,165,68,107,279,11,143,22,279,1,3;5933;
0,0,1,9,165,68,107,280,11,143,22,280,1,3;143900;
0,0,1,9,165,68,107,281,11,143,22,281,1,3;142157.771942036;
0,0,1,9,165,68,107,287,11,143,22,287,1,3;3810341;
0,0,1,9,165,68,107,288,11,143,22,288,1,3;785137.142857143;
0,0,1,9,165,68,107,305,11,143,22,305,7,3;22.0168395427584;
0,0,1,9,165,68,107,306,11,143,22,306,6,3;66.5;
0,0,1,9,165,68,107,307,11,143,22,307,8,3;10010.6735815919;
0,0,1,9,165,68,107,308,11,143,22,308,8,3;6908.319532235;
0,0,1,9,165,68,107,309,11,143,22,309,8,3;3863.5809525367;
0,0,1,9,165,68,107,310,11,143,22,310,9,3;0.53;
0,0,1,9,165,68,107,311,11,143,22,311,8,3;72136.3344453711;
0,0,1,9,165,68,107,312,11,143,22,312,7,3;145;
0,0,1,9,165,68,107,314,11,143,22,314,7,3;2.37536803738687;
0,0,1,9,165,68,107,315,11,143,22,315,7,3;1.14716935685686;
0,0,1,9,165,68,107,318,11,143,22,318,7,3;2.34;
0,0,1,9,165,68,107,319,11,143,22,319,4,3;2.85;
0,0,1,9,165,68,107,320,11,143,22,320,7,3;115;
0,0,1,9,165,68,107,321,11,143,22,321,9,3;1.99435922418871;
0,0,1,9,165,68,107,322,11,143,22,322,7,3;23.34;
0,0,1,9,165,68,107,323,11,143,22,323,9,3;0.575002514403744;
0,0,1,9,165,68,107,326,11,143,22,326,7,3;265;
0,0,1,9,165,68,107,327,11,143,22,327,7,3;464.07;
0,0,1,9,165,68,107,330,11,143,22,330,9,3;17.3;
0,0,1,9,165,68,107,334,11,143,22,334,6,3;220.767937142857;
0,0,1,9,165,68,107,338,11,143,22,338,9,3;0.458003875968992;
0,0,1,9,165,68,107,339,11,143,22,339,7,3;0.972695246041094;
0,0,1,9,165,68,107,340,11,143,22,340,6,3;333.757155555556;
0,0,1,9,165,68,107,341,11,143,22,341,8,3;12259.9871239682;
0,0,1,9,165,68,107,343,11,143,22,343,7,3;0.583133333333333;
0,0,1,9,165,68,107,344,11,143,22,344,7,3;7.48897931147946;
0,0,1,9,165,68,107,345,11,143,22,345,7,3;10.6585505449202;
0,0,1,9,165,68,107,346,11,143,22,346,7,3;17.2945004481243;
0,0,1,9,165,68,107,349,11,143,22,349,7,3;21.3221428571429;
0,0,1,9,165,68,107,350,11,143,22,350,7,3;16.1461941796609;
0,0,1,9,165,68,107,351,11,143,22,351,7,3;297;
0,0,1,9,165,68,107,352,11,143,22,352,7,3;24.28;
0,0,1,9,165,68,107,353,11,143,22,353,7,3;14.133676359072;
0,0,1,9,165,68,107,354,11,143,22,354,7,3;21.2658065291805;
0,0,1,9,165,68,107,355,11,143,22,355,4,3;2.85;
0,0,1,9,165,68,107,356,11,143,22,356,7,3;20.67;
0,0,1,9,165,68,107,358,11,143,22,358,7,3;23.5543940013633;
0,0,1,9,165,68,107,359,11,143,22,359,7,3;24.08;
0,0,1,9,165,68,107,360,11,143,22,360,7,3;24.686;
0,0,1,9,165,68,107,367,11,143,22,367,7,3;12.05;
0,0,1,9,165,68,107,368,11,143,22,368,7,3;0.296596137745148;
0,0,1,9,165,68,107,369,11,143,22,369,9,3;2.15000117126441;
0,0,1,9,165,68,107,370,11,143,22,370,9,3;5.25112849071409;
0,0,1,9,165,68,107,371,11,143,22,371,9,3;0.718236455278009;
0,0,1,9,165,68,107,372,11,143,22,372,7,3;27.66;
0,0,1,9,165,68,107,373,11,143,22,373,7,3;25.43;
0,0,1,9,165,68,107,374,11,143,22,374,7,3;20.15;
0,0,1,9,165,68,107,375,11,143,22,375,7,3;22.75;
0,0,1,9,165,68,107,376,11,143,22,376,9,3;7.95226060775463;
0,0,1,9,165,68,107,377,11,143,22,377,7,3;10.5311509872242;
0,0,1,9,165,68,107,378,11,143,22,378,7,3;2.63040595196365;
0,0,1,9,165,68,107,379,11,143,22,379,7,3;7.65977777777778;
0,0,1,9,165,68,107,380,11,143,22,380,7,3;9.22332134146341;
0,0,1,9,165,68,107,381,11,143,22,381,7,3;48.2;
0,0,1,9,165,68,107,382,11,143,22,382,1,3;87704.7004703669;
0,0,1,9,165,68,107,383,11,143,22,383,1,3;89831;
0,0,1,9,165,68,107,384,11,143,22,384,7,3;3.19798903107861;
0,0,1,9,165,68,107,385,11,143,22,385,7,3;2.4;
0,0,1,9,165,68,107,386,11,143,22,386,7,3;0.02;
0,0,1,9,165,68,107,387,11,143,22,387,7,3;15.88;
0,0,1,9,165,68,107,388,11,143,22,388,7,3;49.4838983967785;
0,0,1,9,165,68,107,389,11,143,22,389,9,3;1345.27;
0,0,1,9,165,68,107,390,11,143,22,390,7,3;18.7772158838872;
0,0,1,9,165,68,107,391,11,143,22,391,7,3;28.9355466167071;
0,0,1,9,165,68,107,392,11,143,22,392,7,3;7.63266307095904;
0,0,1,9,165,68,107,393,11,143,22,393,7,3;170.8052;
0,0,1,9,165,68,107,399,11,143,22,399,7,3;80.17;
0,0,1,9,165,68,107,400,11,143,22,400,7,3;168.73;
0,0,1,9,165,68,107,401,11,143,22,401,7,3;189.1;
0,0,1,9,165,68,107,402,11,143,22,402,7,3;1100.11;
0,0,1,9,165,68,107,409,11,143,22,409,7,3;83.64;
0,0,1,9,165,68,107,410,11,143,22,410,7,3;192.003333333333;
0,0,1,9,165,68,107,411,11,143,22,411,7,3;217.69;
0,0,1,9,165,68,107,412,11,143,22,412,7,3;402.828333333333;
0,0,1,9,165,68,107,414,11,143,22,414,7,3;6250;
0,0,1,9,165,68,107,428,11,143,22,428,7,3;6250;
0,0,1,9,165,68,107,429,11,143,22,429,7,3;1084.63312619549;
0,0,1,9,166,68,107,224,11,143,22,224,1,3;183607.569565217;
0,0,1,9,166,68,107,226,11,143,22,226,1,3;362392.636052659;
0,0,1,9,166,68,107,227,11,143,22,227,1,3;229570.105945839;
0,0,1,9,166,68,107,234,11,143,22,234,1,3;671508.111533587;
0,0,1,9,166,68,107,235,11,143,22,235,1,3;234665.146812081;
0,0,1,9,166,68,107,236,11,143,22,236,1,3;185092.711461597;
0,0,1,9,166,68,107,246,11,143,22,246,1,3;278390.344827586;
0,0,1,9,166,68,107,247,11,143,22,247,1,3;343879.310986965;
0,0,1,9,166,68,107,255,11,143,22,255,1,3;251834.474104495;
0,0,1,9,166,68,107,259,11,143,22,259,1,3;311604.738356881;
0,0,1,9,166,68,107,262,11,143,22,262,1,3;407679.743944637;
0,0,1,9,166,68,107,267,11,143,22,267,1,3;148518.011869436;
0,0,1,9,166,68,107,275,11,143,22,275,1,3;206209.323165114;
0,0,1,9,167,68,107,191,11,144,22,191,1,3;62016.5120805503;
0,0,1,9,167,68,107,194,11,144,22,194,1,3;90984.6798349458;
0,0,1,9,167,68,107,195,11,144,22,195,1,3;83803.6712814691;
0,0,1,9,167,68,107,222,11,144,22,222,1,3;818131.464188465;
0,0,1,9,167,68,107,223,11,144,22,223,1,3;174118.593563071;
0,0,1,9,167,68,107,224,11,144,22,224,1,3;170816.454885124;
0,0,1,9,167,68,107,227,11,144,22,227,1,3;216179.980784845;
0,0,1,9,167,68,107,229,11,144,22,229,1,3;231067.988550432;
0,0,1,9,167,68,107,230,11,144,22,230,1,3;331686.902914031;
0,0,1,9,167,68,107,232,11,144,22,232,1,3;371887.249820496;
0,0,1,9,167,68,107,234,11,144,22,234,1,3;771793.748832478;
0,0,1,9,167,68,107,235,11,144,22,235,1,3;250620.351446219;
0,0,1,9,167,68,107,236,11,144,22,236,1,3;224903.527878054;
0,0,1,9,167,68,107,237,11,144,22,237,1,3;572110;
0,0,1,9,167,68,107,238,11,144,22,238,1,3;264493.701855742;
0,0,1,9,167,68,107,239,11,144,22,239,1,3;253833.507290929;
0,0,1,9,167,68,107,240,11,144,22,240,1,3;312840.774214255;
0,0,1,9,167,68,107,241,11,144,22,241,1,3;230860.929374914;
0,0,1,9,167,68,107,245,11,144,22,245,1,3;394331.09032409;
0,0,1,9,167,68,107,246,11,144,22,246,1,3;193653.111963359;
0,0,1,9,167,68,107,247,11,144,22,247,1,3;362195.445511122;
0,0,1,9,167,68,107,249,11,144,22,249,1,3;150942.874884346;
0,0,1,9,167,68,107,250,11,144,22,250,1,3;433109.323096853;
0,0,1,9,167,68,107,253,11,144,22,253,1,3;137900;
0,0,1,9,167,68,107,257,11,144,22,257,1,3;723716.979166667;
0,0,1,9,167,68,107,258,11,144,22,258,1,3;1450104.28571429;
0,0,1,9,167,68,107,259,11,144,22,259,1,3;313293.324748901;
0,0,1,9,167,68,107,261,11,144,22,261,1,3;313411.074203839;
0,0,1,9,167,68,107,264,11,144,22,264,1,3;117106.134374492;
0,0,1,9,167,68,107,271,11,144,22,271,1,3;44049.9433962264;
0,0,1,9,167,68,107,272,11,144,22,272,1,3;109204.790794979;
0,0,1,9,167,68,107,275,11,144,22,275,1,3;228850.82389481;
0,0,1,9,167,68,107,277,11,144,22,277,1,3;218510.615384615;
0,0,1,9,167,68,107,278,11,144,22,278,1,3;78660.3571428571;
0,0,1,9,167,68,107,288,11,144,22,288,1,3;785137.5;
0,0,1,9,167,68,107,312,11,144,22,312,7,3;224.675;
0,0,1,9,167,68,107,313,11,144,22,313,9,3;113.545;
0,0,1,9,167,68,107,315,11,144,22,315,7,3;5.38;
0,0,1,9,167,68,107,326,11,144,22,326,7,3;294.57;
0,0,1,9,167,68,107,344,11,144,22,344,7,3;7.28208333333333;
0,0,1,9,167,68,107,345,11,144,22,345,7,3;8.41857142857143;
0,0,1,9,167,68,107,350,11,144,22,350,7,3;6.55555555555556;
0,0,1,9,167,68,107,351,11,144,22,351,7,3;288.96;
0,0,1,9,167,68,107,353,11,144,22,353,7,3;5.85;
0,0,1,9,167,68,107,358,11,144,22,358,7,3;23.76;
0,0,1,9,167,68,107,378,11,144,22,378,7,3;5.35;
0,0,1,9,167,68,107,395,11,144,22,395,7,3;55.1933333333333;
0,0,1,9,167,68,107,410,11,144,22,410,7,3;155.79;
0,0,1,9,167,68,107,411,11,144,22,411,7,3;192.075;
0,0,1,9,167,68,107,414,11,144,22,414,7,3;5304.55;
0,0,1,9,167,68,107,429,11,144,22,429,7,3;810.266;
0,0,1,9,167,68,107,973,11,144,25,973,1,3;9684.1685050974;
0,0,1,9,167,68,107,2515,11,144,22,2516,7,3;31.165;
0,0,1,9,167,68,107,2516,11,144,22,2517,7,3;21;
0,0,1,9,167,68,107,2517,11,144,22,2518,7,3;1.95;
0,0,1,9,167,68,107,2518,11,144,22,2519,7,3;16.56;
0,0,1,9,167,68,107,2519,11,144,22,2520,9,3;0.02345;
0,0,1,9,167,68,107,2520,11,144,22,2521,9,3;0.57;
0,0,1,9,167,68,107,2521,11,144,22,2522,7,3;8.36166666666667;
0,0,1,9,167,68,107,2522,11,144,22,2523,7,3;22.37;
0,0,1,9,167,68,107,2523,11,144,22,2524,7,3;28.85;
0,0,1,9,167,68,107,2524,11,144,22,2525,9,3;102.055;
0,0,1,9,167,68,107,2525,11,144,22,2526,7,3;54.0266666666667;
0,0,1,9,167,68,107,2526,11,144,22,2527,7,3;22.19;
0,0,1,9,167,68,107,2527,11,144,22,2528,7,3;8.53090909090909;
0,0,1,9,167,68,107,2528,11,144,22,2529,7,3;20.13;
0,0,1,9,167,68,107,2529,11,144,22,2530,7,3;1046.4;
0,0,1,9,167,68,107,2530,11,144,22,2531,7,3;16.11;
0,0,1,9,167,68,107,2531,11,144,22,2532,7,3;8.66;
0,0,1,9,167,68,107,2532,11,144,22,2533,7,3;6.61142857142857;
0,0,1,9,167,68,107,2533,11,144,22,2534,7,3;7.76;
0,0,1,9,167,68,107,2534,11,144,22,2535,7,3;6.31333333333333;
0,0,1,9,167,68,107,2535,11,144,22,2536,7,3;19.43;
0,0,1,9,167,68,107,2536,11,144,22,2537,7,3;6.73;
0,0,1,9,167,68,107,2537,11,144,22,2538,7,3;6.725;
0,0,1,9,167,68,107,2538,11,144,22,2539,7,3;18.36;
0,0,1,9,167,68,107,2539,11,144,22,2540,7,3;17.62;
0,0,1,9,167,68,107,2540,11,144,22,2541,7,3;363.56;
0,0,1,9,167,68,107,2541,11,144,22,2542,7,3;9.98333333333333;
0,0,1,9,167,68,107,2542,11,144,22,2543,7,3;10.72;
0,0,1,9,167,68,107,2695,11,144,22,2696,6,3;314.492;
0,0,1,9,167,68,107,2703,11,144,25,2704,1,3;11219.529585011;
0,0,1,9,167,68,107,2704,11,144,22,2705,1,3;90288.3236647572;
0,0,1,9,167,68,107,2718,11,144,22,2719,1,3;178573.250261712;
0,0,1,9,167,68,107,2719,11,144,22,2720,1,3;750287.857142857;
0,0,1,9,167,68,107,2720,11,144,22,2721,1,3;2927845.625;
0,0,1,9,167,68,107,2721,11,144,22,2722,1,3;486476.830430193;
0,0,1,9,167,68,107,2722,11,144,22,2723,1,3;769817.666666667;
0,0,1,9,167,68,107,2723,11,144,22,2724,1,3;426432.487973356;
0,0,1,9,167,68,107,2724,11,144,22,2725,1,3;177755.579240037;
0,0,1,9,167,68,107,2725,11,144,22,2726,1,3;358697.211538462;
0,0,1,9,167,68,107,2726,11,144,22,2727,1,3;221103.535115894;
0,0,1,9,167,68,107,2727,11,144,22,2728,1,3;247879.089837997;
0,0,1,9,167,68,107,2728,11,144,22,2729,1,3;206254.907656446;
0,0,1,9,167,68,107,2729,11,144,22,2730,1,3;336296.344839671;
0,0,1,9,167,68,107,2730,11,144,22,2731,1,3;186620.524780029;
0,0,1,9,167,68,107,2731,11,144,22,2732,1,3;457175.174039618;
0,0,1,9,167,68,107,2732,11,144,22,2733,1,3;352740.423076923;
0,0,1,9,167,68,107,2733,11,144,22,2734,1,3;387389.349112426;
0,0,1,9,167,68,107,2734,11,144,22,2735,1,3;567738.407529708;
0,0,1,9,167,68,107,2735,11,144,22,2736,1,3;734080.847385445;
0,0,1,9,167,68,107,2736,11,144,22,2737,1,3;865330.487953692;
0,0,1,9,167,68,107,2737,11,144,22,2738,1,3;355535.055803571;
0,0,1,9,167,68,107,2738,11,144,22,2739,1,3;1143229.77440782;
0,0,1,9,167,68,107,2739,11,144,22,2740,1,3;159273.131611931;
0,0,1,9,167,68,107,2740,11,144,22,2741,1,3;214316.785241138;
0,0,1,9,167,68,107,2741,11,144,22,2742,1,3;397344.791666667;
0,0,1,9,167,68,107,2742,11,144,22,2743,1,3;212652.06991867;
0,0,1,9,167,68,107,2743,11,144,22,2744,1,3;426090.046296296;
0,0,1,9,167,68,107,2744,11,144,22,2745,1,3;102627.071299723;
0,0,1,9,167,68,107,2745,11,144,22,2746,1,3;504651.060491241;
0,0,1,9,167,68,107,2746,11,144,22,2747,1,3;279987.988565489;
0,0,1,9,167,68,107,2747,11,144,22,2748,1,3;285315.539730135;
0,0,1,9,167,68,107,2748,11,144,22,2749,1,3;319462.513930067;
0,0,1,9,167,68,107,2749,11,144,22,2750,1,3;347399.627414224;
0,0,1,9,167,68,107,2750,11,144,25,2751,1,3;9467.35993500437;
0,0,1,9,167,68,107,2751,11,144,22,2752,1,3;444429.000183561;
0,0,1,9,167,68,107,2752,11,144,22,2753,1,3;365633.276791302;
0,0,1,9,167,68,107,2753,11,144,22,2754,1,3;302646.982086593;
0,0,1,9,167,68,107,2754,11,144,22,2755,1,3;65466.4645191958;
0,0,1,9,167,68,107,2755,11,144,22,2756,1,3;65584.4606877419;
0,0,1,9,167,68,107,2756,11,144,22,2757,1,3;669074.473229706;
0,0,1,9,167,68,107,2762,11,144,22,2763,1,3;43973.1865171248;
0,0,1,9,167,68,107,2764,11,144,25,2765,1,3;14208.5900096652;
1,0,0,9,165,68,107,150,5,143,22,150,5,0;1140.93333333333;
1,0,0,9,165,68,107,184,1,143,22,184,1,0;82.2429105343351;
1,0,0,9,165,68,107,185,1,143,22,185,1,0;11.564744571485;
1,0,0,9,165,68,107,186,1,143,22,186,1,0;4.31459949254022;
1,0,0,9,165,68,107,187,1,143,22,187,1,0;0.522883941063262;
1,0,0,9,165,68,107,188,1,143,22,188,1,0;167.783213288117;
1,0,0,9,165,68,107,189,1,143,22,189,1,0;71.832188188975;
1,0,0,9,165,68,107,190,1,143,22,190,1,0;713.189715483864;
1,0,0,9,165,68,107,191,1,143,22,191,1,0;108.605774;
1,0,0,9,165,68,107,192,1,143,22,192,1,0;3.8187793;
1,0,0,9,165,68,107,193,1,143,22,193,1,0;16.23872636;
1,0,0,9,165,68,107,194,1,143,22,194,1,0;8.15270124;
1,0,0,9,165,68,107,195,1,143,22,195,1,0;3.94467846;
1,0,0,9,165,68,107,201,1,143,22,201,1,0;227.456520288311;
1,0,0,9,165,68,107,202,6,143,22,202,6,0;4.01810471816123;
1,0,0,9,165,68,107,203,6,143,22,203,6,0;4.3555475900099;
1,0,0,9,165,68,107,204,6,143,22,204,6,0;0.144562454060629;
1,0,0,9,165,68,107,205,6,143,22,205,6,0;32.9562848735392;
1,0,0,9,165,68,107,206,6,143,22,206,6,0;36.3333078223333;
1,0,0,9,165,68,107,207,1,143,22,207,1,0;31.2610354027054;
1,0,0,9,165,68,107,208,1,143,22,208,1,0;0.148068904876709;
1,0,0,9,165,68,107,209,1,143,22,209,1,0;112.729346427953;
1,0,0,9,165,68,107,210,1,143,22,210,1,0;49.8106414449096;
1,0,0,9,165,68,107,212,1,143,22,212,1,0;0.862318252996616;
1,0,0,9,165,68,107,214,1,143,22,214,1,0;2.37787823727565;
1,0,0,9,165,68,107,215,1,143,22,215,1,0;16.4393406605901;
1,0,0,9,165,68,107,216,1,143,22,216,1,0;0.399645502527284;
1,0,0,9,165,68,107,217,1,143,22,217,1,0;17.6187289656947;
1,0,0,9,165,68,107,218,1,143,22,218,1,0;0.605999962851406;
1,0,0,9,165,68,107,219,1,143,22,219,1,0;0.92919996561408;
1,0,0,9,165,68,107,220,1,143,22,220,1,0;0.0908999925464393;
1,0,0,9,165,68,107,221,1,143,22,221,1,0;120.323491692543;
1,0,0,9,165,68,107,222,1,143,22,222,1,0;16.46078135;
1,0,0,9,165,68,107,223,1,143,22,223,1,0;15.213495;
1,0,0,9,165,68,107,225,1,143,22,225,1,0;31.9495771;
1,0,0,9,165,68,107,228,1,143,22,228,1,0;6.3602186;
1,0,0,9,165,68,107,229,1,143,22,229,1,0;103.9176179;
1,0,0,9,165,68,107,230,1,143,22,230,1,0;2.80179;
1,0,0,9,165,68,107,231,1,143,22,231,1,0;49.1932068;
1,0,0,9,165,68,107,232,1,143,22,232,1,0;3.7523574;
1,0,0,9,165,68,107,237,1,143,22,237,1,0;0.040956772;
1,0,0,9,165,68,107,238,1,143,22,238,1,0;2.25182;
1,0,0,9,165,68,107,239,1,143,22,239,1,0;4.8433;
1,0,0,9,165,68,107,240,1,143,22,240,1,0;0.888;
1,0,0,9,165,68,107,241,1,143,22,241,1,0;18.56475;
1,0,0,9,165,68,107,242,1,143,22,242,1,0;30.1509225;
1,0,0,9,165,68,107,243,1,143,22,243,1,0;3.810815;
1,0,0,9,165,68,107,244,1,143,22,244,1,0;0.243330338;
1,0,0,9,165,68,107,245,1,143,22,245,1,0;0.970233;
1,0,0,9,165,68,107,248,1,143,22,248,1,0;9.06413;
1,0,0,9,165,68,107,249,1,143,22,249,1,0;4.728652;
1,0,0,9,165,68,107,250,1,143,22,250,1,0;5.9302295;
1,0,0,9,165,68,107,251,1,143,22,251,1,0;0.002648805;
1,0,0,9,165,68,107,252,1,143,22,252,1,0;14.2688169;
1,0,0,9,165,68,107,253,1,143,22,253,1,0;0.051731845;
1,0,0,9,165,68,107,254,1,143,22,254,1,0;10.747583025;
1,0,0,9,165,68,107,256,1,143,22,256,1,0;5.855865;
1,0,0,9,165,68,107,257,1,143,22,257,1,0;0.0624266;
1,0,0,9,165,68,107,258,1,143,22,258,1,0;0.3086735;
1,0,0,9,165,68,107,261,1,143,22,261,1,0;35.589018;
1,0,0,9,165,68,107,263,1,143,22,263,1,0;0.0071294;
1,0,0,9,165,68,107,264,1,143,22,264,1,0;23.0904;
1,0,0,9,165,68,107,265,1,143,22,265,1,0;0.23996444;
1,0,0,9,165,68,107,269,1,143,22,269,1,0;2.377414;
1,0,0,9,165,68,107,278,1,143,22,278,1,0;6.38723794;
1,0,0,9,165,68,107,280,1,143,22,280,1,0;0.0273592;
1,0,0,9,165,68,107,287,1,143,22,287,1,0;0.0127181819627315;
1,0,0,9,165,68,107,288,1,143,22,288,1,0;0.00646822;
1,0,0,9,165,68,107,292,5,143,22,292,5,0;123.2;
1,0,0,9,165,68,107,295,5,143,22,295,5,0;11693.3791905222;
1,0,0,9,165,68,107,296,5,143,22,296,5,0;1274.3914031007;
1,0,0,9,165,68,107,305,7,143,22,305,7,0;54765.6179504395;
1,0,0,9,165,68,107,306,6,143,22,306,6,0;7.53593619153214;
1,0,0,9,165,68,107,307,8,143,22,307,8,0;4985.89526491659;
1,0,0,9,165,68,107,308,8,143,22,308,8,0;26515.4552137191;
1,0,0,9,165,68,107,309,8,143,22,309,8,0;8642.67009876316;
1,0,0,9,165,68,107,310,9,143,22,310,9,0;3474.40566739655;
1,0,0,9,165,68,107,311,8,143,22,311,8,0;20.0958298440857;
1,0,0,9,165,68,107,312,7,143,22,312,7,0;6856.92240789269;
1,0,0,9,165,68,107,313,9,143,22,313,9,0;566.858179010171;
1,0,0,9,165,68,107,314,7,143,22,314,7,0;28554.4866927256;
1,0,0,9,165,68,107,315,7,143,22,315,7,0;465617.52671684;
1,0,0,9,165,68,107,316,7,143,22,316,7,0;2737.42051463848;
1,0,0,9,165,68,107,317,6,143,22,317,6,0;2179.04120568237;
1,0,0,9,165,68,107,318,7,143,22,318,7,0;2723.80150710297;
1,0,0,9,165,68,107,319,4,143,22,319,4,0;24590.954423789;
1,0,0,9,165,68,107,320,7,143,22,320,7,0;1883.86701016856;
1,0,0,9,165,68,107,321,9,143,22,321,9,0;17176.2714843128;
1,0,0,9,165,68,107,322,7,143,22,322,7,0;14673.2327070457;
1,0,0,9,165,68,107,323,9,143,22,323,9,0;11.0312612911562;
1,0,0,9,165,68,107,324,7,143,22,324,7,0;2412.49489882423;
1,0,0,9,165,68,107,325,7,143,22,325,7,0;39.3801595058441;
1,0,0,9,165,68,107,326,7,143,22,326,7,0;1687.54015950584;
1,0,0,9,165,68,107,327,7,143,22,327,7,0;2370.81599807739;
1,0,0,9,165,68,107,328,7,143,22,328,7,0;2394.52415805817;
1,0,0,9,165,68,107,329,9,143,22,329,9,0;61662.052499798;
1,0,0,9,165,68,107,330,9,143,22,330,9,0;29283.2091214343;
1,0,0,9,165,68,107,331,7,143,22,331,7,0;2874.48636414003;
1,0,0,9,165,68,107,332,7,143,22,332,7,0;101005.719087285;
1,0,0,9,165,68,107,333,1,143,22,333,1,0;122.781486513242;
1,0,0,9,165,68,107,334,6,143,22,334,6,0;2580.52078229079;
1,0,0,9,165,68,107,336,7,143,22,336,7,0;773.725;
1,0,0,9,165,68,107,337,7,143,22,337,7,0;149.3645;
1,0,0,9,165,68,107,338,9,143,22,338,9,0;209.1103;
1,0,0,9,165,68,107,339,7,143,22,339,7,0;708708.443056016;
1,0,0,9,165,68,107,340,6,143,22,340,6,0;870.543689488874;
1,0,0,9,165,68,107,341,8,143,22,341,8,0;3730.90152638089;
1,0,0,9,165,68,107,342,9,143,22,342,9,0;11845.5226229233;
1,0,0,9,165,68,107,343,7,143,22,343,7,0;49836.7702016575;
1,0,0,9,165,68,107,344,7,143,22,344,7,0;119953.023930281;
1,0,0,9,165,68,107,345,7,143,22,345,7,0;148554.941267255;
1,0,0,9,165,68,107,346,7,143,22,346,7,0;25990.7299009558;
1,0,0,9,165,68,107,347,9,143,22,347,9,0;30.4548245053006;
1,0,0,9,165,68,107,348,7,143,22,348,7,0;2641.80721083475;
1,0,0,9,165,68,107,349,7,143,22,349,7,0;113897.599168634;
1,0,0,9,165,68,107,350,7,143,22,350,7,0;80318.1841128781;
1,0,0,9,165,68,107,351,7,143,22,351,7,0;2007.95460282195;
1,0,0,9,165,68,107,352,7,143,22,352,7,0;2602.9041147692;
1,0,0,9,165,68,107,353,7,143,22,353,7,0;9936.83814475565;
1,0,0,9,165,68,107,354,7,143,22,354,7,0;6395.73049557295;
1,0,0,9,165,68,107,355,4,143,22,355,4,0;45550.386040858;
1,0,0,9,165,68,107,356,7,143,22,356,7,0;2323.15751345764;
1,0,0,9,165,68,107,357,7,143,22,357,7,0;2751.039522174;
1,0,0,9,165,68,107,358,7,143,22,358,7,0;36461.8319294628;
1,0,0,9,165,68,107,359,7,143,22,359,7,0;41567.8795798003;
1,0,0,9,165,68,107,360,7,143,22,360,7,0;51479.4350926133;
1,0,0,9,165,68,107,383,1,143,22,383,1,0;6.49295963194837;
1,0,0,9,165,68,107,398,7,143,22,398,7,0;32044.7236129761;
1,0,0,9,165,68,107,399,7,143,22,399,7,0;4451.32788848877;
1,0,0,9,165,68,107,400,7,143,22,400,7,0;2316.47997093201;
1,0,0,9,165,68,107,401,7,143,22,401,7,0;18000.8633494377;
1,0,0,9,165,68,107,402,7,143,22,402,7,0;2245.17301752092;
1,0,0,9,165,68,107,409,7,143,22,409,7,0;24065.4906490332;
1,0,0,9,165,68,107,410,7,143,22,410,7,0;74368.6889934057;
1,0,0,9,165,68,107,411,7,143,22,411,7,0;9200.77605995893;
1,0,0,9,165,68,107,412,7,143,22,412,7,0;5921.97268108606;
1,0,0,9,165,68,107,413,7,143,22,413,7,0;736.259981263429;
1,0,0,9,165,68,107,414,7,143,22,414,7,0;301.921202210896;
1,0,0,9,165,68,107,415,7,143,22,415,7,0;41409.4418553254;
1,0,0,9,165,68,107,3032,5,143,22,3033,5,0;5014;
1,0,0,9,165,106,107,183,1,143,22,183,1,0;32141.9992446899;
1,0,0,9,165,106,107,197,1,143,22,197,1,0;2365.00000953674;
1,0,0,9,165,106,107,198,1,143,22,198,1,0;8413.0001068115;
1,0,0,9,165,106,107,199,1,143,22,199,1,0;19234.3621253967;
1,0,0,9,166,68,107,224,1,143,22,224,1,0;15.216435;
1,0,0,9,166,68,107,226,1,143,22,226,1,0;9.8829896;
1,0,0,9,166,68,107,227,1,143,22,227,1,0;38.0906057;
1,0,0,9,166,68,107,234,1,143,22,234,1,0;2.34395;
1,0,0,9,166,68,107,235,1,143,22,235,1,0;2.3502141;
1,0,0,9,166,68,107,236,1,143,22,236,1,0;8.8985208;
1,0,0,9,166,68,107,246,1,143,22,246,1,0;0.1412211;
1,0,0,9,166,68,107,247,1,143,22,247,1,0;1.0024635;
1,0,0,9,166,68,107,255,1,143,22,255,1,0;4.146475;
1,0,0,9,166,68,107,259,1,143,22,259,1,0;11.3232979;
1,0,0,9,166,68,107,262,1,143,22,262,1,0;1.42588;
1,0,0,9,166,68,107,267,1,143,22,267,1,0;0.33264;
1,0,0,9,166,68,107,268,1,143,22,268,1,0;0.436572;
1,0,0,9,166,68,107,275,1,143,22,275,1,0;96.73097;
1,0,0,23,165,110,107,116,4,143,22,116,4,0;1030.37437843986;
1,0,0,23,165,110,107,117,4,143,22,117,4,0;688.508624441624;
1,0,1,9,164,146,107,3036,1,145,22,3037,1,0;57441;
1,0,1,9,164,146,107,3037,1,145,22,3038,1,0;1536.5;
1,0,1,9,164,146,107,3038,1,145,22,3039,1,0;152.5;
1,0,1,9,165,68,107,150,5,143,22,150,5,0;4695.79575;
1,0,1,9,165,68,107,175,5,143,22,175,5,0;985.85796;
1,0,1,9,165,68,107,176,5,143,22,176,5,0;42.11017;
1,0,1,9,165,68,107,178,5,143,22,178,5,0;52.46888;
1,0,1,9,165,68,107,184,1,143,22,184,1,0;52;
1,0,1,9,165,68,107,185,1,143,22,185,1,0;20;
1,0,1,9,165,68,107,186,1,143,22,186,1,0;14;
1,0,1,9,165,68,107,188,1,143,22,188,1,0;254.372;
1,0,1,9,165,68,107,191,1,143,22,191,1,0;758.109;
1,0,1,9,165,68,107,191,1,144,22,191,1,0;218.193;
1,0,1,9,165,68,107,194,1,144,22,194,1,0;21.946;
1,0,1,9,165,68,107,195,1,144,22,195,1,0;69.877;
1,0,1,9,165,68,107,206,6,143,22,206,6,0;36.68;
1,0,1,9,165,68,107,215,1,143,22,215,1,0;39.638;
1,0,1,9,165,68,107,219,1,143,22,219,1,0;5.6;
1,0,1,9,165,68,107,221,1,143,22,221,1,0;58.515;
1,0,1,9,165,68,107,222,1,143,22,222,1,0;21.768;
1,0,1,9,165,68,107,222,1,144,22,222,1,0;9.028;
1,0,1,9,165,68,107,223,1,144,22,223,1,0;1.139;
1,0,1,9,165,68,107,229,1,143,22,229,1,0;39.98;
1,0,1,9,165,68,107,229,1,144,22,229,1,0;29.729;
1,0,1,9,165,68,107,230,1,143,22,230,1,0;7;
1,0,1,9,165,68,107,230,1,144,22,230,1,0;1.8;
1,0,1,9,165,68,107,232,1,143,22,232,1,0;27.6;
1,0,1,9,165,68,107,232,1,144,22,232,1,0;11.228;
1,0,1,9,165,68,107,237,1,144,22,237,1,0;0.001;
1,0,1,9,165,68,107,238,1,144,22,238,1,0;6.256;
1,0,1,9,165,68,107,239,1,143,22,239,1,0;24.883;
1,0,1,9,165,68,107,239,1,144,22,239,1,0;14.592;
1,0,1,9,165,68,107,240,1,144,22,240,1,0;3.24;
1,0,1,9,165,68,107,241,1,143,22,241,1,0;19.88;
1,0,1,9,165,68,107,241,1,144,22,241,1,0;36.744;
1,0,1,9,165,68,107,242,1,143,22,242,1,0;59.501;
1,0,1,9,165,68,107,245,1,144,22,245,1,0;1.266;
1,0,1,9,165,68,107,249,1,143,22,249,1,0;14.4;
1,0,1,9,165,68,107,249,1,144,22,249,1,0;10.863;
1,0,1,9,165,68,107,250,1,143,22,250,1,0;34.88;
1,0,1,9,165,68,107,250,1,144,22,250,1,0;11.342;
1,0,1,9,165,68,107,253,1,144,22,253,1,0;0.009;
1,0,1,9,165,68,107,257,1,144,22,257,1,0;0.014;
1,0,1,9,165,68,107,258,1,144,22,258,1,0;0.047;
1,0,1,9,165,68,107,261,1,143,22,261,1,0;79.4;
1,0,1,9,165,68,107,261,1,144,22,261,1,0;25.512;
1,0,1,9,165,68,107,264,1,143,22,264,1,0;59.56;
1,0,1,9,165,68,107,264,1,144,22,264,1,0;0.728;
1,0,1,9,165,68,107,277,1,144,22,277,1,0;1.3;
1,0,1,9,165,68,107,278,1,143,22,278,1,0;19.98;
1,0,1,9,165,68,107,278,1,144,22,278,1,0;0.025;
1,0,1,9,165,68,107,287,1,143,22,287,1,0;0.1;
1,0,1,9,165,68,107,288,1,144,22,288,1,0;23;
1,0,1,9,165,68,107,295,5,143,22,295,5,0;944.12728;
1,0,1,9,165,68,107,296,5,143,22,296,5,0;80.59405;
1,0,1,9,165,68,107,308,8,143,22,308,8,0;30;
1,0,1,9,165,68,107,311,8,143,22,311,8,0;0.525;
1,0,1,9,165,68,107,312,7,143,22,312,7,0;5500;
1,0,1,9,165,68,107,315,7,143,22,315,7,0;465633;
1,0,1,9,165,68,107,326,7,143,22,326,7,0;400;
1,0,1,9,165,68,107,330,9,143,22,330,9,0;41400;
1,0,1,9,165,68,107,338,9,143,22,338,9,0;521700;
1,0,1,9,165,68,107,340,6,143,22,340,6,0;2000;
1,0,1,9,165,68,107,344,7,143,22,344,7,0;123460;
1,0,1,9,165,68,107,345,7,143,22,345,7,0;96000;
1,0,1,9,165,68,107,346,7,143,22,346,7,0;25500;
1,0,1,9,165,68,107,350,7,143,22,350,7,0;91700;
1,0,1,9,165,68,107,351,7,143,22,351,7,0;2000;
1,0,1,9,165,68,107,353,7,143,22,353,7,0;8000;
1,0,1,9,165,68,107,354,7,143,22,354,7,0;9000;
1,0,1,9,165,68,107,377,7,143,22,377,7,0;2000;
1,0,1,9,165,68,107,378,7,143,22,378,7,0;4000;
1,0,1,9,165,68,107,382,1,143,22,382,1,0;150;
1,0,1,9,165,68,107,1883,5,143,22,1884,5,0;3.1299;
1,0,1,9,165,68,107,2704,1,143,22,2705,1,0;360.4;
1,0,1,9,165,68,107,2731,1,143,22,2732,1,0;3.98;
1,0,1,9,165,68,107,2742,1,143,22,2743,1,0;100.18;
1,0,1,9,165,68,107,2745,1,143,22,2746,1,0;45.794;
1,0,1,9,165,68,107,2747,1,143,22,2748,1,0;8.124;
1,0,1,9,165,68,107,2749,1,143,22,2750,1,0;16.08;
1,0,1,9,165,68,107,3032,5,143,22,3033,5,0;12304.9004;
1,0,1,9,165,68,107,3042,1,143,22,3043,1,0;12.6;
1,0,1,9,165,68,107,3045,7,143,22,3046,7,0;1000;
1,0,1,9,165,68,107,3047,7,143,22,3048,7,0;10000;
1,0,1,9,165,68,107,3051,1,143,22,3052,1,0;1.5;
1,0,1,9,165,68,107,3052,6,143,22,3053,6,0;24040;
1,0,1,9,165,68,107,3053,1,143,22,3054,1,0;21.92;
1,0,1,9,165,68,107,3058,1,143,22,3059,1,0;14.8;
1,0,1,9,165,68,107,3059,1,143,22,3060,1,0;6.368;
1,0,1,9,165,68,107,3061,5,143,22,3062,5,0;2557.74456;
1,0,1,9,165,82,107,178,5,143,22,178,5,0;10.16635;
1,0,1,9,165,82,107,295,5,143,22,295,5,0;181.09562;
1,0,1,9,165,82,107,315,7,143,22,315,7,0;6120;
1,0,1,9,165,82,107,345,7,143,22,345,7,0;2349;
1,0,1,9,165,82,107,346,7,143,22,346,7,0;9960;
1,0,1,9,165,82,107,349,7,143,22,349,7,0;11796;
1,0,1,9,165,82,107,358,7,143,22,358,7,0;240;
1,0,1,9,165,82,107,360,7,143,22,360,7,0;783;
1,0,1,9,165,82,107,377,7,143,22,377,7,0;4516;
1,0,1,9,165,82,107,388,7,143,22,388,7,0;1960;
1,0,1,9,165,82,107,395,7,143,22,395,7,0;3348;
1,0,1,9,165,82,107,402,7,143,22,402,7,0;28;
1,0,1,9,165,82,107,409,7,143,22,409,7,0;9960;
1,0,1,9,165,82,107,415,7,143,22,415,7,0;1564;
1,0,1,9,165,82,107,2516,7,143,22,2517,7,0;3240;
1,0,1,9,165,82,107,2541,7,143,22,2542,7,0;56;
1,0,1,9,165,82,107,3041,6,143,22,3042,6,0;433;
1,0,1,9,165,82,107,3044,7,143,22,3045,7,0;664;
1,0,1,9,165,82,107,3054,7,143,22,3055,7,0;1116;
1,0,1,9,165,82,107,3055,7,143,22,3056,7,0;360;
1,0,1,9,165,82,107,3056,6,143,22,3057,6,0;1479;
1,0,1,9,165,82,107,3061,5,143,22,3062,5,0;2.60447;
1,0,1,9,165,106,107,183,1,143,22,183,1,0;32470;
1,0,1,9,165,106,107,189,1,143,22,189,1,0;59;
1,0,1,9,165,106,107,196,1,143,22,196,1,0;140;
1,0,1,9,165,106,107,197,1,143,22,197,1,0;2905;
1,0,1,9,165,106,107,198,1,143,22,198,1,0;6731;
1,0,1,9,165,106,107,199,1,143,22,199,1,0;19986;
1,0,1,9,165,106,107,201,1,143,22,201,1,0;289;
1,0,1,9,165,106,107,207,1,143,22,207,1,0;34;
1,0,1,9,165,106,107,209,1,143,22,209,1,0;122;
1,0,1,9,165,106,107,279,1,143,22,279,1,0;35;
1,0,1,9,165,106,107,3038,1,143,22,3039,1,0;158;
1,0,1,9,165,106,107,3046,1,143,22,3047,1,0;55019;
1,0,1,9,165,106,107,3048,1,143,22,3049,1,0;139.4;
1,0,1,9,165,106,107,3049,1,143,22,3050,1,0;303.38;
1,0,1,9,165,106,107,3050,1,143,22,3051,1,0;1164;
1,0,1,9,165,110,107,204,6,143,22,204,6,0;0.125;
1,0,1,9,165,110,107,205,6,143,22,205,6,0;38;
1,0,1,9,165,110,107,210,1,143,22,210,1,0;58.733;
1,0,1,9,165,168,107,292,5,143,22,292,5,0;77.14475;
1,0,1,9,166,68,107,224,1,144,22,224,1,0;4.826;
1,0,1,9,166,68,107,227,1,144,22,227,1,0;16.842;
1,0,1,9,166,68,107,234,1,144,22,234,1,0;1.174;
1,0,1,9,166,68,107,235,1,144,22,235,1,0;1.574;
1,0,1,9,166,68,107,236,1,144,22,236,1,0;24.907;
1,0,1,9,166,68,107,246,1,144,22,246,1,0;0.256;
1,0,1,9,166,68,107,247,1,144,22,247,1,0;0.769;
1,0,1,9,166,68,107,259,1,144,22,259,1,0;7.232;
1,0,1,9,166,68,107,275,1,143,22,275,1,0;79.888;
1,0,1,9,166,68,107,275,1,144,22,275,1,0;64.736;
1,0,1,9,166,68,107,2727,1,143,22,2728,1,0;15.2;
1,0,1,9,166,68,107,3039,1,143,22,3040,1,0;14.22;
1,0,1,9,166,68,107,3040,1,143,22,3041,1,0;5.432;
1,0,1,9,166,68,107,3057,1,143,22,3058,1,0;15.2;
1,0,1,9,167,68,107,2704,1,144,22,2705,1,0;254.395;
1,0,1,9,167,68,107,2718,1,144,22,2719,1,0;2.626;
1,0,1,9,167,68,107,2719,1,144,22,2720,1,0;0.014;
1,0,1,9,167,68,107,2720,1,144,22,2721,1,0;0.01;
1,0,1,9,167,68,107,2721,1,144,22,2722,1,0;10.397;
1,0,1,9,167,68,107,2722,1,144,22,2723,1,0;0.18;
1,0,1,9,167,68,107,2723,1,144,22,2724,1,0;0.858;
1,0,1,9,167,68,107,2724,1,144,22,2725,1,0;1.079;
1,0,1,9,167,68,107,2725,1,144,22,2726,1,0;0.104;
1,0,1,9,167,68,107,2726,1,144,22,2727,1,0;4.13;
1,0,1,9,167,68,107,2727,1,144,22,2728,1,0;20.37;
1,0,1,9,167,68,107,2728,1,144,22,2729,1,0;5.577;
1,0,1,9,167,68,107,2729,1,144,22,2730,1,0;5.707;
1,0,1,9,167,68,107,2730,1,144,22,2731,1,0;3.405;
1,0,1,9,167,68,107,2731,1,144,22,2732,1,0;1.695;
1,0,1,9,167,68,107,2732,1,144,22,2733,1,0;2.86;
1,0,1,9,167,68,107,2733,1,144,22,2734,1,0;0.845;
1,0,1,9,167,68,107,2734,1,144,22,2735,1,0;1.079;
1,0,1,9,167,68,107,2735,1,144,22,2736,1,0;1.087;
1,0,1,9,167,68,107,2736,1,144,22,2737,1,0;0.546;
1,0,1,9,167,68,107,2737,1,144,22,2738,1,0;0.896;
1,0,1,9,167,68,107,2738,1,144,22,2739,1,0;0.18;
1,0,1,9,167,68,107,2739,1,144,22,2740,1,0;2.542;
1,0,1,9,167,68,107,2740,1,144,22,2741,1,0;2.084;
1,0,1,9,167,68,107,2741,1,144,22,2742,1,0;0.432;
1,0,1,9,167,68,107,2742,1,144,22,2743,1,0;16.023;
1,0,1,9,167,68,107,2743,1,144,22,2744,1,0;0.432;
1,0,1,9,167,68,107,2744,1,144,22,2745,1,0;3.773;
1,0,1,9,167,68,107,2745,1,144,22,2746,1,0;22.433;
1,0,1,9,167,68,107,2746,1,144,22,2747,1,0;1.924;
1,0,1,9,167,68,107,2747,1,144,22,2748,1,0;1.334;
1,0,1,9,167,68,107,2748,1,144,22,2749,1,0;6.744;
1,0,1,9,167,68,107,2749,1,144,22,2750,1,0;8.556;
1,0,1,9,167,68,107,2751,1,144,22,2752,1,0;2.791;
1,0,1,9,167,68,107,2752,1,144,22,2753,1,0;0.679;
1,0,1,9,167,68,107,2753,1,144,22,2754,1,0;6.616;
1,0,1,9,167,68,107,2754,1,144,22,2755,1,0;5.729;
1,0,1,9,167,68,107,2755,1,144,22,2756,1,0;12.608;
1,0,1,9,167,68,107,2756,1,144,22,2757,1,0;0.579;
1,0,1,17,165,68,107,312,7,144,22,312,7,0;3244;
1,0,1,17,165,68,107,313,9,144,22,313,9,0;1250.158;
1,0,1,17,165,68,107,315,7,144,22,315,7,0;502358;
1,0,1,17,165,68,107,326,7,144,22,326,7,0;74;
1,0,1,17,165,68,107,344,7,144,22,344,7,0;106167;
1,0,1,17,165,68,107,345,7,144,22,345,7,0;82864;
1,0,1,17,165,68,107,350,7,144,22,350,7,0;66080;
1,0,1,17,165,68,107,351,7,144,22,351,7,0;6896.3;
1,0,1,17,165,68,107,353,7,144,22,353,7,0;3468;
1,0,1,17,165,68,107,358,7,144,22,358,7,0;10415;
1,0,1,17,165,68,107,378,7,144,22,378,7,0;28276;
1,0,1,17,165,68,107,410,7,144,22,410,7,0;45344;
1,0,1,17,165,68,107,411,7,144,22,411,7,0;1734;
1,0,1,17,165,68,107,414,7,144,22,414,7,0;237;
1,0,1,17,165,68,107,429,7,144,22,429,7,0;22444;
1,0,1,17,167,68,107,395,7,144,22,395,7,0;51220;
1,0,1,17,167,68,107,2515,7,144,22,2516,7,0;3095;
1,0,1,17,167,68,107,2516,7,144,22,2517,7,0;377352;
1,0,1,17,167,68,107,2517,7,144,22,2518,7,0;315898;
1,0,1,17,167,68,107,2518,7,144,22,2519,7,0;8318;
1,0,1,17,167,68,107,2519,9,144,22,2520,9,0;13355.5;
1,0,1,17,167,68,107,2520,9,144,22,2521,9,0;64187.11;
1,0,1,17,167,68,107,2521,7,144,22,2522,7,0;2366;
1,0,1,17,167,68,107,2522,7,144,22,2523,7,0;1118.15;
1,0,1,17,167,68,107,2523,7,144,22,2524,7,0;46890;
1,0,1,17,167,68,107,2524,9,144,22,2525,9,0;191.43;
1,0,1,17,167,68,107,2525,7,144,22,2526,7,0;79962;
1,0,1,17,167,68,107,2526,7,144,22,2527,7,0;13471;
1,0,1,17,167,68,107,2527,7,144,22,2528,7,0;13445;
1,0,1,17,167,68,107,2528,7,144,22,2529,7,0;3268;
1,0,1,17,167,68,107,2529,7,144,22,2530,7,0;437;
1,0,1,17,167,68,107,2531,7,144,22,2532,7,0;1631;
1,0,1,17,167,68,107,2532,7,144,22,2533,7,0;19156;
1,0,1,17,167,68,107,2533,7,144,22,2534,7,0;593;
1,0,1,17,167,68,107,2534,7,144,22,2535,7,0;6349;
1,0,1,17,167,68,107,2535,7,144,22,2536,7,0;13814;
1,0,1,17,167,68,107,2536,7,144,22,2537,7,0;1396;
1,0,1,17,167,68,107,2537,7,144,22,2538,7,0;1396;
1,0,1,17,167,68,107,2538,7,144,22,2539,7,0;8735;
1,0,1,17,167,68,107,2539,7,144,22,2540,7,0;71;
1,0,1,17,167,68,107,2540,7,144,22,2541,7,0;72;
1,0,1,17,167,68,107,2541,7,144,22,2542,7,0;3342;
1,0,1,17,167,68,107,2542,7,144,22,2543,7,0;244;
1,0,1,17,167,68,107,2695,6,144,22,2696,6,0;195.21;
1,0,1,23,165,110,107,116,4,143,22,116,4,0;608;
1,0,1,23,165,110,107,3043,1,143,22,3044,1,0;1574;
1,0,1,30,162,56,107,1889,1,144,25,1890,1,0;1573.936;
1,0,1,30,162,56,107,1891,1,144,25,1892,1,0;1410.565;
1,0,1,30,162,56,107,1892,1,144,25,1893,1,0;385.928;
1,0,1,30,162,56,107,1936,1,144,25,1937,1,0;159.883;
1,0,1,30,162,56,107,2775,1,144,25,2776,1,0;22.9;
1,0,1,30,163,132,107,284,1,144,22,284,1,0;0.53;
1,0,1,30,163,132,107,285,1,144,22,285,1,0;0.478;
1,0,1,30,163,132,107,627,1,144,22,627,1,0;44.233;
1,0,1,30,163,132,107,629,1,144,22,629,1,0;108.676;
1,0,1,30,163,132,107,2774,1,144,22,2775,1,0;3.799;
1,0,1,30,164,167,107,3036,1,145,22,3037,1,0;57441;
1,0,1,30,164,167,107,3037,1,145,22,3038,1,0;1536.5;
1,0,1,30,164,167,107,3038,1,145,22,3039,1,0;152.5;
# Description of data: 
# PATH;VALUE 
[STRING]
# 
# PALO CUBE DATA END
