# PALO CUBE DATA
# 
# Description of data: 
# TIME_STAMP;SIZE_DIMENSIONS;
[CUBE]
1477944491.350779;5,7,33,30,44,82,70,167,146,2741,18,167,144,2737,17,5;
# Description of data: 
# PATH;VALUE 
[NUMERIC]
0,0,0,4,9,88,219,106,107,182,11,143,22,182,1,3;855.67831570384;
0,0,0,4,9,88,219,106,107,182,11,143,22,199,1,3;855.67831570384;
0,0,0,4,9,88,219,106,107,197,11,143,22,197,1,3;855.67831570384;
0,0,0,4,9,88,219,106,107,198,11,143,22,198,1,3;855.67831570384;
0,0,0,4,9,88,219,106,107,199,11,143,22,199,1,3;855.67831570384;
0,0,0,4,9,165,219,68,107,116,11,143,22,116,4,3;5933;
0,0,0,4,9,165,219,68,107,117,11,143,22,117,4,3;1463.61872809348;
0,0,0,4,9,165,219,68,107,184,11,143,22,184,1,3;157991.684163411;
0,0,0,4,9,165,219,68,107,185,11,143,22,185,1,3;516940.520446097;
0,0,0,4,9,165,219,68,107,186,11,143,22,186,1,3;237164.8492569;
0,0,0,4,9,165,219,68,107,187,11,143,22,187,1,3;1523248.2208589;
0,0,0,4,9,165,219,68,107,188,11,143,22,188,1,3;14000;
0,0,0,4,9,165,219,68,107,189,11,143,22,189,1,3;2966.10169491525;
0,0,0,4,9,165,219,68,107,191,11,143,22,191,1,3;62402.1669545384;
0,0,0,4,9,165,219,68,107,192,11,143,22,192,1,3;90177.9690449226;
0,0,0,4,9,165,219,68,107,193,11,143,22,193,1,3;45251.7;
0,0,0,4,9,165,219,68,107,194,11,143,22,194,1,3;80786.5885893745;
0,0,0,4,9,165,219,68,107,195,11,143,22,195,1,3;84954.6452933151;
0,0,0,4,9,165,219,68,107,201,11,143,22,201,1,3;8474.57627118644;
0,0,0,4,9,165,219,68,107,202,11,143,22,202,6,3;70593.23;
0,0,0,4,9,165,219,68,107,203,11,143,22,203,6,3;153370.856410256;
0,0,0,4,9,165,219,68,107,204,11,143,22,204,6,3;14467.803030303;
0,0,0,4,9,165,219,68,107,205,11,143,22,205,6,3;24817.8482477033;
0,0,0,4,9,165,219,68,107,206,11,143,22,206,6,3;135120.037513691;
0,0,0,4,9,165,219,68,107,207,11,143,22,207,1,3;31355.9322033898;
0,0,0,4,9,165,219,68,107,208,11,143,22,208,1,3;392000;
0,0,0,4,9,165,219,68,107,209,11,143,22,209,1,3;17128.4125953061;
0,0,0,4,9,165,219,68,107,210,11,143,22,210,1,3;16437.0307017544;
0,0,0,4,9,165,219,68,107,212,11,143,22,212,1,3;70554.9903660886;
0,0,0,4,9,165,219,68,107,214,11,143,22,214,1,3;439140.996697688;
0,0,0,4,9,165,219,68,107,215,11,143,22,215,1,3;89500.7318632151;
0,0,0,4,9,165,219,68,107,216,11,143,22,216,1,3;155953.45;
0,0,0,4,9,165,219,68,107,217,11,143,22,217,1,3;163743.660205245;
0,0,0,4,9,165,219,68,107,218,11,143,22,218,1,3;458352.901618929;
0,0,0,4,9,165,219,68,107,219,11,143,22,219,1,3;743989.321086262;
0,0,0,4,9,165,219,68,107,220,11,143,22,220,1,3;499211.472868217;
0,0,0,4,9,165,219,68,107,221,11,143,22,221,1,3;207368.493621984;
0,0,0,4,9,165,219,68,107,222,11,143,22,222,1,3;797295.274844721;
0,0,0,4,9,165,219,68,107,223,11,143,22,223,1,3;204232.39893617;
0,0,0,4,9,165,219,68,107,225,11,143,22,225,1,3;133149.454189022;
0,0,0,4,9,165,219,68,107,228,11,143,22,228,1,3;365746.253814853;
0,0,0,4,9,165,219,68,107,229,11,143,22,229,1,3;208313.375972374;
0,0,0,4,9,165,219,68,107,230,11,143,22,230,1,3;299663.47189419;
0,0,0,4,9,165,219,68,107,231,11,143,22,231,1,3;196828.414758684;
0,0,0,4,9,165,219,68,107,232,11,143,22,232,1,3;365746.253814853;
0,0,0,4,9,165,219,68,107,237,11,143,22,237,1,3;457255.384615385;
0,0,0,4,9,165,219,68,107,238,11,143,22,238,1,3;277345.503608409;
0,0,0,4,9,165,219,68,107,239,11,143,22,239,1,3;227281.185423552;
0,0,0,4,9,165,219,68,107,240,11,143,22,240,1,3;235814.691400832;
0,0,0,4,9,165,219,68,107,241,11,143,22,241,1,3;232696.883990958;
0,0,0,4,9,165,219,68,107,242,11,143,22,242,1,3;149328.308177044;
0,0,0,4,9,165,219,68,107,243,11,143,22,243,1,3;142000;
0,0,0,4,9,165,219,68,107,244,11,143,22,244,1,3;214101.03960396;
0,0,0,4,9,165,219,68,107,245,11,143,22,245,1,3;432412.400793651;
0,0,0,4,9,165,219,68,107,248,11,143,22,248,1,3;510713.701252236;
0,0,0,4,9,165,219,68,107,249,11,143,22,249,1,3;155234.018384767;
0,0,0,4,9,165,219,68,107,250,11,143,22,250,1,3;455293.468960359;
0,0,0,4,9,165,219,68,107,251,11,143,22,251,1,3;708246.666666667;
0,0,0,4,9,165,219,68,107,252,11,143,22,252,1,3;368162.685977617;
0,0,0,4,9,165,219,68,107,253,11,143,22,253,1,3;137901.379310345;
0,0,0,4,9,165,219,68,107,254,11,143,22,254,1,3;182442.450150489;
0,0,0,4,9,165,219,68,107,256,11,143,22,256,1,3;303668.714107366;
0,0,0,4,9,165,219,68,107,257,11,143,22,257,1,3;841111.333333333;
0,0,0,4,9,165,219,68,107,258,11,143,22,258,1,3;905424.078431373;
0,0,0,4,9,165,219,68,107,261,11,143,22,261,1,3;321806.431425458;
0,0,0,4,9,165,219,68,107,263,11,143,22,263,1,3;1315586.36363636;
0,0,0,4,9,165,219,68,107,264,11,143,22,264,1,3;147785;
0,0,0,4,9,165,219,68,107,265,11,143,22,265,1,3;1374673.83333333;
0,0,0,4,9,165,219,68,107,269,11,143,22,269,1,3;226217.494348154;
0,0,0,4,9,165,219,68,107,278,11,143,22,278,1,3;102858.992418416;
0,0,0,4,9,165,219,68,107,280,11,143,22,280,1,3;143900;
0,0,0,4,9,165,219,68,107,287,11,143,22,287,1,3;3810341.76470588;
0,0,0,4,9,165,219,68,107,288,11,143,22,288,1,3;570693.333333333;
0,0,0,4,9,165,219,68,107,305,11,143,22,305,7,3;22.6997613240178;
0,0,0,4,9,165,219,68,107,306,11,143,22,306,6,3;66.5003103662321;
0,0,0,4,9,165,219,68,107,307,11,143,22,307,8,3;9929.15925925926;
0,0,0,4,9,165,219,68,107,308,11,143,22,308,8,3;5625.46096941592;
0,0,0,4,9,165,219,68,107,309,11,143,22,309,8,3;3661.96470588235;
0,0,0,4,9,165,219,68,107,310,11,143,22,310,9,3;0.53;
0,0,0,4,9,165,219,68,107,311,11,143,22,311,8,3;77236.5993265993;
0,0,0,4,9,165,219,68,107,312,11,143,22,312,7,3;145;
0,0,0,4,9,165,219,68,107,313,11,143,22,313,9,3;1.14800001407763;
0,0,0,4,9,165,219,68,107,314,11,143,22,314,7,3;2.39401702896827;
0,0,0,4,9,165,219,68,107,315,11,143,22,315,7,3;1.14716961279461;
0,0,0,4,9,165,219,68,107,316,11,143,22,316,7,3;0.37;
0,0,0,4,9,165,219,68,107,317,11,143,22,317,6,3;68.22;
0,0,0,4,9,165,219,68,107,318,11,143,22,318,7,3;2.34;
0,0,0,4,9,165,219,68,107,319,11,143,22,319,4,3;2.85;
0,0,0,4,9,165,219,68,107,320,11,143,22,320,7,3;115;
0,0,0,4,9,165,219,68,107,321,11,143,22,321,9,3;1.99433801946547;
0,0,0,4,9,165,219,68,107,322,11,143,22,322,7,3;23.34;
0,0,0,4,9,165,219,68,107,323,11,143,22,323,9,3;0.575001271294177;
0,0,0,4,9,165,219,68,107,324,11,143,22,324,7,3;0.308739717522893;
0,0,0,4,9,165,219,68,107,325,11,143,22,325,7,3;23.34;
0,0,0,4,9,165,219,68,107,326,11,143,22,326,7,3;265;
0,0,0,4,9,165,219,68,107,327,11,143,22,327,7,3;433.71;
0,0,0,4,9,165,219,68,107,328,11,143,22,328,7,3;7.99049824561403;
0,0,0,4,9,165,219,68,107,329,11,143,22,329,9,3;7.97734777936963;
0,0,0,4,9,165,219,68,107,330,11,143,22,330,9,3;17.3;
0,0,0,4,9,165,219,68,107,331,11,143,22,331,7,3;5.16;
0,0,0,4,9,165,219,68,107,332,11,143,22,332,7,3;4.38586737844769;
0,0,0,4,9,165,219,68,107,333,11,143,22,333,1,3;86961.2124600143;
0,0,0,4,9,165,219,68,107,334,11,143,22,334,6,3;323.343253333333;
0,0,0,4,9,165,219,68,107,336,11,143,22,336,7,3;23.776;
0,0,0,4,9,165,219,68,107,337,11,143,22,337,7,3;20.15;
0,0,0,4,9,165,219,68,107,338,11,143,22,338,9,3;0.457998822836963;
0,0,0,4,9,165,219,68,107,339,11,143,22,339,7,3;0.972695253052144;
0,0,0,4,9,165,219,68,107,340,11,143,22,340,6,3;334.921085714286;
0,0,0,4,9,165,219,68,107,341,11,143,22,341,8,3;12260.0035087719;
0,0,0,4,9,165,219,68,107,342,11,143,22,342,9,3;2.38224669603524;
0,0,0,4,9,165,219,68,107,343,11,143,22,343,7,3;0.583133333333333;
0,0,0,4,9,165,219,68,107,344,11,143,22,344,7,3;7.05276156138003;
0,0,0,4,9,165,219,68,107,345,11,143,22,345,7,3;9.0117626857091;
0,0,0,4,9,165,219,68,107,346,11,143,22,346,7,3;18.6367918905976;
0,0,0,4,9,165,219,68,107,347,11,143,22,347,9,3;0.802742;
0,0,0,4,9,165,219,68,107,348,11,143,22,348,7,3;16.26;
0,0,0,4,9,165,219,68,107,349,11,143,22,349,7,3;23.7676051734663;
0,0,0,4,9,165,219,68,107,350,11,143,22,350,7,3;13.9182221458785;
0,0,0,4,9,165,219,68,107,351,11,143,22,351,7,3;297;
0,0,0,4,9,165,219,68,107,352,11,143,22,352,7,3;24.28;
0,0,0,4,9,165,219,68,107,353,11,143,22,353,7,3;15.4752547849863;
0,0,0,4,9,165,219,68,107,354,11,143,22,354,7,3;16.8699660945115;
0,0,0,4,9,165,219,68,107,355,11,143,22,355,4,3;2.85;
0,0,0,4,9,165,219,68,107,356,11,143,22,356,7,3;20.67;
0,0,0,4,9,165,219,68,107,357,11,143,22,357,7,3;26.4155723905724;
0,0,0,4,9,165,219,68,107,358,11,143,22,358,7,3;23.34;
0,0,0,4,9,165,219,68,107,359,11,143,22,359,7,3;20.9476654246434;
0,0,0,4,9,165,219,68,107,360,11,143,22,360,7,3;23.29;
0,0,0,4,9,165,219,68,107,383,11,143,22,383,1,3;89830.998147767;
0,0,0,4,9,165,219,68,107,398,11,143,22,367,7,3;12.05;
0,0,0,4,9,165,219,68,107,399,11,143,22,399,7,3;80.17;
0,0,0,4,9,165,219,68,107,400,11,143,22,400,7,3;168.73;
0,0,0,4,9,165,219,68,107,401,11,143,22,401,7,3;189.1;
0,0,0,4,9,165,219,68,107,402,11,143,22,402,7,3;924.015449803918;
0,0,0,4,9,165,219,68,107,409,11,143,22,409,7,3;83.64;
0,0,0,4,9,165,219,68,107,410,11,143,22,410,7,3;65.1270577690307;
0,0,0,4,9,165,219,68,107,411,11,143,22,411,7,3;217.69;
0,0,0,4,9,165,219,68,107,412,11,143,22,412,7,3;421.58;
0,0,0,4,9,165,219,68,107,413,11,143,22,413,7,3;364.4;
0,0,0,4,9,165,219,68,107,414,11,143,22,414,7,3;6250;
0,0,0,4,9,165,219,68,107,415,11,143,22,415,7,3;1030.44744367521;
0,0,0,4,9,165,219,106,107,183,11,143,22,183,1,3;855.67831570384;
0,0,0,4,9,166,219,68,107,224,11,143,22,224,1,3;207275.536270356;
0,0,0,4,9,166,219,68,107,226,11,143,22,226,1,3;316227.775419446;
0,0,0,4,9,166,219,68,107,227,11,143,22,227,1,3;202228.191168193;
0,0,0,4,9,166,219,68,107,234,11,143,22,234,1,3;688246.543647977;
0,0,0,4,9,166,219,68,107,235,11,143,22,235,1,3;245711.062459755;
0,0,0,4,9,166,219,68,107,236,11,143,22,236,1,3;185092.711121366;
0,0,0,4,9,166,219,68,107,246,11,143,22,246,1,3;283943.839416058;
0,0,0,4,9,166,219,68,107,247,11,143,22,247,1,3;343879.310797506;
0,0,0,4,9,166,219,68,107,255,11,143,22,255,1,3;251834.475553698;
0,0,0,4,9,166,219,68,107,259,11,143,22,259,1,3;288253.359413687;
0,0,0,4,9,166,219,68,107,262,11,143,22,262,1,3;380974.042651831;
0,0,0,4,9,166,219,68,107,267,11,143,22,267,1,3;148517.97752809;
0,0,0,4,9,166,219,68,107,268,11,143,22,268,1,3;327074.37900641;
0,0,0,4,9,166,219,68,107,275,11,143,22,275,1,3;198426.719812265;
0,0,0,4,24,88,219,68,107,111,11,163,203,2770,4,3;3.42;
0,0,0,4,24,88,219,68,107,112,11,163,203,2770,4,3;0.63;
0,0,0,4,24,88,219,68,107,114,11,163,203,2770,3,3;2.45761988408944;
0,0,0,4,24,88,219,68,107,115,11,163,203,2770,2,3;1161.82127732827;
0,0,0,4,24,88,219,68,107,119,11,163,203,2770,4,3;47.82;
0,1,0,3,9,167,219,68,107,191,11,144,22,191,1,3;62016.5120805503;
0,1,0,3,9,167,219,68,107,194,11,144,22,194,1,3;90984.6798349458;
0,1,0,3,9,167,219,68,107,195,11,144,22,195,1,3;83803.6712814691;
0,1,0,3,9,167,219,68,107,222,11,144,22,222,1,3;818131.464188465;
0,1,0,3,9,167,219,68,107,223,11,144,22,223,1,3;174118.593563071;
0,1,0,3,9,167,219,68,107,224,11,144,22,224,1,3;170816.454885124;
0,1,0,3,9,167,219,68,107,227,11,144,22,227,1,3;216179.980784845;
0,1,0,3,9,167,219,68,107,229,11,144,22,229,1,3;231067.988550432;
0,1,0,3,9,167,219,68,107,230,11,144,22,230,1,3;331686.902914031;
0,1,0,3,9,167,219,68,107,232,11,144,22,232,1,3;371887.249820496;
0,1,0,3,9,167,219,68,107,234,11,144,22,234,1,3;771793.748832478;
0,1,0,3,9,167,219,68,107,235,11,144,22,235,1,3;250620.351446219;
0,1,0,3,9,167,219,68,107,236,11,144,22,236,1,3;224903.527878054;
0,1,0,3,9,167,219,68,107,237,11,144,22,237,1,3;572110;
0,1,0,3,9,167,219,68,107,238,11,144,22,238,1,3;264493.701855742;
0,1,0,3,9,167,219,68,107,239,11,144,22,239,1,3;253833.507290929;
0,1,0,3,9,167,219,68,107,240,11,144,22,240,1,3;312840.774214255;
0,1,0,3,9,167,219,68,107,241,11,144,22,241,1,3;230860.929374914;
0,1,0,3,9,167,219,68,107,245,11,144,22,245,1,3;394331.09032409;
0,1,0,3,9,167,219,68,107,246,11,144,22,246,1,3;193653.111963359;
0,1,0,3,9,167,219,68,107,247,11,144,22,247,1,3;362195.445511122;
0,1,0,3,9,167,219,68,107,249,11,144,22,249,1,3;150942.874884346;
0,1,0,3,9,167,219,68,107,250,11,144,22,250,1,3;433109.323096853;
0,1,0,3,9,167,219,68,107,253,11,144,22,253,1,3;137900;
0,1,0,3,9,167,219,68,107,257,11,144,22,257,1,3;723716.979166667;
0,1,0,3,9,167,219,68,107,258,11,144,22,258,1,3;1450104.28571429;
0,1,0,3,9,167,219,68,107,259,11,144,22,259,1,3;313293.324748901;
0,1,0,3,9,167,219,68,107,261,11,144,22,261,1,3;313411.074203839;
0,1,0,3,9,167,219,68,107,264,11,144,22,264,1,3;117106.134374492;
0,1,0,3,9,167,219,68,107,271,11,144,22,271,1,3;44049.9433962264;
0,1,0,3,9,167,219,68,107,272,11,144,22,272,1,3;109204.790794979;
0,1,0,3,9,167,219,68,107,275,11,144,22,275,1,3;228850.82389481;
0,1,0,3,9,167,219,68,107,277,11,144,22,277,1,3;218510.615384615;
0,1,0,3,9,167,219,68,107,278,11,144,22,278,1,3;78660.3571428571;
0,1,0,3,9,167,219,68,107,288,11,144,22,288,1,3;785137.5;
0,1,0,3,9,167,219,68,107,973,11,144,25,973,1,3;9684.1685050974;
0,1,0,3,9,167,219,68,107,2703,11,144,25,2704,1,3;11219.529585011;
0,1,0,3,9,167,219,68,107,2704,11,144,22,2705,1,3;90288.3236647572;
0,1,0,3,9,167,219,68,107,2718,11,144,22,2719,1,3;178573.250261712;
0,1,0,3,9,167,219,68,107,2719,11,144,22,2720,1,3;750287.857142857;
0,1,0,3,9,167,219,68,107,2720,11,144,22,2721,1,3;2927845.625;
0,1,0,3,9,167,219,68,107,2721,11,144,22,2722,1,3;486476.830430193;
0,1,0,3,9,167,219,68,107,2722,11,144,22,2723,1,3;769817.666666667;
0,1,0,3,9,167,219,68,107,2723,11,144,22,2724,1,3;426432.487973356;
0,1,0,3,9,167,219,68,107,2724,11,144,22,2725,1,3;177755.579240037;
0,1,0,3,9,167,219,68,107,2725,11,144,22,2726,1,3;358697.211538462;
0,1,0,3,9,167,219,68,107,2726,11,144,22,2727,1,3;221103.535115894;
0,1,0,3,9,167,219,68,107,2727,11,144,22,2728,1,3;247879.089837997;
0,1,0,3,9,167,219,68,107,2728,11,144,22,2729,1,3;206254.907656446;
0,1,0,3,9,167,219,68,107,2729,11,144,22,2730,1,3;336296.344839671;
0,1,0,3,9,167,219,68,107,2730,11,144,22,2731,1,3;186620.524780029;
0,1,0,3,9,167,219,68,107,2731,11,144,22,2732,1,3;457175.174039618;
0,1,0,3,9,167,219,68,107,2732,11,144,22,2733,1,3;352740.423076923;
0,1,0,3,9,167,219,68,107,2733,11,144,22,2734,1,3;387389.349112426;
0,1,0,3,9,167,219,68,107,2734,11,144,22,2735,1,3;567738.407529708;
0,1,0,3,9,167,219,68,107,2735,11,144,22,2736,1,3;734080.847385445;
0,1,0,3,9,167,219,68,107,2736,11,144,22,2737,1,3;865330.487953692;
0,1,0,3,9,167,219,68,107,2737,11,144,22,2738,1,3;355535.055803571;
0,1,0,3,9,167,219,68,107,2738,11,144,22,2739,1,3;1143229.77440782;
0,1,0,3,9,167,219,68,107,2739,11,144,22,2740,1,3;159273.131611931;
0,1,0,3,9,167,219,68,107,2740,11,144,22,2741,1,3;214316.785241138;
0,1,0,3,9,167,219,68,107,2741,11,144,22,2742,1,3;397344.791666667;
0,1,0,3,9,167,219,68,107,2742,11,144,22,2743,1,3;212652.06991867;
0,1,0,3,9,167,219,68,107,2743,11,144,22,2744,1,3;426090.046296296;
0,1,0,3,9,167,219,68,107,2744,11,144,22,2745,1,3;102627.071299723;
0,1,0,3,9,167,219,68,107,2745,11,144,22,2746,1,3;504651.060491241;
0,1,0,3,9,167,219,68,107,2746,11,144,22,2747,1,3;279987.988565489;
0,1,0,3,9,167,219,68,107,2747,11,144,22,2748,1,3;285315.539730135;
0,1,0,3,9,167,219,68,107,2748,11,144,22,2749,1,3;319462.513930067;
0,1,0,3,9,167,219,68,107,2749,11,144,22,2750,1,3;347399.627414224;
0,1,0,3,9,167,219,68,107,2750,11,144,25,2751,1,3;9467.35993500437;
0,1,0,3,9,167,219,68,107,2751,11,144,22,2752,1,3;444429.000183561;
0,1,0,3,9,167,219,68,107,2752,11,144,22,2753,1,3;365633.276791302;
0,1,0,3,9,167,219,68,107,2753,11,144,22,2754,1,3;302646.982086593;
0,1,0,3,9,167,219,68,107,2754,11,144,22,2755,1,3;65466.4645191958;
0,1,0,3,9,167,219,68,107,2755,11,144,22,2756,1,3;65584.4606877419;
0,1,0,3,9,167,219,68,107,2756,11,144,22,2757,1,3;669074.473229706;
0,1,0,3,9,167,219,68,107,2762,11,144,22,2763,1,3;43973.1865171248;
0,1,0,3,9,167,219,68,107,2764,11,144,25,2765,1,3;14208.5900096652;
0,1,0,4,9,165,219,68,107,116,11,143,22,116,4,3;5933;
0,1,0,4,9,165,219,68,107,117,11,143,22,117,4,3;1839.91;
0,1,0,4,9,165,219,68,107,183,11,143,22,183,1,3;1761.72222955061;
0,1,0,4,9,165,219,68,107,184,11,143,22,184,1,3;149713.791416738;
0,1,0,4,9,165,219,68,107,185,11,143,22,185,1,3;627399.516879601;
0,1,0,4,9,165,219,68,107,186,11,143,22,186,1,3;237271.887966805;
0,1,0,4,9,165,219,68,107,187,11,143,22,187,1,3;1644192.02290076;
0,1,0,4,9,165,219,68,107,188,11,143,22,188,1,3;14206.6869565217;
0,1,0,4,9,165,219,68,107,189,11,143,22,189,1,3;2542.99991492982;
0,1,0,4,9,165,219,68,107,191,11,143,22,191,1,3;63187.5499753208;
0,1,0,4,9,165,219,68,107,192,11,143,22,192,1,3;90177.9679144385;
0,1,0,4,9,165,219,68,107,193,11,143,22,193,1,3;45251.7030429557;
0,1,0,4,9,165,219,68,107,194,11,143,22,194,1,3;80786.5875785066;
0,1,0,4,9,165,219,68,107,195,11,143,22,195,1,3;79572.6741451058;
0,1,0,4,9,165,219,68,107,201,11,143,22,201,1,3;8516.87544483986;
0,1,0,4,9,165,219,68,107,202,11,143,22,202,6,3;70593.2296849088;
0,1,0,4,9,165,219,68,107,203,11,143,22,203,6,3;153370.855813954;
0,1,0,4,9,165,219,68,107,204,11,143,22,204,6,3;14470.2666666667;
0,1,0,4,9,165,219,68,107,205,11,143,22,205,6,3;25268.7962678937;
0,1,0,4,9,165,219,68,107,206,11,143,22,206,6,3;132843.052793439;
0,1,0,4,9,165,219,68,107,207,11,143,22,207,1,3;25424;
0,1,0,4,9,165,219,68,107,209,11,143,22,209,1,3;30907.9782340044;
0,1,0,4,9,165,219,68,107,210,11,143,22,210,1,3;16630.16;
0,1,0,4,9,165,219,68,107,212,11,143,22,212,1,3;70555;
0,1,0,4,9,165,219,68,107,214,11,143,22,214,1,3;439140.996294772;
0,1,0,4,9,165,219,68,107,215,11,143,22,215,1,3;86557.3742871954;
0,1,0,4,9,165,219,68,107,216,11,143,22,216,1,3;155953.457711443;
0,1,0,4,9,165,219,68,107,217,11,143,22,217,1,3;166565.569232934;
0,1,0,4,9,165,219,68,107,218,11,143,22,218,1,3;458352.898876405;
0,1,0,4,9,165,219,68,107,219,11,143,22,219,1,3;743989.31696905;
0,1,0,4,9,165,219,68,107,220,11,143,22,220,1,3;499211.52173913;
0,1,0,4,9,165,219,68,107,221,11,143,22,221,1,3;224713.104957736;
0,1,0,4,9,165,219,68,107,222,11,143,22,222,1,3;962544.009944948;
0,1,0,4,9,165,219,68,107,223,11,143,22,223,1,3;219799.956115245;
0,1,0,4,9,165,219,68,107,229,11,143,22,229,1,3;243760.971032346;
0,1,0,4,9,165,219,68,107,230,11,143,22,230,1,3;377006.663458454;
0,1,0,4,9,165,219,68,107,231,11,143,22,231,1,3;207687.724221778;
0,1,0,4,9,165,219,68,107,232,11,143,22,232,1,3;352621.431787944;
0,1,0,4,9,165,219,68,107,237,11,143,22,237,1,3;533824.666666667;
0,1,0,4,9,165,219,68,107,238,11,143,22,238,1,3;259573.613775065;
0,1,0,4,9,165,219,68,107,239,11,143,22,239,1,3;272755.869726129;
0,1,0,4,9,165,219,68,107,240,11,143,22,240,1,3;304979.442755826;
0,1,0,4,9,165,219,68,107,241,11,143,22,241,1,3;253622.954894926;
0,1,0,4,9,165,219,68,107,242,11,143,22,242,1,3;149098.260358821;
0,1,0,4,9,165,219,68,107,243,11,143,22,243,1,3;142000;
0,1,0,4,9,165,219,68,107,244,11,143,22,244,1,3;214410;
0,1,0,4,9,165,219,68,107,245,11,143,22,245,1,3;441140.944244604;
0,1,0,4,9,165,219,68,107,248,11,143,22,248,1,3;510713.699933614;
0,1,0,4,9,165,219,68,107,249,11,143,22,249,1,3;164174.07141471;
0,1,0,4,9,165,219,68,107,250,11,143,22,250,1,3;441487.479447805;
0,1,0,4,9,165,219,68,107,251,11,143,22,251,1,3;708246.666666667;
0,1,0,4,9,165,219,68,107,252,11,143,22,252,1,3;368162.685978107;
0,1,0,4,9,165,219,68,107,253,11,143,22,253,1,3;137901.320754717;
0,1,0,4,9,165,219,68,107,254,11,143,22,254,1,3;182442.450278441;
0,1,0,4,9,165,219,68,107,256,11,143,22,256,1,3;380917.764242207;
0,1,0,4,9,165,219,68,107,257,11,143,22,257,1,3;841111.5625;
0,1,0,4,9,165,219,68,107,258,11,143,22,258,1,3;969460.966850829;
0,1,0,4,9,165,219,68,107,261,11,143,22,261,1,3;312077.29656664;
0,1,0,4,9,165,219,68,107,263,11,143,22,263,1,3;1315587.14285714;
0,1,0,4,9,165,219,68,107,264,11,143,22,264,1,3;147785.000203293;
0,1,0,4,9,165,219,68,107,265,11,143,22,265,1,3;1374673.88111888;
0,1,0,4,9,165,219,68,107,269,11,143,22,269,1,3;213348.456692913;
0,1,0,4,9,165,219,68,107,277,11,143,22,277,1,3;121391.745454545;
0,1,0,4,9,165,219,68,107,278,11,143,22,278,1,3;86628.7463556851;
0,1,0,4,9,165,219,68,107,279,11,143,22,279,1,3;5933;
0,1,0,4,9,165,219,68,107,280,11,143,22,280,1,3;143900;
0,1,0,4,9,165,219,68,107,281,11,143,22,281,1,3;142157.771942036;
0,1,0,4,9,165,219,68,107,287,11,143,22,287,1,3;3810341;
0,1,0,4,9,165,219,68,107,288,11,143,22,288,1,3;785137.142857143;
0,1,0,4,9,165,219,68,107,305,11,143,22,305,7,3;22.0168395427584;
0,1,0,4,9,165,219,68,107,306,11,143,22,306,6,3;66.5;
0,1,0,4,9,165,219,68,107,307,11,143,22,307,8,3;10010.6735815919;
0,1,0,4,9,165,219,68,107,308,11,143,22,308,8,3;6908.319532235;
0,1,0,4,9,165,219,68,107,309,11,143,22,309,8,3;3863.5809525367;
0,1,0,4,9,165,219,68,107,310,11,143,22,310,9,3;0.53;
0,1,0,4,9,165,219,68,107,311,11,143,22,311,8,3;72136.3344453711;
0,1,0,4,9,165,219,68,107,312,11,143,22,312,7,3;145;
0,1,0,4,9,165,219,68,107,314,11,143,22,314,7,3;2.37536803738687;
0,1,0,4,9,165,219,68,107,315,11,143,22,315,7,3;1.14716935685686;
0,1,0,4,9,165,219,68,107,318,11,143,22,318,7,3;2.34;
0,1,0,4,9,165,219,68,107,319,11,143,22,319,4,3;2.85;
0,1,0,4,9,165,219,68,107,320,11,143,22,320,7,3;115;
0,1,0,4,9,165,219,68,107,321,11,143,22,321,9,3;1.99435922418871;
0,1,0,4,9,165,219,68,107,322,11,143,22,322,7,3;23.34;
0,1,0,4,9,165,219,68,107,323,11,143,22,323,9,3;0.575002514403744;
0,1,0,4,9,165,219,68,107,326,11,143,22,326,7,3;265;
0,1,0,4,9,165,219,68,107,327,11,143,22,327,7,3;464.07;
0,1,0,4,9,165,219,68,107,330,11,143,22,330,9,3;17.3;
0,1,0,4,9,165,219,68,107,334,11,143,22,334,6,3;220.767937142857;
0,1,0,4,9,165,219,68,107,338,11,143,22,338,9,3;0.458003875968992;
0,1,0,4,9,165,219,68,107,339,11,143,22,339,7,3;0.972695246041094;
0,1,0,4,9,165,219,68,107,340,11,143,22,340,6,3;333.757155555556;
0,1,0,4,9,165,219,68,107,341,11,143,22,341,8,3;12259.9871239682;
0,1,0,4,9,165,219,68,107,343,11,143,22,343,7,3;0.583133333333333;
0,1,0,4,9,165,219,68,107,344,11,143,22,344,7,3;7.48897931147946;
0,1,0,4,9,165,219,68,107,345,11,143,22,345,7,3;10.6585505449202;
0,1,0,4,9,165,219,68,107,346,11,143,22,346,7,3;17.2945004481243;
0,1,0,4,9,165,219,68,107,349,11,143,22,349,7,3;21.3221428571429;
0,1,0,4,9,165,219,68,107,350,11,143,22,350,7,3;16.1461941796609;
0,1,0,4,9,165,219,68,107,351,11,143,22,351,7,3;297;
0,1,0,4,9,165,219,68,107,352,11,143,22,352,7,3;24.28;
0,1,0,4,9,165,219,68,107,353,11,143,22,353,7,3;14.133676359072;
0,1,0,4,9,165,219,68,107,354,11,143,22,354,7,3;21.2658065291805;
0,1,0,4,9,165,219,68,107,355,11,143,22,355,4,3;2.85;
0,1,0,4,9,165,219,68,107,356,11,143,22,356,7,3;20.67;
0,1,0,4,9,165,219,68,107,358,11,143,22,358,7,3;23.5543940013633;
0,1,0,4,9,165,219,68,107,359,11,143,22,359,7,3;24.08;
0,1,0,4,9,165,219,68,107,360,11,143,22,360,7,3;24.686;
0,1,0,4,9,165,219,68,107,367,11,143,22,367,7,3;12.05;
0,1,0,4,9,165,219,68,107,368,11,143,22,368,7,3;0.296596137745148;
0,1,0,4,9,165,219,68,107,369,11,143,22,369,9,3;2.15000117126441;
0,1,0,4,9,165,219,68,107,370,11,143,22,370,9,3;5.25112849071409;
0,1,0,4,9,165,219,68,107,371,11,143,22,371,9,3;0.718236455278009;
0,1,0,4,9,165,219,68,107,372,11,143,22,372,7,3;27.66;
0,1,0,4,9,165,219,68,107,373,11,143,22,373,7,3;25.43;
0,1,0,4,9,165,219,68,107,374,11,143,22,374,7,3;20.15;
0,1,0,4,9,165,219,68,107,375,11,143,22,375,7,3;22.75;
0,1,0,4,9,165,219,68,107,376,11,143,22,376,9,3;7.95226060775463;
0,1,0,4,9,165,219,68,107,377,11,143,22,377,7,3;10.5311509872242;
0,1,0,4,9,165,219,68,107,378,11,143,22,378,7,3;2.63040595196365;
0,1,0,4,9,165,219,68,107,379,11,143,22,379,7,3;7.65977777777778;
0,1,0,4,9,165,219,68,107,380,11,143,22,380,7,3;9.22332134146341;
0,1,0,4,9,165,219,68,107,381,11,143,22,381,7,3;48.2;
0,1,0,4,9,165,219,68,107,382,11,143,22,382,1,3;87704.7004703669;
0,1,0,4,9,165,219,68,107,383,11,143,22,383,1,3;89831;
0,1,0,4,9,165,219,68,107,384,11,143,22,384,7,3;3.19798903107861;
0,1,0,4,9,165,219,68,107,385,11,143,22,385,7,3;2.4;
0,1,0,4,9,165,219,68,107,386,11,143,22,386,7,3;0.02;
0,1,0,4,9,165,219,68,107,387,11,143,22,387,7,3;15.88;
0,1,0,4,9,165,219,68,107,388,11,143,22,388,7,3;49.4838983967785;
0,1,0,4,9,165,219,68,107,389,11,143,22,389,9,3;1345.27;
0,1,0,4,9,165,219,68,107,390,11,143,22,390,7,3;18.7772158838872;
0,1,0,4,9,165,219,68,107,391,11,143,22,391,7,3;28.9355466167071;
0,1,0,4,9,165,219,68,107,392,11,143,22,392,7,3;7.63266307095904;
0,1,0,4,9,165,219,68,107,393,11,143,22,393,7,3;170.8052;
0,1,0,4,9,165,219,68,107,399,11,143,22,399,7,3;80.17;
0,1,0,4,9,165,219,68,107,400,11,143,22,400,7,3;168.73;
0,1,0,4,9,165,219,68,107,401,11,143,22,401,7,3;189.1;
0,1,0,4,9,165,219,68,107,402,11,143,22,402,7,3;1100.11;
0,1,0,4,9,165,219,68,107,409,11,143,22,409,7,3;83.64;
0,1,0,4,9,165,219,68,107,410,11,143,22,410,7,3;192.003333333333;
0,1,0,4,9,165,219,68,107,411,11,143,22,411,7,3;217.69;
0,1,0,4,9,165,219,68,107,412,11,143,22,412,7,3;402.828333333333;
0,1,0,4,9,165,219,68,107,414,11,143,22,414,7,3;6250;
0,1,0,4,9,165,219,68,107,428,11,143,22,428,7,3;6250;
0,1,0,4,9,165,219,68,107,429,11,143,22,429,7,3;1084.63312619549;
0,1,0,4,9,166,219,68,107,224,11,143,22,224,1,3;183607.569565217;
0,1,0,4,9,166,219,68,107,226,11,143,22,226,1,3;362392.636052659;
0,1,0,4,9,166,219,68,107,227,11,143,22,227,1,3;229570.105945839;
0,1,0,4,9,166,219,68,107,234,11,143,22,234,1,3;671508.111533587;
0,1,0,4,9,166,219,68,107,235,11,143,22,235,1,3;234665.146812081;
0,1,0,4,9,166,219,68,107,236,11,143,22,236,1,3;185092.711461597;
0,1,0,4,9,166,219,68,107,246,11,143,22,246,1,3;278390.344827586;
0,1,0,4,9,166,219,68,107,247,11,143,22,247,1,3;343879.310986965;
0,1,0,4,9,166,219,68,107,255,11,143,22,255,1,3;251834.474104495;
0,1,0,4,9,166,219,68,107,259,11,143,22,259,1,3;311604.738356881;
0,1,0,4,9,166,219,68,107,262,11,143,22,262,1,3;407679.743944637;
0,1,0,4,9,166,219,68,107,267,11,143,22,267,1,3;148518.011869436;
0,1,0,4,9,166,219,68,107,275,11,143,22,275,1,3;206209.323165114;
0,1,0,4,24,88,219,68,107,111,11,163,203,2770,4,3;3.42;
0,1,0,4,24,88,219,68,107,112,11,163,203,2770,4,3;0.63;
0,1,0,4,24,88,219,68,107,114,11,163,203,2770,3,3;2.5071259854719;
0,1,0,4,24,88,219,68,107,115,11,163,203,2770,2,3;1159.94914786967;
0,1,0,4,24,88,219,68,107,119,11,163,203,2770,4,3;47.82;
0,1,0,20,9,88,219,167,107,2700,11,145,120,2701,1,3;777;
0,1,0,20,9,88,219,167,107,3033,11,145,40,3034,1,3;777;
0,1,0,20,9,88,219,167,107,3034,11,145,210,3035,1,3;777;
0,1,0,20,9,164,219,167,107,3036,11,145,22,3037,1,3;2825.72;
0,1,0,20,9,164,219,167,107,3037,11,145,22,3038,1,3;6378.49;
0,1,0,20,9,164,219,167,107,3038,11,145,22,3039,1,3;6378.49;
0,1,0,22,9,167,219,68,107,312,11,144,22,312,7,3;224.675;
0,1,0,22,9,167,219,68,107,313,11,144,22,313,9,3;113.545;
0,1,0,22,9,167,219,68,107,315,11,144,22,315,7,3;5.38;
0,1,0,22,9,167,219,68,107,326,11,144,22,326,7,3;294.57;
0,1,0,22,9,167,219,68,107,344,11,144,22,344,7,3;7.28208333333333;
0,1,0,22,9,167,219,68,107,345,11,144,22,345,7,3;8.41857142857143;
0,1,0,22,9,167,219,68,107,350,11,144,22,350,7,3;6.55555555555556;
0,1,0,22,9,167,219,68,107,351,11,144,22,351,7,3;288.96;
0,1,0,22,9,167,219,68,107,353,11,144,22,353,7,3;5.85;
0,1,0,22,9,167,219,68,107,358,11,144,22,358,7,3;23.76;
0,1,0,22,9,167,219,68,107,378,11,144,22,378,7,3;5.35;
0,1,0,22,9,167,219,68,107,395,11,144,22,395,7,3;55.1933333333333;
0,1,0,22,9,167,219,68,107,410,11,144,22,410,7,3;155.79;
0,1,0,22,9,167,219,68,107,411,11,144,22,411,7,3;192.075;
0,1,0,22,9,167,219,68,107,414,11,144,22,414,7,3;5304.55;
0,1,0,22,9,167,219,68,107,429,11,144,22,429,7,3;810.266;
0,1,0,22,9,167,219,68,107,2515,11,144,22,2516,7,3;31.165;
0,1,0,22,9,167,219,68,107,2516,11,144,22,2517,7,3;21;
0,1,0,22,9,167,219,68,107,2517,11,144,22,2518,7,3;1.95;
0,1,0,22,9,167,219,68,107,2518,11,144,22,2519,7,3;16.56;
0,1,0,22,9,167,219,68,107,2519,11,144,22,2520,9,3;0.02345;
0,1,0,22,9,167,219,68,107,2520,11,144,22,2521,9,3;0.57;
0,1,0,22,9,167,219,68,107,2521,11,144,22,2522,7,3;8.36166666666667;
0,1,0,22,9,167,219,68,107,2522,11,144,22,2523,7,3;22.37;
0,1,0,22,9,167,219,68,107,2523,11,144,22,2524,7,3;28.85;
0,1,0,22,9,167,219,68,107,2524,11,144,22,2525,9,3;102.055;
0,1,0,22,9,167,219,68,107,2525,11,144,22,2526,7,3;54.0266666666667;
0,1,0,22,9,167,219,68,107,2526,11,144,22,2527,7,3;22.19;
0,1,0,22,9,167,219,68,107,2527,11,144,22,2528,7,3;8.53090909090909;
0,1,0,22,9,167,219,68,107,2528,11,144,22,2529,7,3;20.13;
0,1,0,22,9,167,219,68,107,2529,11,144,22,2530,7,3;1046.4;
0,1,0,22,9,167,219,68,107,2530,11,144,22,2531,7,3;16.11;
0,1,0,22,9,167,219,68,107,2531,11,144,22,2532,7,3;8.66;
0,1,0,22,9,167,219,68,107,2532,11,144,22,2533,7,3;6.61142857142857;
0,1,0,22,9,167,219,68,107,2533,11,144,22,2534,7,3;7.76;
0,1,0,22,9,167,219,68,107,2534,11,144,22,2535,7,3;6.31333333333333;
0,1,0,22,9,167,219,68,107,2535,11,144,22,2536,7,3;19.43;
0,1,0,22,9,167,219,68,107,2536,11,144,22,2537,7,3;6.73;
0,1,0,22,9,167,219,68,107,2537,11,144,22,2538,7,3;6.725;
0,1,0,22,9,167,219,68,107,2538,11,144,22,2539,7,3;18.36;
0,1,0,22,9,167,219,68,107,2539,11,144,22,2540,7,3;17.62;
0,1,0,22,9,167,219,68,107,2540,11,144,22,2541,7,3;363.56;
0,1,0,22,9,167,219,68,107,2541,11,144,22,2542,7,3;9.98333333333333;
0,1,0,22,9,167,219,68,107,2542,11,144,22,2543,7,3;10.72;
0,1,0,22,9,167,219,68,107,2695,11,144,22,2696,6,3;314.492;
3,0,0,4,11,88,219,106,22,182,11,143,23,910,1,3;1471.64347196525;
3,0,0,4,11,88,219,106,22,182,11,143,23,912,1,3;1471.64347196525;
3,0,0,4,11,88,219,106,22,182,11,143,23,913,1,3;1471.64347196525;
3,0,0,4,11,88,219,106,22,182,11,143,23,914,1,3;1471.64347196525;
3,0,0,4,11,88,219,106,22,182,11,143,23,916,1,3;1471.64347196525;
3,0,0,4,11,88,219,106,22,182,11,143,23,917,1,3;1471.64347196525;
3,0,0,4,11,88,219,106,22,182,11,143,23,918,1,3;1471.64347196525;
3,0,0,4,11,88,219,106,22,182,11,143,23,920,1,3;1471.64347196525;
3,0,0,4,11,88,219,106,22,182,11,143,23,921,1,3;1471.64347196525;
3,0,0,4,11,88,219,106,22,182,11,143,23,922,1,3;1471.64347196525;
3,0,0,4,11,88,219,106,22,182,11,143,23,923,1,3;1471.64347196525;
3,0,0,4,11,88,219,106,22,182,11,143,23,924,1,3;1471.64347196525;
3,0,0,4,11,88,219,106,22,182,11,143,23,926,1,3;1471.64347196525;
3,0,0,4,11,88,219,106,22,182,11,143,23,944,1,3;1471.64347196525;
3,0,0,4,11,88,219,106,22,182,11,143,23,945,1,3;1471.64347196525;
3,0,0,4,11,88,219,106,22,183,11,143,23,911,1,3;1471.64347196525;
3,0,0,4,11,88,219,106,22,183,11,143,23,915,1,3;1471.64347196525;
3,0,0,4,11,88,219,106,22,183,11,143,23,927,1,3;1471.64347196525;
3,0,0,4,11,88,219,106,22,183,11,143,25,2983,1,3;1471.64347196525;
3,1,0,4,30,88,219,144,22,182,11,143,23,910,1,3;1761.72222955061;
3,1,0,4,30,88,219,144,22,182,11,143,23,912,1,3;1761.72222955061;
3,1,0,4,30,88,219,144,22,182,11,143,23,913,1,3;1761.72222955061;
3,1,0,4,30,88,219,144,22,182,11,143,23,914,1,3;1761.72222955061;
3,1,0,4,30,88,219,144,22,182,11,143,23,916,1,3;1761.72222955061;
3,1,0,4,30,88,219,144,22,182,11,143,23,918,1,3;1761.72222955061;
3,1,0,4,30,88,219,144,22,182,11,143,23,919,1,3;1761.72222955061;
3,1,0,4,30,88,219,144,22,182,11,143,23,920,1,3;1761.72222955061;
3,1,0,4,30,88,219,144,22,182,11,143,23,921,1,3;1761.72222955061;
3,1,0,4,30,88,219,144,22,182,11,143,23,922,1,3;1761.72222955061;
3,1,0,4,30,88,219,144,22,182,11,143,23,923,1,3;1761.72222955061;
3,1,0,4,30,88,219,144,22,182,11,143,23,924,1,3;1761.72222955061;
3,1,0,4,30,88,219,144,22,182,11,143,23,925,1,3;1761.72222955061;
3,1,0,4,30,88,219,144,22,182,11,143,23,926,1,3;1761.72222955061;
3,1,0,4,30,88,219,144,22,182,11,143,23,935,1,3;1761.72222955061;
3,1,0,4,30,88,219,144,22,182,11,143,23,936,1,3;1761.72222955061;
3,1,0,4,30,88,219,144,22,182,11,143,23,937,1,3;1761.72222955061;
3,1,0,4,30,88,219,144,22,182,11,143,23,938,1,3;1761.72222955061;
3,1,0,4,30,88,219,144,22,182,11,143,23,939,1,3;1761.72222955061;
3,1,0,4,30,88,219,144,22,183,11,143,23,911,1,3;1761.72222955061;
3,1,0,4,30,88,219,144,22,183,11,143,23,915,1,3;1761.72222955061;
3,1,0,4,30,88,219,144,22,183,11,143,23,927,1,3;1761.72222955061;
# Description of data: 
# PATH;VALUE 
[STRING]
# 
# PALO CUBE DATA END
