(['/workspace/gutils/decrypt.py'],
 ['/workspace/gutils', '/workspace/gutils'],
 ['codecs'],
 ['/workspace/.pip-modules/lib/python3.8/site-packages/_pyinstaller_hooks_contrib/hooks/stdhooks',
  '/workspace/.pip-modules/lib/python3.8/site-packages/_pyinstaller_hooks_contrib/hooks/stdhooks/__pycache__',
  '/workspace/.pip-modules/lib/python3.8/site-packages/_pyinstaller_hooks_contrib/hooks/rthooks',
  '/workspace/.pip-modules/lib/python3.8/site-packages/_pyinstaller_hooks_contrib/hooks/rthooks/__pycache__',
  '/workspace/.pip-modules/lib/python3.8/site-packages/_pyinstaller_hooks_contrib/hooks'],
 {},
 [],
 [],
 False,
 False,
 False,
 '3.8.12 (default, Sep 13 2021, 03:12:02) \n[GCC 9.3.0]',
 [('pyi_rth_pkgutil',
   '/workspace/.pip-modules/lib/python3.8/site-packages/PyInstaller/hooks/rthooks/pyi_rth_pkgutil.py',
   'PYSOURCE'),
  ('pyi_rth_multiprocessing',
   '/workspace/.pip-modules/lib/python3.8/site-packages/PyInstaller/hooks/rthooks/pyi_rth_multiprocessing.py',
   'PYSOURCE'),
  ('pyi_rth_inspect',
   '/workspace/.pip-modules/lib/python3.8/site-packages/PyInstaller/hooks/rthooks/pyi_rth_inspect.py',
   'PYSOURCE'),
  ('decrypt', '/workspace/gutils/decrypt.py', 'PYSOURCE')],
 [('inspect',
   '/home/gitpod/.pyenv/versions/3.8.12/lib/python3.8/inspect.py',
   'PYMODULE'),
  ('importlib',
   '/home/gitpod/.pyenv/versions/3.8.12/lib/python3.8/importlib/__init__.py',
   'PYMODULE'),
  ('importlib._bootstrap_external',
   '/home/gitpod/.pyenv/versions/3.8.12/lib/python3.8/importlib/_bootstrap_external.py',
   'PYMODULE'),
  ('importlib.metadata',
   '/home/gitpod/.pyenv/versions/3.8.12/lib/python3.8/importlib/metadata.py',
   'PYMODULE'),
  ('importlib.abc',
   '/home/gitpod/.pyenv/versions/3.8.12/lib/python3.8/importlib/abc.py',
   'PYMODULE'),
  ('contextlib',
   '/home/gitpod/.pyenv/versions/3.8.12/lib/python3.8/contextlib.py',
   'PYMODULE'),
  ('configparser',
   '/home/gitpod/.pyenv/versions/3.8.12/lib/python3.8/configparser.py',
   'PYMODULE'),
  ('posixpath',
   '/home/gitpod/.pyenv/versions/3.8.12/lib/python3.8/posixpath.py',
   'PYMODULE'),
  ('genericpath',
   '/home/gitpod/.pyenv/versions/3.8.12/lib/python3.8/genericpath.py',
   'PYMODULE'),
  ('stat',
   '/home/gitpod/.pyenv/versions/3.8.12/lib/python3.8/stat.py',
   'PYMODULE'),
  ('zipfile',
   '/home/gitpod/.pyenv/versions/3.8.12/lib/python3.8/zipfile.py',
   'PYMODULE'),
  ('py_compile',
   '/home/gitpod/.pyenv/versions/3.8.12/lib/python3.8/py_compile.py',
   'PYMODULE'),
  ('lzma',
   '/home/gitpod/.pyenv/versions/3.8.12/lib/python3.8/lzma.py',
   'PYMODULE'),
  ('_compression',
   '/home/gitpod/.pyenv/versions/3.8.12/lib/python3.8/_compression.py',
   'PYMODULE'),
  ('bz2',
   '/home/gitpod/.pyenv/versions/3.8.12/lib/python3.8/bz2.py',
   'PYMODULE'),
  ('_strptime',
   '/home/gitpod/.pyenv/versions/3.8.12/lib/python3.8/_strptime.py',
   'PYMODULE'),
  ('datetime',
   '/home/gitpod/.pyenv/versions/3.8.12/lib/python3.8/datetime.py',
   'PYMODULE'),
  ('calendar',
   '/home/gitpod/.pyenv/versions/3.8.12/lib/python3.8/calendar.py',
   'PYMODULE'),
  ('threading',
   '/home/gitpod/.pyenv/versions/3.8.12/lib/python3.8/threading.py',
   'PYMODULE'),
  ('_threading_local',
   '/home/gitpod/.pyenv/versions/3.8.12/lib/python3.8/_threading_local.py',
   'PYMODULE'),
  ('struct',
   '/home/gitpod/.pyenv/versions/3.8.12/lib/python3.8/struct.py',
   'PYMODULE'),
  ('shutil',
   '/home/gitpod/.pyenv/versions/3.8.12/lib/python3.8/shutil.py',
   'PYMODULE'),
  ('tarfile',
   '/home/gitpod/.pyenv/versions/3.8.12/lib/python3.8/tarfile.py',
   'PYMODULE'),
  ('gzip',
   '/home/gitpod/.pyenv/versions/3.8.12/lib/python3.8/gzip.py',
   'PYMODULE'),
  ('copy',
   '/home/gitpod/.pyenv/versions/3.8.12/lib/python3.8/copy.py',
   'PYMODULE'),
  ('fnmatch',
   '/home/gitpod/.pyenv/versions/3.8.12/lib/python3.8/fnmatch.py',
   'PYMODULE'),
  ('importlib.util',
   '/home/gitpod/.pyenv/versions/3.8.12/lib/python3.8/importlib/util.py',
   'PYMODULE'),
  ('pathlib',
   '/home/gitpod/.pyenv/versions/3.8.12/lib/python3.8/pathlib.py',
   'PYMODULE'),
  ('urllib.parse',
   '/home/gitpod/.pyenv/versions/3.8.12/lib/python3.8/urllib/parse.py',
   'PYMODULE'),
  ('urllib',
   '/home/gitpod/.pyenv/versions/3.8.12/lib/python3.8/urllib/__init__.py',
   'PYMODULE'),
  ('ntpath',
   '/home/gitpod/.pyenv/versions/3.8.12/lib/python3.8/ntpath.py',
   'PYMODULE'),
  ('string',
   '/home/gitpod/.pyenv/versions/3.8.12/lib/python3.8/string.py',
   'PYMODULE'),
  ('email',
   '/home/gitpod/.pyenv/versions/3.8.12/lib/python3.8/email/__init__.py',
   'PYMODULE'),
  ('email.parser',
   '/home/gitpod/.pyenv/versions/3.8.12/lib/python3.8/email/parser.py',
   'PYMODULE'),
  ('email._policybase',
   '/home/gitpod/.pyenv/versions/3.8.12/lib/python3.8/email/_policybase.py',
   'PYMODULE'),
  ('email.utils',
   '/home/gitpod/.pyenv/versions/3.8.12/lib/python3.8/email/utils.py',
   'PYMODULE'),
  ('email._parseaddr',
   '/home/gitpod/.pyenv/versions/3.8.12/lib/python3.8/email/_parseaddr.py',
   'PYMODULE'),
  ('socket',
   '/home/gitpod/.pyenv/versions/3.8.12/lib/python3.8/socket.py',
   'PYMODULE'),
  ('selectors',
   '/home/gitpod/.pyenv/versions/3.8.12/lib/python3.8/selectors.py',
   'PYMODULE'),
  ('random',
   '/home/gitpod/.pyenv/versions/3.8.12/lib/python3.8/random.py',
   'PYMODULE'),
  ('hashlib',
   '/home/gitpod/.pyenv/versions/3.8.12/lib/python3.8/hashlib.py',
   'PYMODULE'),
  ('logging',
   '/home/gitpod/.pyenv/versions/3.8.12/lib/python3.8/logging/__init__.py',
   'PYMODULE'),
  ('pickle',
   '/home/gitpod/.pyenv/versions/3.8.12/lib/python3.8/pickle.py',
   'PYMODULE'),
  ('pprint',
   '/home/gitpod/.pyenv/versions/3.8.12/lib/python3.8/pprint.py',
   'PYMODULE'),
  ('doctest',
   '/home/gitpod/.pyenv/versions/3.8.12/lib/python3.8/doctest.py',
   'PYMODULE'),
  ('unittest',
   '/home/gitpod/.pyenv/versions/3.8.12/lib/python3.8/unittest/__init__.py',
   'PYMODULE'),
  ('unittest.signals',
   '/home/gitpod/.pyenv/versions/3.8.12/lib/python3.8/unittest/signals.py',
   'PYMODULE'),
  ('signal',
   '/home/gitpod/.pyenv/versions/3.8.12/lib/python3.8/signal.py',
   'PYMODULE'),
  ('unittest.main',
   '/home/gitpod/.pyenv/versions/3.8.12/lib/python3.8/unittest/main.py',
   'PYMODULE'),
  ('unittest.runner',
   '/home/gitpod/.pyenv/versions/3.8.12/lib/python3.8/unittest/runner.py',
   'PYMODULE'),
  ('unittest.loader',
   '/home/gitpod/.pyenv/versions/3.8.12/lib/python3.8/unittest/loader.py',
   'PYMODULE'),
  ('unittest.suite',
   '/home/gitpod/.pyenv/versions/3.8.12/lib/python3.8/unittest/suite.py',
   'PYMODULE'),
  ('unittest.case',
   '/home/gitpod/.pyenv/versions/3.8.12/lib/python3.8/unittest/case.py',
   'PYMODULE'),
  ('unittest.async_case',
   '/home/gitpod/.pyenv/versions/3.8.12/lib/python3.8/unittest/async_case.py',
   'PYMODULE'),
  ('asyncio',
   '/home/gitpod/.pyenv/versions/3.8.12/lib/python3.8/asyncio/__init__.py',
   'PYMODULE'),
  ('asyncio.unix_events',
   '/home/gitpod/.pyenv/versions/3.8.12/lib/python3.8/asyncio/unix_events.py',
   'PYMODULE'),
  ('asyncio.log',
   '/home/gitpod/.pyenv/versions/3.8.12/lib/python3.8/asyncio/log.py',
   'PYMODULE'),
  ('subprocess',
   '/home/gitpod/.pyenv/versions/3.8.12/lib/python3.8/subprocess.py',
   'PYMODULE'),
  ('asyncio.windows_events',
   '/home/gitpod/.pyenv/versions/3.8.12/lib/python3.8/asyncio/windows_events.py',
   'PYMODULE'),
  ('asyncio.windows_utils',
   '/home/gitpod/.pyenv/versions/3.8.12/lib/python3.8/asyncio/windows_utils.py',
   'PYMODULE'),
  ('tempfile',
   '/home/gitpod/.pyenv/versions/3.8.12/lib/python3.8/tempfile.py',
   'PYMODULE'),
  ('asyncio.selector_events',
   '/home/gitpod/.pyenv/versions/3.8.12/lib/python3.8/asyncio/selector_events.py',
   'PYMODULE'),
  ('ssl',
   '/home/gitpod/.pyenv/versions/3.8.12/lib/python3.8/ssl.py',
   'PYMODULE'),
  ('base64',
   '/home/gitpod/.pyenv/versions/3.8.12/lib/python3.8/base64.py',
   'PYMODULE'),
  ('getopt',
   '/home/gitpod/.pyenv/versions/3.8.12/lib/python3.8/getopt.py',
   'PYMODULE'),
  ('gettext',
   '/home/gitpod/.pyenv/versions/3.8.12/lib/python3.8/gettext.py',
   'PYMODULE'),
  ('asyncio.proactor_events',
   '/home/gitpod/.pyenv/versions/3.8.12/lib/python3.8/asyncio/proactor_events.py',
   'PYMODULE'),
  ('asyncio.base_subprocess',
   '/home/gitpod/.pyenv/versions/3.8.12/lib/python3.8/asyncio/base_subprocess.py',
   'PYMODULE'),
  ('asyncio.subprocess',
   '/home/gitpod/.pyenv/versions/3.8.12/lib/python3.8/asyncio/subprocess.py',
   'PYMODULE'),
  ('asyncio.streams',
   '/home/gitpod/.pyenv/versions/3.8.12/lib/python3.8/asyncio/streams.py',
   'PYMODULE'),
  ('asyncio.queues',
   '/home/gitpod/.pyenv/versions/3.8.12/lib/python3.8/asyncio/queues.py',
   'PYMODULE'),
  ('asyncio.runners',
   '/home/gitpod/.pyenv/versions/3.8.12/lib/python3.8/asyncio/runners.py',
   'PYMODULE'),
  ('asyncio.events',
   '/home/gitpod/.pyenv/versions/3.8.12/lib/python3.8/asyncio/events.py',
   'PYMODULE'),
  ('contextvars',
   '/home/gitpod/.pyenv/versions/3.8.12/lib/python3.8/contextvars.py',
   'PYMODULE'),
  ('asyncio.trsock',
   '/home/gitpod/.pyenv/versions/3.8.12/lib/python3.8/asyncio/trsock.py',
   'PYMODULE'),
  ('asyncio.staggered',
   '/home/gitpod/.pyenv/versions/3.8.12/lib/python3.8/asyncio/staggered.py',
   'PYMODULE'),
  ('typing',
   '/home/gitpod/.pyenv/versions/3.8.12/lib/python3.8/typing.py',
   'PYMODULE'),
  ('asyncio.tasks',
   '/home/gitpod/.pyenv/versions/3.8.12/lib/python3.8/asyncio/tasks.py',
   'PYMODULE'),
  ('concurrent.futures',
   '/home/gitpod/.pyenv/versions/3.8.12/lib/python3.8/concurrent/futures/__init__.py',
   'PYMODULE'),
  ('concurrent.futures.thread',
   '/home/gitpod/.pyenv/versions/3.8.12/lib/python3.8/concurrent/futures/thread.py',
   'PYMODULE'),
  ('queue',
   '/home/gitpod/.pyenv/versions/3.8.12/lib/python3.8/queue.py',
   'PYMODULE'),
  ('concurrent.futures.process',
   '/home/gitpod/.pyenv/versions/3.8.12/lib/python3.8/concurrent/futures/process.py',
   'PYMODULE'),
  ('multiprocessing.queues',
   '/home/gitpod/.pyenv/versions/3.8.12/lib/python3.8/multiprocessing/queues.py',
   'PYMODULE'),
  ('multiprocessing.synchronize',
   '/home/gitpod/.pyenv/versions/3.8.12/lib/python3.8/multiprocessing/synchronize.py',
   'PYMODULE'),
  ('multiprocessing.heap',
   '/home/gitpod/.pyenv/versions/3.8.12/lib/python3.8/multiprocessing/heap.py',
   'PYMODULE'),
  ('multiprocessing.resource_tracker',
   '/home/gitpod/.pyenv/versions/3.8.12/lib/python3.8/multiprocessing/resource_tracker.py',
   'PYMODULE'),
  ('multiprocessing.spawn',
   '/home/gitpod/.pyenv/versions/3.8.12/lib/python3.8/multiprocessing/spawn.py',
   'PYMODULE'),
  ('runpy',
   '/home/gitpod/.pyenv/versions/3.8.12/lib/python3.8/runpy.py',
   'PYMODULE'),
  ('pkgutil',
   '/home/gitpod/.pyenv/versions/3.8.12/lib/python3.8/pkgutil.py',
   'PYMODULE'),
  ('zipimport',
   '/home/gitpod/.pyenv/versions/3.8.12/lib/python3.8/zipimport.py',
   'PYMODULE'),
  ('multiprocessing.process',
   '/home/gitpod/.pyenv/versions/3.8.12/lib/python3.8/multiprocessing/process.py',
   'PYMODULE'),
  ('multiprocessing.util',
   '/home/gitpod/.pyenv/versions/3.8.12/lib/python3.8/multiprocessing/util.py',
   'PYMODULE'),
  ('multiprocessing.forkserver',
   '/home/gitpod/.pyenv/versions/3.8.12/lib/python3.8/multiprocessing/forkserver.py',
   'PYMODULE'),
  ('multiprocessing.context',
   '/home/gitpod/.pyenv/versions/3.8.12/lib/python3.8/multiprocessing/context.py',
   'PYMODULE'),
  ('multiprocessing.popen_spawn_win32',
   '/home/gitpod/.pyenv/versions/3.8.12/lib/python3.8/multiprocessing/popen_spawn_win32.py',
   'PYMODULE'),
  ('multiprocessing.popen_forkserver',
   '/home/gitpod/.pyenv/versions/3.8.12/lib/python3.8/multiprocessing/popen_forkserver.py',
   'PYMODULE'),
  ('multiprocessing.popen_spawn_posix',
   '/home/gitpod/.pyenv/versions/3.8.12/lib/python3.8/multiprocessing/popen_spawn_posix.py',
   'PYMODULE'),
  ('multiprocessing.popen_fork',
   '/home/gitpod/.pyenv/versions/3.8.12/lib/python3.8/multiprocessing/popen_fork.py',
   'PYMODULE'),
  ('multiprocessing.sharedctypes',
   '/home/gitpod/.pyenv/versions/3.8.12/lib/python3.8/multiprocessing/sharedctypes.py',
   'PYMODULE'),
  ('ctypes',
   '/home/gitpod/.pyenv/versions/3.8.12/lib/python3.8/ctypes/__init__.py',
   'PYMODULE'),
  ('ctypes._endian',
   '/home/gitpod/.pyenv/versions/3.8.12/lib/python3.8/ctypes/_endian.py',
   'PYMODULE'),
  ('multiprocessing.pool',
   '/home/gitpod/.pyenv/versions/3.8.12/lib/python3.8/multiprocessing/pool.py',
   'PYMODULE'),
  ('multiprocessing.dummy',
   '/home/gitpod/.pyenv/versions/3.8.12/lib/python3.8/multiprocessing/dummy/__init__.py',
   'PYMODULE'),
  ('multiprocessing.dummy.connection',
   '/home/gitpod/.pyenv/versions/3.8.12/lib/python3.8/multiprocessing/dummy/connection.py',
   'PYMODULE'),
  ('multiprocessing.managers',
   '/home/gitpod/.pyenv/versions/3.8.12/lib/python3.8/multiprocessing/managers.py',
   'PYMODULE'),
  ('multiprocessing.shared_memory',
   '/home/gitpod/.pyenv/versions/3.8.12/lib/python3.8/multiprocessing/shared_memory.py',
   'PYMODULE'),
  ('secrets',
   '/home/gitpod/.pyenv/versions/3.8.12/lib/python3.8/secrets.py',
   'PYMODULE'),
  ('hmac',
   '/home/gitpod/.pyenv/versions/3.8.12/lib/python3.8/hmac.py',
   'PYMODULE'),
  ('multiprocessing.reduction',
   '/home/gitpod/.pyenv/versions/3.8.12/lib/python3.8/multiprocessing/reduction.py',
   'PYMODULE'),
  ('multiprocessing.resource_sharer',
   '/home/gitpod/.pyenv/versions/3.8.12/lib/python3.8/multiprocessing/resource_sharer.py',
   'PYMODULE'),
  ('multiprocessing.connection',
   '/home/gitpod/.pyenv/versions/3.8.12/lib/python3.8/multiprocessing/connection.py',
   'PYMODULE'),
  ('xmlrpc.client',
   '/home/gitpod/.pyenv/versions/3.8.12/lib/python3.8/xmlrpc/client.py',
   'PYMODULE'),
  ('xmlrpc',
   '/home/gitpod/.pyenv/versions/3.8.12/lib/python3.8/xmlrpc/__init__.py',
   'PYMODULE'),
  ('xml.parsers.expat',
   '/home/gitpod/.pyenv/versions/3.8.12/lib/python3.8/xml/parsers/expat.py',
   'PYMODULE'),
  ('xml.parsers',
   '/home/gitpod/.pyenv/versions/3.8.12/lib/python3.8/xml/parsers/__init__.py',
   'PYMODULE'),
  ('xml',
   '/home/gitpod/.pyenv/versions/3.8.12/lib/python3.8/xml/__init__.py',
   'PYMODULE'),
  ('xml.sax.expatreader',
   '/home/gitpod/.pyenv/versions/3.8.12/lib/python3.8/xml/sax/expatreader.py',
   'PYMODULE'),
  ('xml.sax.saxutils',
   '/home/gitpod/.pyenv/versions/3.8.12/lib/python3.8/xml/sax/saxutils.py',
   'PYMODULE'),
  ('urllib.request',
   '/home/gitpod/.pyenv/versions/3.8.12/lib/python3.8/urllib/request.py',
   'PYMODULE'),
  ('getpass',
   '/home/gitpod/.pyenv/versions/3.8.12/lib/python3.8/getpass.py',
   'PYMODULE'),
  ('nturl2path',
   '/home/gitpod/.pyenv/versions/3.8.12/lib/python3.8/nturl2path.py',
   'PYMODULE'),
  ('ftplib',
   '/home/gitpod/.pyenv/versions/3.8.12/lib/python3.8/ftplib.py',
   'PYMODULE'),
  ('netrc',
   '/home/gitpod/.pyenv/versions/3.8.12/lib/python3.8/netrc.py',
   'PYMODULE'),
  ('shlex',
   '/home/gitpod/.pyenv/versions/3.8.12/lib/python3.8/shlex.py',
   'PYMODULE'),
  ('mimetypes',
   '/home/gitpod/.pyenv/versions/3.8.12/lib/python3.8/mimetypes.py',
   'PYMODULE'),
  ('http.cookiejar',
   '/home/gitpod/.pyenv/versions/3.8.12/lib/python3.8/http/cookiejar.py',
   'PYMODULE'),
  ('http',
   '/home/gitpod/.pyenv/versions/3.8.12/lib/python3.8/http/__init__.py',
   'PYMODULE'),
  ('urllib.response',
   '/home/gitpod/.pyenv/versions/3.8.12/lib/python3.8/urllib/response.py',
   'PYMODULE'),
  ('urllib.error',
   '/home/gitpod/.pyenv/versions/3.8.12/lib/python3.8/urllib/error.py',
   'PYMODULE'),
  ('xml.sax',
   '/home/gitpod/.pyenv/versions/3.8.12/lib/python3.8/xml/sax/__init__.py',
   'PYMODULE'),
  ('xml.sax.handler',
   '/home/gitpod/.pyenv/versions/3.8.12/lib/python3.8/xml/sax/handler.py',
   'PYMODULE'),
  ('xml.sax._exceptions',
   '/home/gitpod/.pyenv/versions/3.8.12/lib/python3.8/xml/sax/_exceptions.py',
   'PYMODULE'),
  ('xml.sax.xmlreader',
   '/home/gitpod/.pyenv/versions/3.8.12/lib/python3.8/xml/sax/xmlreader.py',
   'PYMODULE'),
  ('http.client',
   '/home/gitpod/.pyenv/versions/3.8.12/lib/python3.8/http/client.py',
   'PYMODULE'),
  ('email.message',
   '/home/gitpod/.pyenv/versions/3.8.12/lib/python3.8/email/message.py',
   'PYMODULE'),
  ('email.policy',
   '/home/gitpod/.pyenv/versions/3.8.12/lib/python3.8/email/policy.py',
   'PYMODULE'),
  ('email.contentmanager',
   '/home/gitpod/.pyenv/versions/3.8.12/lib/python3.8/email/contentmanager.py',
   'PYMODULE'),
  ('email.quoprimime',
   '/home/gitpod/.pyenv/versions/3.8.12/lib/python3.8/email/quoprimime.py',
   'PYMODULE'),
  ('email.headerregistry',
   '/home/gitpod/.pyenv/versions/3.8.12/lib/python3.8/email/headerregistry.py',
   'PYMODULE'),
  ('email.iterators',
   '/home/gitpod/.pyenv/versions/3.8.12/lib/python3.8/email/iterators.py',
   'PYMODULE'),
  ('email.generator',
   '/home/gitpod/.pyenv/versions/3.8.12/lib/python3.8/email/generator.py',
   'PYMODULE'),
  ('email._encoded_words',
   '/home/gitpod/.pyenv/versions/3.8.12/lib/python3.8/email/_encoded_words.py',
   'PYMODULE'),
  ('quopri',
   '/home/gitpod/.pyenv/versions/3.8.12/lib/python3.8/quopri.py',
   'PYMODULE'),
  ('uu', '/home/gitpod/.pyenv/versions/3.8.12/lib/python3.8/uu.py', 'PYMODULE'),
  ('optparse',
   '/home/gitpod/.pyenv/versions/3.8.12/lib/python3.8/optparse.py',
   'PYMODULE'),
  ('textwrap',
   '/home/gitpod/.pyenv/versions/3.8.12/lib/python3.8/textwrap.py',
   'PYMODULE'),
  ('decimal',
   '/home/gitpod/.pyenv/versions/3.8.12/lib/python3.8/decimal.py',
   'PYMODULE'),
  ('_pydecimal',
   '/home/gitpod/.pyenv/versions/3.8.12/lib/python3.8/_pydecimal.py',
   'PYMODULE'),
  ('numbers',
   '/home/gitpod/.pyenv/versions/3.8.12/lib/python3.8/numbers.py',
   'PYMODULE'),
  ('multiprocessing',
   '/home/gitpod/.pyenv/versions/3.8.12/lib/python3.8/multiprocessing/__init__.py',
   'PYMODULE'),
  ('concurrent.futures._base',
   '/home/gitpod/.pyenv/versions/3.8.12/lib/python3.8/concurrent/futures/_base.py',
   'PYMODULE'),
  ('concurrent',
   '/home/gitpod/.pyenv/versions/3.8.12/lib/python3.8/concurrent/__init__.py',
   'PYMODULE'),
  ('asyncio.base_tasks',
   '/home/gitpod/.pyenv/versions/3.8.12/lib/python3.8/asyncio/base_tasks.py',
   'PYMODULE'),
  ('asyncio.locks',
   '/home/gitpod/.pyenv/versions/3.8.12/lib/python3.8/asyncio/locks.py',
   'PYMODULE'),
  ('asyncio.sslproto',
   '/home/gitpod/.pyenv/versions/3.8.12/lib/python3.8/asyncio/sslproto.py',
   'PYMODULE'),
  ('asyncio.transports',
   '/home/gitpod/.pyenv/versions/3.8.12/lib/python3.8/asyncio/transports.py',
   'PYMODULE'),
  ('asyncio.base_events',
   '/home/gitpod/.pyenv/versions/3.8.12/lib/python3.8/asyncio/base_events.py',
   'PYMODULE'),
  ('asyncio.protocols',
   '/home/gitpod/.pyenv/versions/3.8.12/lib/python3.8/asyncio/protocols.py',
   'PYMODULE'),
  ('asyncio.futures',
   '/home/gitpod/.pyenv/versions/3.8.12/lib/python3.8/asyncio/futures.py',
   'PYMODULE'),
  ('asyncio.coroutines',
   '/home/gitpod/.pyenv/versions/3.8.12/lib/python3.8/asyncio/coroutines.py',
   'PYMODULE'),
  ('asyncio.base_futures',
   '/home/gitpod/.pyenv/versions/3.8.12/lib/python3.8/asyncio/base_futures.py',
   'PYMODULE'),
  ('asyncio.exceptions',
   '/home/gitpod/.pyenv/versions/3.8.12/lib/python3.8/asyncio/exceptions.py',
   'PYMODULE'),
  ('asyncio.format_helpers',
   '/home/gitpod/.pyenv/versions/3.8.12/lib/python3.8/asyncio/format_helpers.py',
   'PYMODULE'),
  ('asyncio.constants',
   '/home/gitpod/.pyenv/versions/3.8.12/lib/python3.8/asyncio/constants.py',
   'PYMODULE'),
  ('unittest.result',
   '/home/gitpod/.pyenv/versions/3.8.12/lib/python3.8/unittest/result.py',
   'PYMODULE'),
  ('unittest.util',
   '/home/gitpod/.pyenv/versions/3.8.12/lib/python3.8/unittest/util.py',
   'PYMODULE'),
  ('pdb',
   '/home/gitpod/.pyenv/versions/3.8.12/lib/python3.8/pdb.py',
   'PYMODULE'),
  ('pydoc',
   '/home/gitpod/.pyenv/versions/3.8.12/lib/python3.8/pydoc.py',
   'PYMODULE'),
  ('webbrowser',
   '/home/gitpod/.pyenv/versions/3.8.12/lib/python3.8/webbrowser.py',
   'PYMODULE'),
  ('http.server',
   '/home/gitpod/.pyenv/versions/3.8.12/lib/python3.8/http/server.py',
   'PYMODULE'),
  ('socketserver',
   '/home/gitpod/.pyenv/versions/3.8.12/lib/python3.8/socketserver.py',
   'PYMODULE'),
  ('html',
   '/home/gitpod/.pyenv/versions/3.8.12/lib/python3.8/html/__init__.py',
   'PYMODULE'),
  ('html.entities',
   '/home/gitpod/.pyenv/versions/3.8.12/lib/python3.8/html/entities.py',
   'PYMODULE'),
  ('pydoc_data.topics',
   '/home/gitpod/.pyenv/versions/3.8.12/lib/python3.8/pydoc_data/topics.py',
   'PYMODULE'),
  ('pydoc_data',
   '/home/gitpod/.pyenv/versions/3.8.12/lib/python3.8/pydoc_data/__init__.py',
   'PYMODULE'),
  ('tty',
   '/home/gitpod/.pyenv/versions/3.8.12/lib/python3.8/tty.py',
   'PYMODULE'),
  ('sysconfig',
   '/home/gitpod/.pyenv/versions/3.8.12/lib/python3.8/sysconfig.py',
   'PYMODULE'),
  ('_sysconfigdata__linux_x86_64-linux-gnu',
   '/home/gitpod/.pyenv/versions/3.8.12/lib/python3.8/_sysconfigdata__linux_x86_64-linux-gnu.py',
   'PYMODULE'),
  ('_osx_support',
   '/home/gitpod/.pyenv/versions/3.8.12/lib/python3.8/_osx_support.py',
   'PYMODULE'),
  ('distutils.log',
   '/home/gitpod/.pyenv/versions/3.8.12/lib/python3.8/distutils/log.py',
   'PYMODULE'),
  ('distutils',
   '/home/gitpod/.pyenv/versions/3.8.12/lib/python3.8/distutils/__init__.py',
   'PYMODULE'),
  ('distutils.ccompiler',
   '/home/gitpod/.pyenv/versions/3.8.12/lib/python3.8/distutils/ccompiler.py',
   'PYMODULE'),
  ('distutils.fancy_getopt',
   '/home/gitpod/.pyenv/versions/3.8.12/lib/python3.8/distutils/fancy_getopt.py',
   'PYMODULE'),
  ('distutils.debug',
   '/home/gitpod/.pyenv/versions/3.8.12/lib/python3.8/distutils/debug.py',
   'PYMODULE'),
  ('distutils.util',
   '/home/gitpod/.pyenv/versions/3.8.12/lib/python3.8/distutils/util.py',
   'PYMODULE'),
  ('distutils.filelist',
   '/home/gitpod/.pyenv/versions/3.8.12/lib/python3.8/distutils/filelist.py',
   'PYMODULE'),
  ('distutils.dep_util',
   '/home/gitpod/.pyenv/versions/3.8.12/lib/python3.8/distutils/dep_util.py',
   'PYMODULE'),
  ('distutils.dir_util',
   '/home/gitpod/.pyenv/versions/3.8.12/lib/python3.8/distutils/dir_util.py',
   'PYMODULE'),
  ('distutils.file_util',
   '/home/gitpod/.pyenv/versions/3.8.12/lib/python3.8/distutils/file_util.py',
   'PYMODULE'),
  ('distutils.spawn',
   '/home/gitpod/.pyenv/versions/3.8.12/lib/python3.8/distutils/spawn.py',
   'PYMODULE'),
  ('distutils.errors',
   '/home/gitpod/.pyenv/versions/3.8.12/lib/python3.8/distutils/errors.py',
   'PYMODULE'),
  ('distutils.sysconfig',
   '/home/gitpod/.pyenv/versions/3.8.12/lib/python3.8/distutils/sysconfig.py',
   'PYMODULE'),
  ('distutils.text_file',
   '/home/gitpod/.pyenv/versions/3.8.12/lib/python3.8/distutils/text_file.py',
   'PYMODULE'),
  ('platform',
   '/home/gitpod/.pyenv/versions/3.8.12/lib/python3.8/platform.py',
   'PYMODULE'),
  ('plistlib',
   '/home/gitpod/.pyenv/versions/3.8.12/lib/python3.8/plistlib.py',
   'PYMODULE'),
  ('glob',
   '/home/gitpod/.pyenv/versions/3.8.12/lib/python3.8/glob.py',
   'PYMODULE'),
  ('code',
   '/home/gitpod/.pyenv/versions/3.8.12/lib/python3.8/code.py',
   'PYMODULE'),
  ('codeop',
   '/home/gitpod/.pyenv/versions/3.8.12/lib/python3.8/codeop.py',
   'PYMODULE'),
  ('bdb',
   '/home/gitpod/.pyenv/versions/3.8.12/lib/python3.8/bdb.py',
   'PYMODULE'),
  ('cmd',
   '/home/gitpod/.pyenv/versions/3.8.12/lib/python3.8/cmd.py',
   'PYMODULE'),
  ('difflib',
   '/home/gitpod/.pyenv/versions/3.8.12/lib/python3.8/difflib.py',
   'PYMODULE'),
  ('__future__',
   '/home/gitpod/.pyenv/versions/3.8.12/lib/python3.8/__future__.py',
   'PYMODULE'),
  ('_compat_pickle',
   '/home/gitpod/.pyenv/versions/3.8.12/lib/python3.8/_compat_pickle.py',
   'PYMODULE'),
  ('bisect',
   '/home/gitpod/.pyenv/versions/3.8.12/lib/python3.8/bisect.py',
   'PYMODULE'),
  ('email.feedparser',
   '/home/gitpod/.pyenv/versions/3.8.12/lib/python3.8/email/feedparser.py',
   'PYMODULE'),
  ('email._header_value_parser',
   '/home/gitpod/.pyenv/versions/3.8.12/lib/python3.8/email/_header_value_parser.py',
   'PYMODULE'),
  ('email.header',
   '/home/gitpod/.pyenv/versions/3.8.12/lib/python3.8/email/header.py',
   'PYMODULE'),
  ('email.base64mime',
   '/home/gitpod/.pyenv/versions/3.8.12/lib/python3.8/email/base64mime.py',
   'PYMODULE'),
  ('email.charset',
   '/home/gitpod/.pyenv/versions/3.8.12/lib/python3.8/email/charset.py',
   'PYMODULE'),
  ('email.encoders',
   '/home/gitpod/.pyenv/versions/3.8.12/lib/python3.8/email/encoders.py',
   'PYMODULE'),
  ('email.errors',
   '/home/gitpod/.pyenv/versions/3.8.12/lib/python3.8/email/errors.py',
   'PYMODULE'),
  ('csv',
   '/home/gitpod/.pyenv/versions/3.8.12/lib/python3.8/csv.py',
   'PYMODULE'),
  ('importlib._bootstrap',
   '/home/gitpod/.pyenv/versions/3.8.12/lib/python3.8/importlib/_bootstrap.py',
   'PYMODULE'),
  ('argparse',
   '/home/gitpod/.pyenv/versions/3.8.12/lib/python3.8/argparse.py',
   'PYMODULE'),
  ('ast',
   '/home/gitpod/.pyenv/versions/3.8.12/lib/python3.8/ast.py',
   'PYMODULE'),
  ('token',
   '/home/gitpod/.pyenv/versions/3.8.12/lib/python3.8/token.py',
   'PYMODULE'),
  ('tokenize',
   '/home/gitpod/.pyenv/versions/3.8.12/lib/python3.8/tokenize.py',
   'PYMODULE'),
  ('importlib.machinery',
   '/home/gitpod/.pyenv/versions/3.8.12/lib/python3.8/importlib/machinery.py',
   'PYMODULE'),
  ('dis',
   '/home/gitpod/.pyenv/versions/3.8.12/lib/python3.8/dis.py',
   'PYMODULE'),
  ('opcode',
   '/home/gitpod/.pyenv/versions/3.8.12/lib/python3.8/opcode.py',
   'PYMODULE'),
  ('os', '/home/gitpod/.pyenv/versions/3.8.12/lib/python3.8/os.py', 'PYMODULE'),
  ('stringprep',
   '/home/gitpod/.pyenv/versions/3.8.12/lib/python3.8/stringprep.py',
   'PYMODULE'),
  ('_py_abc',
   '/home/gitpod/.pyenv/versions/3.8.12/lib/python3.8/_py_abc.py',
   'PYMODULE'),
  ('tracemalloc',
   '/home/gitpod/.pyenv/versions/3.8.12/lib/python3.8/tracemalloc.py',
   'PYMODULE')],
 [('lib-dynload/_lzma',
   '/home/gitpod/.pyenv/versions/3.8.12/lib/python3.8/lib-dynload/_lzma.cpython-38-x86_64-linux-gnu.so',
   'EXTENSION'),
  ('lib-dynload/_bz2',
   '/home/gitpod/.pyenv/versions/3.8.12/lib/python3.8/lib-dynload/_bz2.cpython-38-x86_64-linux-gnu.so',
   'EXTENSION'),
  ('lib-dynload/_datetime',
   '/home/gitpod/.pyenv/versions/3.8.12/lib/python3.8/lib-dynload/_datetime.cpython-38-x86_64-linux-gnu.so',
   'EXTENSION'),
  ('lib-dynload/math',
   '/home/gitpod/.pyenv/versions/3.8.12/lib/python3.8/lib-dynload/math.cpython-38-x86_64-linux-gnu.so',
   'EXTENSION'),
  ('lib-dynload/_struct',
   '/home/gitpod/.pyenv/versions/3.8.12/lib/python3.8/lib-dynload/_struct.cpython-38-x86_64-linux-gnu.so',
   'EXTENSION'),
  ('lib-dynload/grp',
   '/home/gitpod/.pyenv/versions/3.8.12/lib/python3.8/lib-dynload/grp.cpython-38-x86_64-linux-gnu.so',
   'EXTENSION'),
  ('lib-dynload/binascii',
   '/home/gitpod/.pyenv/versions/3.8.12/lib/python3.8/lib-dynload/binascii.cpython-38-x86_64-linux-gnu.so',
   'EXTENSION'),
  ('lib-dynload/unicodedata',
   '/home/gitpod/.pyenv/versions/3.8.12/lib/python3.8/lib-dynload/unicodedata.cpython-38-x86_64-linux-gnu.so',
   'EXTENSION'),
  ('lib-dynload/select',
   '/home/gitpod/.pyenv/versions/3.8.12/lib/python3.8/lib-dynload/select.cpython-38-x86_64-linux-gnu.so',
   'EXTENSION'),
  ('lib-dynload/_socket',
   '/home/gitpod/.pyenv/versions/3.8.12/lib/python3.8/lib-dynload/_socket.cpython-38-x86_64-linux-gnu.so',
   'EXTENSION'),
  ('lib-dynload/_random',
   '/home/gitpod/.pyenv/versions/3.8.12/lib/python3.8/lib-dynload/_random.cpython-38-x86_64-linux-gnu.so',
   'EXTENSION'),
  ('lib-dynload/_posixsubprocess',
   '/home/gitpod/.pyenv/versions/3.8.12/lib/python3.8/lib-dynload/_posixsubprocess.cpython-38-x86_64-linux-gnu.so',
   'EXTENSION'),
  ('lib-dynload/_ssl',
   '/home/gitpod/.pyenv/versions/3.8.12/lib/python3.8/lib-dynload/_ssl.cpython-38-x86_64-linux-gnu.so',
   'EXTENSION'),
  ('lib-dynload/_asyncio',
   '/home/gitpod/.pyenv/versions/3.8.12/lib/python3.8/lib-dynload/_asyncio.cpython-38-x86_64-linux-gnu.so',
   'EXTENSION'),
  ('lib-dynload/_contextvars',
   '/home/gitpod/.pyenv/versions/3.8.12/lib/python3.8/lib-dynload/_contextvars.cpython-38-x86_64-linux-gnu.so',
   'EXTENSION'),
  ('lib-dynload/_queue',
   '/home/gitpod/.pyenv/versions/3.8.12/lib/python3.8/lib-dynload/_queue.cpython-38-x86_64-linux-gnu.so',
   'EXTENSION'),
  ('lib-dynload/mmap',
   '/home/gitpod/.pyenv/versions/3.8.12/lib/python3.8/lib-dynload/mmap.cpython-38-x86_64-linux-gnu.so',
   'EXTENSION'),
  ('lib-dynload/_posixshmem',
   '/home/gitpod/.pyenv/versions/3.8.12/lib/python3.8/lib-dynload/_posixshmem.cpython-38-x86_64-linux-gnu.so',
   'EXTENSION'),
  ('lib-dynload/_ctypes',
   '/home/gitpod/.pyenv/versions/3.8.12/lib/python3.8/lib-dynload/_ctypes.cpython-38-x86_64-linux-gnu.so',
   'EXTENSION'),
  ('lib-dynload/array',
   '/home/gitpod/.pyenv/versions/3.8.12/lib/python3.8/lib-dynload/array.cpython-38-x86_64-linux-gnu.so',
   'EXTENSION'),
  ('lib-dynload/_multiprocessing',
   '/home/gitpod/.pyenv/versions/3.8.12/lib/python3.8/lib-dynload/_multiprocessing.cpython-38-x86_64-linux-gnu.so',
   'EXTENSION'),
  ('lib-dynload/pyexpat',
   '/home/gitpod/.pyenv/versions/3.8.12/lib/python3.8/lib-dynload/pyexpat.cpython-38-x86_64-linux-gnu.so',
   'EXTENSION'),
  ('lib-dynload/termios',
   '/home/gitpod/.pyenv/versions/3.8.12/lib/python3.8/lib-dynload/termios.cpython-38-x86_64-linux-gnu.so',
   'EXTENSION'),
  ('lib-dynload/_decimal',
   '/home/gitpod/.pyenv/versions/3.8.12/lib/python3.8/lib-dynload/_decimal.cpython-38-x86_64-linux-gnu.so',
   'EXTENSION'),
  ('lib-dynload/readline',
   '/home/gitpod/.pyenv/versions/3.8.12/lib/python3.8/lib-dynload/readline.cpython-38-x86_64-linux-gnu.so',
   'EXTENSION'),
  ('lib-dynload/_pickle',
   '/home/gitpod/.pyenv/versions/3.8.12/lib/python3.8/lib-dynload/_pickle.cpython-38-x86_64-linux-gnu.so',
   'EXTENSION'),
  ('lib-dynload/_hashlib',
   '/home/gitpod/.pyenv/versions/3.8.12/lib/python3.8/lib-dynload/_hashlib.cpython-38-x86_64-linux-gnu.so',
   'EXTENSION'),
  ('lib-dynload/_sha3',
   '/home/gitpod/.pyenv/versions/3.8.12/lib/python3.8/lib-dynload/_sha3.cpython-38-x86_64-linux-gnu.so',
   'EXTENSION'),
  ('lib-dynload/_blake2',
   '/home/gitpod/.pyenv/versions/3.8.12/lib/python3.8/lib-dynload/_blake2.cpython-38-x86_64-linux-gnu.so',
   'EXTENSION'),
  ('lib-dynload/_sha256',
   '/home/gitpod/.pyenv/versions/3.8.12/lib/python3.8/lib-dynload/_sha256.cpython-38-x86_64-linux-gnu.so',
   'EXTENSION'),
  ('lib-dynload/_md5',
   '/home/gitpod/.pyenv/versions/3.8.12/lib/python3.8/lib-dynload/_md5.cpython-38-x86_64-linux-gnu.so',
   'EXTENSION'),
  ('lib-dynload/_sha1',
   '/home/gitpod/.pyenv/versions/3.8.12/lib/python3.8/lib-dynload/_sha1.cpython-38-x86_64-linux-gnu.so',
   'EXTENSION'),
  ('lib-dynload/_sha512',
   '/home/gitpod/.pyenv/versions/3.8.12/lib/python3.8/lib-dynload/_sha512.cpython-38-x86_64-linux-gnu.so',
   'EXTENSION'),
  ('lib-dynload/_bisect',
   '/home/gitpod/.pyenv/versions/3.8.12/lib/python3.8/lib-dynload/_bisect.cpython-38-x86_64-linux-gnu.so',
   'EXTENSION'),
  ('lib-dynload/_csv',
   '/home/gitpod/.pyenv/versions/3.8.12/lib/python3.8/lib-dynload/_csv.cpython-38-x86_64-linux-gnu.so',
   'EXTENSION'),
  ('lib-dynload/resource',
   '/home/gitpod/.pyenv/versions/3.8.12/lib/python3.8/lib-dynload/resource.cpython-38-x86_64-linux-gnu.so',
   'EXTENSION'),
  ('lib-dynload/_opcode',
   '/home/gitpod/.pyenv/versions/3.8.12/lib/python3.8/lib-dynload/_opcode.cpython-38-x86_64-linux-gnu.so',
   'EXTENSION'),
  ('lib-dynload/_heapq',
   '/home/gitpod/.pyenv/versions/3.8.12/lib/python3.8/lib-dynload/_heapq.cpython-38-x86_64-linux-gnu.so',
   'EXTENSION'),
  ('lib-dynload/_multibytecodec',
   '/home/gitpod/.pyenv/versions/3.8.12/lib/python3.8/lib-dynload/_multibytecodec.cpython-38-x86_64-linux-gnu.so',
   'EXTENSION'),
  ('lib-dynload/_codecs_iso2022',
   '/home/gitpod/.pyenv/versions/3.8.12/lib/python3.8/lib-dynload/_codecs_iso2022.cpython-38-x86_64-linux-gnu.so',
   'EXTENSION'),
  ('lib-dynload/_codecs_jp',
   '/home/gitpod/.pyenv/versions/3.8.12/lib/python3.8/lib-dynload/_codecs_jp.cpython-38-x86_64-linux-gnu.so',
   'EXTENSION'),
  ('lib-dynload/_codecs_cn',
   '/home/gitpod/.pyenv/versions/3.8.12/lib/python3.8/lib-dynload/_codecs_cn.cpython-38-x86_64-linux-gnu.so',
   'EXTENSION'),
  ('lib-dynload/_codecs_hk',
   '/home/gitpod/.pyenv/versions/3.8.12/lib/python3.8/lib-dynload/_codecs_hk.cpython-38-x86_64-linux-gnu.so',
   'EXTENSION'),
  ('lib-dynload/_codecs_kr',
   '/home/gitpod/.pyenv/versions/3.8.12/lib/python3.8/lib-dynload/_codecs_kr.cpython-38-x86_64-linux-gnu.so',
   'EXTENSION'),
  ('lib-dynload/_codecs_tw',
   '/home/gitpod/.pyenv/versions/3.8.12/lib/python3.8/lib-dynload/_codecs_tw.cpython-38-x86_64-linux-gnu.so',
   'EXTENSION'),
  ('lib-dynload/zlib',
   '/home/gitpod/.pyenv/versions/3.8.12/lib/python3.8/lib-dynload/zlib.cpython-38-x86_64-linux-gnu.so',
   'EXTENSION'),
  ('liblzma.so.5', '/lib/x86_64-linux-gnu/liblzma.so.5', 'BINARY'),
  ('libbz2.so.1.0', '/lib/x86_64-linux-gnu/libbz2.so.1.0', 'BINARY'),
  ('libz.so.1', '/lib/x86_64-linux-gnu/libz.so.1', 'BINARY'),
  ('libcrypto.so.1.1', '/lib/x86_64-linux-gnu/libcrypto.so.1.1', 'BINARY'),
  ('libssl.so.1.1', '/lib/x86_64-linux-gnu/libssl.so.1.1', 'BINARY'),
  ('libffi.so.7', '/lib/x86_64-linux-gnu/libffi.so.7', 'BINARY'),
  ('libreadline.so.8', '/lib/x86_64-linux-gnu/libreadline.so.8', 'BINARY'),
  ('libtinfo.so.6', '/lib/x86_64-linux-gnu/libtinfo.so.6', 'BINARY'),
  ('libpython3.8.so.1.0',
   '/usr/lib/x86_64-linux-gnu/libpython3.8.so.1.0',
   'BINARY')],
 [],
 [],
 [('base_library.zip',
   '/workspace/gutils/build/decrypt/base_library.zip',
   'DATA')],
 [])
