{
  "contractName": "ERC20Basic",
  "abi": [
    {
      "anonymous": false,
      "inputs": [
        {
          "indexed": true,
          "name": "from",
          "type": "address"
        },
        {
          "indexed": true,
          "name": "to",
          "type": "address"
        },
        {
          "indexed": false,
          "name": "value",
          "type": "uint256"
        }
      ],
      "name": "Transfer",
      "type": "event"
    },
    {
      "constant": true,
      "inputs": [],
      "name": "totalSupply",
      "outputs": [
        {
          "name": "",
          "type": "uint256"
        }
      ],
      "payable": false,
      "stateMutability": "view",
      "type": "function"
    },
    {
      "constant": true,
      "inputs": [
        {
          "name": "_who",
          "type": "address"
        }
      ],
      "name": "balanceOf",
      "outputs": [
        {
          "name": "",
          "type": "uint256"
        }
      ],
      "payable": false,
      "stateMutability": "view",
      "type": "function"
    },
    {
      "constant": false,
      "inputs": [
        {
          "name": "_to",
          "type": "address"
        },
        {
          "name": "_value",
          "type": "uint256"
        }
      ],
      "name": "transfer",
      "outputs": [
        {
          "name": "",
          "type": "bool"
        }
      ],
      "payable": false,
      "stateMutability": "nonpayable",
      "type": "function"
    }
  ],
  "bytecode": "0x",
  "deployedBytecode": "0x",
  "sourceMap": "",
  "deployedSourceMap": "",
  "source": "pragma solidity ^0.4.24;\n\n\n/**\n * @title ERC20Basic\n * @dev Simpler version of ERC20 interface\n * See https://github.com/ethereum/EIPs/issues/179\n */\ncontract ERC20Basic {\n  function totalSupply() public view returns (uint256);\n  function balanceOf(address _who) public view returns (uint256);\n  function transfer(address _to, uint256 _value) public returns (bool);\n  event Transfer(address indexed from, address indexed to, uint256 value);\n}\n",
  "sourcePath": "openzeppelin-solidity\\contracts\\token\\ERC20\\ERC20Basic.sol",
  "ast": {
    "absolutePath": "openzeppelin-solidity/contracts/token/ERC20/ERC20Basic.sol",
    "exportedSymbols": {
      "ERC20Basic": [
        599
      ]
    },
    "id": 600,
    "nodeType": "SourceUnit",
    "nodes": [
      {
        "id": 569,
        "literals": [
          "solidity",
          "^",
          "0.4",
          ".24"
        ],
        "nodeType": "PragmaDirective",
        "src": "0:24:7"
      },
      {
        "baseContracts": [],
        "contractDependencies": [],
        "contractKind": "contract",
        "documentation": "@title ERC20Basic\n@dev Simpler version of ERC20 interface\nSee https://github.com/ethereum/EIPs/issues/179",
        "fullyImplemented": false,
        "id": 599,
        "linearizedBaseContracts": [
          599
        ],
        "name": "ERC20Basic",
        "nodeType": "ContractDefinition",
        "nodes": [
          {
            "body": null,
            "documentation": null,
            "id": 574,
            "implemented": false,
            "isConstructor": false,
            "isDeclaredConst": true,
            "modifiers": [],
            "name": "totalSupply",
            "nodeType": "FunctionDefinition",
            "parameters": {
              "id": 570,
              "nodeType": "ParameterList",
              "parameters": [],
              "src": "194:2:7"
            },
            "payable": false,
            "returnParameters": {
              "id": 573,
              "nodeType": "ParameterList",
              "parameters": [
                {
                  "constant": false,
                  "id": 572,
                  "name": "",
                  "nodeType": "VariableDeclaration",
                  "scope": 574,
                  "src": "218:7:7",
                  "stateVariable": false,
                  "storageLocation": "default",
                  "typeDescriptions": {
                    "typeIdentifier": "t_uint256",
                    "typeString": "uint256"
                  },
                  "typeName": {
                    "id": 571,
                    "name": "uint256",
                    "nodeType": "ElementaryTypeName",
                    "src": "218:7:7",
                    "typeDescriptions": {
                      "typeIdentifier": "t_uint256",
                      "typeString": "uint256"
                    }
                  },
                  "value": null,
                  "visibility": "internal"
                }
              ],
              "src": "217:9:7"
            },
            "scope": 599,
            "src": "174:53:7",
            "stateMutability": "view",
            "superFunction": null,
            "visibility": "public"
          },
          {
            "body": null,
            "documentation": null,
            "id": 581,
            "implemented": false,
            "isConstructor": false,
            "isDeclaredConst": true,
            "modifiers": [],
            "name": "balanceOf",
            "nodeType": "FunctionDefinition",
            "parameters": {
              "id": 577,
              "nodeType": "ParameterList",
              "parameters": [
                {
                  "constant": false,
                  "id": 576,
                  "name": "_who",
                  "nodeType": "VariableDeclaration",
                  "scope": 581,
                  "src": "249:12:7",
                  "stateVariable": false,
                  "storageLocation": "default",
                  "typeDescriptions": {
                    "typeIdentifier": "t_address",
                    "typeString": "address"
                  },
                  "typeName": {
                    "id": 575,
                    "name": "address",
                    "nodeType": "ElementaryTypeName",
                    "src": "249:7:7",
                    "typeDescriptions": {
                      "typeIdentifier": "t_address",
                      "typeString": "address"
                    }
                  },
                  "value": null,
                  "visibility": "internal"
                }
              ],
              "src": "248:14:7"
            },
            "payable": false,
            "returnParameters": {
              "id": 580,
              "nodeType": "ParameterList",
              "parameters": [
                {
                  "constant": false,
                  "id": 579,
                  "name": "",
                  "nodeType": "VariableDeclaration",
                  "scope": 581,
                  "src": "284:7:7",
                  "stateVariable": false,
                  "storageLocation": "default",
                  "typeDescriptions": {
                    "typeIdentifier": "t_uint256",
                    "typeString": "uint256"
                  },
                  "typeName": {
                    "id": 578,
                    "name": "uint256",
                    "nodeType": "ElementaryTypeName",
                    "src": "284:7:7",
                    "typeDescriptions": {
                      "typeIdentifier": "t_uint256",
                      "typeString": "uint256"
                    }
                  },
                  "value": null,
                  "visibility": "internal"
                }
              ],
              "src": "283:9:7"
            },
            "scope": 599,
            "src": "230:63:7",
            "stateMutability": "view",
            "superFunction": null,
            "visibility": "public"
          },
          {
            "body": null,
            "documentation": null,
            "id": 590,
            "implemented": false,
            "isConstructor": false,
            "isDeclaredConst": false,
            "modifiers": [],
            "name": "transfer",
            "nodeType": "FunctionDefinition",
            "parameters": {
              "id": 586,
              "nodeType": "ParameterList",
              "parameters": [
                {
                  "constant": false,
                  "id": 583,
                  "name": "_to",
                  "nodeType": "VariableDeclaration",
                  "scope": 590,
                  "src": "314:11:7",
                  "stateVariable": false,
                  "storageLocation": "default",
                  "typeDescriptions": {
                    "typeIdentifier": "t_address",
                    "typeString": "address"
                  },
                  "typeName": {
                    "id": 582,
                    "name": "address",
                    "nodeType": "ElementaryTypeName",
                    "src": "314:7:7",
                    "typeDescriptions": {
                      "typeIdentifier": "t_address",
                      "typeString": "address"
                    }
                  },
                  "value": null,
                  "visibility": "internal"
                },
                {
                  "constant": false,
                  "id": 585,
                  "name": "_value",
                  "nodeType": "VariableDeclaration",
                  "scope": 590,
                  "src": "327:14:7",
                  "stateVariable": false,
                  "storageLocation": "default",
                  "typeDescriptions": {
                    "typeIdentifier": "t_uint256",
                    "typeString": "uint256"
                  },
                  "typeName": {
                    "id": 584,
                    "name": "uint256",
                    "nodeType": "ElementaryTypeName",
                    "src": "327:7:7",
                    "typeDescriptions": {
                      "typeIdentifier": "t_uint256",
                      "typeString": "uint256"
                    }
                  },
                  "value": null,
                  "visibility": "internal"
                }
              ],
              "src": "313:29:7"
            },
            "payable": false,
            "returnParameters": {
              "id": 589,
              "nodeType": "ParameterList",
              "parameters": [
                {
                  "constant": false,
                  "id": 588,
                  "name": "",
                  "nodeType": "VariableDeclaration",
                  "scope": 590,
                  "src": "359:4:7",
                  "stateVariable": false,
                  "storageLocation": "default",
                  "typeDescriptions": {
                    "typeIdentifier": "t_bool",
                    "typeString": "bool"
                  },
                  "typeName": {
                    "id": 587,
                    "name": "bool",
                    "nodeType": "ElementaryTypeName",
                    "src": "359:4:7",
                    "typeDescriptions": {
                      "typeIdentifier": "t_bool",
                      "typeString": "bool"
                    }
                  },
                  "value": null,
                  "visibility": "internal"
                }
              ],
              "src": "358:6:7"
            },
            "scope": 599,
            "src": "296:69:7",
            "stateMutability": "nonpayable",
            "superFunction": null,
            "visibility": "public"
          },
          {
            "anonymous": false,
            "documentation": null,
            "id": 598,
            "name": "Transfer",
            "nodeType": "EventDefinition",
            "parameters": {
              "id": 597,
              "nodeType": "ParameterList",
              "parameters": [
                {
                  "constant": false,
                  "id": 592,
                  "indexed": true,
                  "name": "from",
                  "nodeType": "VariableDeclaration",
                  "scope": 598,
                  "src": "383:20:7",
                  "stateVariable": false,
                  "storageLocation": "default",
                  "typeDescriptions": {
                    "typeIdentifier": "t_address",
                    "typeString": "address"
                  },
                  "typeName": {
                    "id": 591,
                    "name": "address",
                    "nodeType": "ElementaryTypeName",
                    "src": "383:7:7",
                    "typeDescriptions": {
                      "typeIdentifier": "t_address",
                      "typeString": "address"
                    }
                  },
                  "value": null,
                  "visibility": "internal"
                },
                {
                  "constant": false,
                  "id": 594,
                  "indexed": true,
                  "name": "to",
                  "nodeType": "VariableDeclaration",
                  "scope": 598,
                  "src": "405:18:7",
                  "stateVariable": false,
                  "storageLocation": "default",
                  "typeDescriptions": {
                    "typeIdentifier": "t_address",
                    "typeString": "address"
                  },
                  "typeName": {
                    "id": 593,
                    "name": "address",
                    "nodeType": "ElementaryTypeName",
                    "src": "405:7:7",
                    "typeDescriptions": {
                      "typeIdentifier": "t_address",
                      "typeString": "address"
                    }
                  },
                  "value": null,
                  "visibility": "internal"
                },
                {
                  "constant": false,
                  "id": 596,
                  "indexed": false,
                  "name": "value",
                  "nodeType": "VariableDeclaration",
                  "scope": 598,
                  "src": "425:13:7",
                  "stateVariable": false,
                  "storageLocation": "default",
                  "typeDescriptions": {
                    "typeIdentifier": "t_uint256",
                    "typeString": "uint256"
                  },
                  "typeName": {
                    "id": 595,
                    "name": "uint256",
                    "nodeType": "ElementaryTypeName",
                    "src": "425:7:7",
                    "typeDescriptions": {
                      "typeIdentifier": "t_uint256",
                      "typeString": "uint256"
                    }
                  },
                  "value": null,
                  "visibility": "internal"
                }
              ],
              "src": "382:57:7"
            },
            "src": "368:72:7"
          }
        ],
        "scope": 600,
        "src": "150:292:7"
      }
    ],
    "src": "0:443:7"
  },
  "legacyAST": {
    "absolutePath": "openzeppelin-solidity/contracts/token/ERC20/ERC20Basic.sol",
    "exportedSymbols": {
      "ERC20Basic": [
        599
      ]
    },
    "id": 600,
    "nodeType": "SourceUnit",
    "nodes": [
      {
        "id": 569,
        "literals": [
          "solidity",
          "^",
          "0.4",
          ".24"
        ],
        "nodeType": "PragmaDirective",
        "src": "0:24:7"
      },
      {
        "baseContracts": [],
        "contractDependencies": [],
        "contractKind": "contract",
        "documentation": "@title ERC20Basic\n@dev Simpler version of ERC20 interface\nSee https://github.com/ethereum/EIPs/issues/179",
        "fullyImplemented": false,
        "id": 599,
        "linearizedBaseContracts": [
          599
        ],
        "name": "ERC20Basic",
        "nodeType": "ContractDefinition",
        "nodes": [
          {
            "body": null,
            "documentation": null,
            "id": 574,
            "implemented": false,
            "isConstructor": false,
            "isDeclaredConst": true,
            "modifiers": [],
            "name": "totalSupply",
            "nodeType": "FunctionDefinition",
            "parameters": {
              "id": 570,
              "nodeType": "ParameterList",
              "parameters": [],
              "src": "194:2:7"
            },
            "payable": false,
            "returnParameters": {
              "id": 573,
              "nodeType": "ParameterList",
              "parameters": [
                {
                  "constant": false,
                  "id": 572,
                  "name": "",
                  "nodeType": "VariableDeclaration",
                  "scope": 574,
                  "src": "218:7:7",
                  "stateVariable": false,
                  "storageLocation": "default",
                  "typeDescriptions": {
                    "typeIdentifier": "t_uint256",
                    "typeString": "uint256"
                  },
                  "typeName": {
                    "id": 571,
                    "name": "uint256",
                    "nodeType": "ElementaryTypeName",
                    "src": "218:7:7",
                    "typeDescriptions": {
                      "typeIdentifier": "t_uint256",
                      "typeString": "uint256"
                    }
                  },
                  "value": null,
                  "visibility": "internal"
                }
              ],
              "src": "217:9:7"
            },
            "scope": 599,
            "src": "174:53:7",
            "stateMutability": "view",
            "superFunction": null,
            "visibility": "public"
          },
          {
            "body": null,
            "documentation": null,
            "id": 581,
            "implemented": false,
            "isConstructor": false,
            "isDeclaredConst": true,
            "modifiers": [],
            "name": "balanceOf",
            "nodeType": "FunctionDefinition",
            "parameters": {
              "id": 577,
              "nodeType": "ParameterList",
              "parameters": [
                {
                  "constant": false,
                  "id": 576,
                  "name": "_who",
                  "nodeType": "VariableDeclaration",
                  "scope": 581,
                  "src": "249:12:7",
                  "stateVariable": false,
                  "storageLocation": "default",
                  "typeDescriptions": {
                    "typeIdentifier": "t_address",
                    "typeString": "address"
                  },
                  "typeName": {
                    "id": 575,
                    "name": "address",
                    "nodeType": "ElementaryTypeName",
                    "src": "249:7:7",
                    "typeDescriptions": {
                      "typeIdentifier": "t_address",
                      "typeString": "address"
                    }
                  },
                  "value": null,
                  "visibility": "internal"
                }
              ],
              "src": "248:14:7"
            },
            "payable": false,
            "returnParameters": {
              "id": 580,
              "nodeType": "ParameterList",
              "parameters": [
                {
                  "constant": false,
                  "id": 579,
                  "name": "",
                  "nodeType": "VariableDeclaration",
                  "scope": 581,
                  "src": "284:7:7",
                  "stateVariable": false,
                  "storageLocation": "default",
                  "typeDescriptions": {
                    "typeIdentifier": "t_uint256",
                    "typeString": "uint256"
                  },
                  "typeName": {
                    "id": 578,
                    "name": "uint256",
                    "nodeType": "ElementaryTypeName",
                    "src": "284:7:7",
                    "typeDescriptions": {
                      "typeIdentifier": "t_uint256",
                      "typeString": "uint256"
                    }
                  },
                  "value": null,
                  "visibility": "internal"
                }
              ],
              "src": "283:9:7"
            },
            "scope": 599,
            "src": "230:63:7",
            "stateMutability": "view",
            "superFunction": null,
            "visibility": "public"
          },
          {
            "body": null,
            "documentation": null,
            "id": 590,
            "implemented": false,
            "isConstructor": false,
            "isDeclaredConst": false,
            "modifiers": [],
            "name": "transfer",
            "nodeType": "FunctionDefinition",
            "parameters": {
              "id": 586,
              "nodeType": "ParameterList",
              "parameters": [
                {
                  "constant": false,
                  "id": 583,
                  "name": "_to",
                  "nodeType": "VariableDeclaration",
                  "scope": 590,
                  "src": "314:11:7",
                  "stateVariable": false,
                  "storageLocation": "default",
                  "typeDescriptions": {
                    "typeIdentifier": "t_address",
                    "typeString": "address"
                  },
                  "typeName": {
                    "id": 582,
                    "name": "address",
                    "nodeType": "ElementaryTypeName",
                    "src": "314:7:7",
                    "typeDescriptions": {
                      "typeIdentifier": "t_address",
                      "typeString": "address"
                    }
                  },
                  "value": null,
                  "visibility": "internal"
                },
                {
                  "constant": false,
                  "id": 585,
                  "name": "_value",
                  "nodeType": "VariableDeclaration",
                  "scope": 590,
                  "src": "327:14:7",
                  "stateVariable": false,
                  "storageLocation": "default",
                  "typeDescriptions": {
                    "typeIdentifier": "t_uint256",
                    "typeString": "uint256"
                  },
                  "typeName": {
                    "id": 584,
                    "name": "uint256",
                    "nodeType": "ElementaryTypeName",
                    "src": "327:7:7",
                    "typeDescriptions": {
                      "typeIdentifier": "t_uint256",
                      "typeString": "uint256"
                    }
                  },
                  "value": null,
                  "visibility": "internal"
                }
              ],
              "src": "313:29:7"
            },
            "payable": false,
            "returnParameters": {
              "id": 589,
              "nodeType": "ParameterList",
              "parameters": [
                {
                  "constant": false,
                  "id": 588,
                  "name": "",
                  "nodeType": "VariableDeclaration",
                  "scope": 590,
                  "src": "359:4:7",
                  "stateVariable": false,
                  "storageLocation": "default",
                  "typeDescriptions": {
                    "typeIdentifier": "t_bool",
                    "typeString": "bool"
                  },
                  "typeName": {
                    "id": 587,
                    "name": "bool",
                    "nodeType": "ElementaryTypeName",
                    "src": "359:4:7",
                    "typeDescriptions": {
                      "typeIdentifier": "t_bool",
                      "typeString": "bool"
                    }
                  },
                  "value": null,
                  "visibility": "internal"
                }
              ],
              "src": "358:6:7"
            },
            "scope": 599,
            "src": "296:69:7",
            "stateMutability": "nonpayable",
            "superFunction": null,
            "visibility": "public"
          },
          {
            "anonymous": false,
            "documentation": null,
            "id": 598,
            "name": "Transfer",
            "nodeType": "EventDefinition",
            "parameters": {
              "id": 597,
              "nodeType": "ParameterList",
              "parameters": [
                {
                  "constant": false,
                  "id": 592,
                  "indexed": true,
                  "name": "from",
                  "nodeType": "VariableDeclaration",
                  "scope": 598,
                  "src": "383:20:7",
                  "stateVariable": false,
                  "storageLocation": "default",
                  "typeDescriptions": {
                    "typeIdentifier": "t_address",
                    "typeString": "address"
                  },
                  "typeName": {
                    "id": 591,
                    "name": "address",
                    "nodeType": "ElementaryTypeName",
                    "src": "383:7:7",
                    "typeDescriptions": {
                      "typeIdentifier": "t_address",
                      "typeString": "address"
                    }
                  },
                  "value": null,
                  "visibility": "internal"
                },
                {
                  "constant": false,
                  "id": 594,
                  "indexed": true,
                  "name": "to",
                  "nodeType": "VariableDeclaration",
                  "scope": 598,
                  "src": "405:18:7",
                  "stateVariable": false,
                  "storageLocation": "default",
                  "typeDescriptions": {
                    "typeIdentifier": "t_address",
                    "typeString": "address"
                  },
                  "typeName": {
                    "id": 593,
                    "name": "address",
                    "nodeType": "ElementaryTypeName",
                    "src": "405:7:7",
                    "typeDescriptions": {
                      "typeIdentifier": "t_address",
                      "typeString": "address"
                    }
                  },
                  "value": null,
                  "visibility": "internal"
                },
                {
                  "constant": false,
                  "id": 596,
                  "indexed": false,
                  "name": "value",
                  "nodeType": "VariableDeclaration",
                  "scope": 598,
                  "src": "425:13:7",
                  "stateVariable": false,
                  "storageLocation": "default",
                  "typeDescriptions": {
                    "typeIdentifier": "t_uint256",
                    "typeString": "uint256"
                  },
                  "typeName": {
                    "id": 595,
                    "name": "uint256",
                    "nodeType": "ElementaryTypeName",
                    "src": "425:7:7",
                    "typeDescriptions": {
                      "typeIdentifier": "t_uint256",
                      "typeString": "uint256"
                    }
                  },
                  "value": null,
                  "visibility": "internal"
                }
              ],
              "src": "382:57:7"
            },
            "src": "368:72:7"
          }
        ],
        "scope": 600,
        "src": "150:292:7"
      }
    ],
    "src": "0:443:7"
  },
  "compiler": {
    "name": "solc",
    "version": "0.4.24+commit.e67f0147.Emscripten.clang"
  },
  "networks": {},
  "schemaVersion": "2.0.1",
  "updatedAt": "2018-10-14T14:40:24.110Z"
}