<?xml version="1.0" standalone="no"?> <!DOCTYPE svg PUBLIC "-//W3C//DTD SVG 1.0//EN" "http://www.w3.org/TR/2001/REC-SVG-20010904/DTD/svg10.dtd" > <svg xmlns="http://www.w3.org/2000/svg" width="100%" height="100%">
<defs >
<font id="d621391b89eb4f19aa8ed9886e030e03" horiz-adv-x="566" ><font-face
    font-family="NeoSansW23"
    units-per-em="1000"
    panose-1="2 11 5 4 3 5 4 4 2 4"
    ascent="980"
    descent="-216"
    alphabetic="0" />
<missing-glyph horiz-adv-x="500" d="M12 665H487V0H12V665ZM250 375L411 618H88L250 375ZM60 91Q60 91 67 101T85 128T110 167T140 212Q175 266 221 333L60 575V91ZM278 333L440 90V575L278 333ZM250 290L88 48H411L250 290Z" />
<glyph unicode=" " glyph-name="space" horiz-adv-x="247" />
<glyph unicode="!" glyph-name="exclam" horiz-adv-x="350" d="M212 213Q212 205 207 200T193 194H157Q149 194 143 199T137 213L130 733Q130 741 136 746T150 752H200Q208 752 214 747T220 733L212 213ZM218 19Q218 0 199 0H151Q143 0 138 5T132 19V113Q132 121
137 126T151 132H199Q207 132 212 127T218 113V19Z" />
<glyph unicode="&quot;" glyph-name="quotedbl" horiz-adv-x="362" d="M333 741Q333 736 332 733L274 544Q269 525 255 525H208Q199 525 199 535Q199 541 200 544L246 733Q250 752 266 752H322Q333 752 333 741ZM163 741Q163 736 162 733L104 544Q99 525 85 525H38Q29
525 29 535Q29 541 30 544L76 733Q80 752 96 752H152Q163 752 163 741Z" />
<glyph unicode="#" glyph-name="numbersign" horiz-adv-x="660" d="M610 510L608 488Q606 469 588 469H491L473 267H571Q579 267 583 262T587 248V246L585 225Q583 206 565 206H467L451 19Q450 11 446 6T433 0H389Q381 0 377 5T373 17V19L389 206H234L218 19Q217
11 213 6T200 0H155Q148 0 144 5T139 17V19L155 206H62Q54 206 50 211T46 225V227L48 248Q50 267 68 267H161L179 469H85Q77 469 73 474T69 488V490L71 512Q73 531 91 531H184L201 724Q202 732 207 737T220 743H265Q272 743 276 738T280 726V724L263 531H418L435
724Q436 732 441 737T454 743H498Q506 743 509 738T513 726V724L496 531H594Q602 531 606 526T610 512V510ZM258 469L240 267H395L413 469H258Z" />
<glyph unicode="$" glyph-name="dollar" horiz-adv-x="605" d="M528 193Q528 161 520 130T491 71T435 24T345 -3V-97Q345 -105 339 -111T325 -117H278Q270 -117 264 -111T258 -97V-7Q213 -6 179 -2T115 7Q102 9 99 13T96 25V66Q96 74 101 78T113 82H116Q133 80
154 79T198 76T242 74T281 73Q326 73 355 82T402 107T426 145T433 193Q433 212 427 227T407 258T370 289T313 327L216 386Q147 428 113 470T78 573Q78 651 124 693T258 747V833Q258 841 264 847T278 853H325Q333 853 339 847T345 833V750Q386 748 426 745T491 737Q508
734 508 720V677Q508 661 491 661H489Q456 663 409 666T317 670Q239 670 205 649T170 573Q170 538 196 512T279 452L371 397Q414 371 444 347T493 299T520 249T528 193Z" />
<glyph unicode="%" glyph-name="percent" horiz-adv-x="794" d="M749 155Q749 73 714 33T615 -7Q552 -7 516 33T480 155V248Q480 331 516 370T615 410Q678 410 713 371T749 248V155ZM650 737Q650 734 645 724L227 16Q221 5 217 1T205 -4H156Q146 -4 146 4Q146
11 150 16L568 724Q575 735 579 739T591 743H642Q650 743 650 737ZM314 496Q314 414 279 374T180 334Q117 334 81 374T45 496V589Q45 672 81 711T180 750Q243 750 278 711T314 589V496ZM687 248Q687 305 668 329T615 353Q581 353 562 329T542 248V155Q542 98 561
74T615 50Q649 50 668 74T687 155V248ZM252 589Q252 646 233 670T180 694Q146 694 127 670T107 589V496Q107 439 126 415T180 391Q214 391 233 415T252 496V589Z" />
<glyph unicode="&amp;" glyph-name="ampersand" horiz-adv-x="678" d="M641 11Q641 6 638 3T630 0H561Q554 0 551 2T545 7L495 61Q458 29 409 11T298 -7Q252 -7 208 2T130 33T74 90T53 176V184Q53 215 61 240T87 289T132 335T197 381L190 389Q155 429 134 458T103
510T89 549T86 583V591Q86 671 142 710T296 750Q338 750 374 740T437 710T479 661T495 591V583Q495 558 489 536T466 491T419 443T342 385L314 366L495 171Q515 207 524 252T534 347V361Q534 377 550 377H593Q610 377 610 361V347Q610 281 595 223T547 117L636
22Q641 17 641 11ZM412 591Q412 641 380 662T296 683Q239 683 204 663T168 591V583Q168 570 170 557T180 528T206 489T253 433L263 422L297 443Q333 465 355 482T390 514T407 546T412 583V591ZM248 326Q218 307 198 291T167 259T150 225T145 184V176Q145 146 157
124T191 89T240 69T298 62Q346 62 383 76T447 113L248 326Z" />
<glyph unicode="&apos;" glyph-name="quotesingle" horiz-adv-x="192" d="M163 741Q163 736 162 733L104 544Q99 525 85 525H38Q29 525 29 535Q29 541 30 544L76 733Q80 752 96 752H152Q163 752 163 741Z" />
<glyph unicode="(" glyph-name="parenleft" horiz-adv-x="305" d="M280 -201Q280 -209 270 -209H223Q215 -209 211 -208T200 -198Q167 -158 141 -105T97 8T70 133T60 265V278Q60 344 69 409T97 535T141 647T200 741Q206 749 210 750T223 752H270Q280 752 280 744Q280
738 277 734Q213 640 181 525T148 278V265Q148 133 180 18T277 -191Q280 -196 280 -201Z" />
<glyph unicode=")" glyph-name="parenright" horiz-adv-x="305" d="M259 265Q259 199 250 134T222 8T178 -105T119 -198Q113 -206 109 -207T96 -209H49Q39 -209 39 -201Q39 -196 42 -191Q106 -97 138 18T171 265V278Q171 410 139 525T42 734Q39 738 39 744Q39
752 49 752H96Q104 752 108 751T119 741Q152 700 178 648T222 535T249 410T259 278V265Z" />
<glyph unicode="*" glyph-name="asterisk" horiz-adv-x="465" d="M419 598Q419 588 405 583L280 544L357 438Q362 431 362 425Q362 418 356 414L332 396Q327 393 324 393Q316 393 309 403L233 509L157 403Q150 393 142 393Q138 393 134 396L109 414Q103 418 103
425Q103 431 108 438L186 544L62 583Q56 585 52 589T47 598Q47 600 47 600T48 603L57 632Q60 642 70 642Q73 642 79 640L203 599V730Q203 749 218 749H248Q263 749 263 730L262 599L387 640Q393 642 396 642Q406 642 409 632L418 603Q419 601 419 598Z" />
<glyph unicode="+" glyph-name="plus" horiz-adv-x="605" d="M530 371Q530 363 524 359T510 355H338V184Q338 176 334 170T322 164H282Q274 164 270 170T266 184V355H95Q87 355 81 359T75 371V411Q75 419 81 423T95 427H266V599Q266 607 270 613T282 619H322Q330
619 334 613T338 599V427H510Q518 427 524 423T530 411V371Z" />
<glyph unicode="," glyph-name="comma" horiz-adv-x="214" d="M169 118Q169 116 167 110L92 -79Q88 -89 85 -93T73 -98H32Q20 -98 20 -86Q20 -81 21 -79L78 110Q84 129 98 129H156Q169 129 169 118Z" />
<glyph unicode="-" glyph-name="hyphen" horiz-adv-x="333" d="M285 273Q285 256 266 256H67Q48 256 48 273V312Q48 320 53 325T67 330H266Q285 330 285 312V273Z" />
<glyph unicode="." glyph-name="period" horiz-adv-x="214" d="M150 21Q150 13 145 7T131 1H83Q75 1 70 7T64 21V114Q64 122 69 127T83 133H131Q139 133 144 128T150 114V21Z" />
<glyph unicode="/" glyph-name="slash" horiz-adv-x="355" d="M333 729Q333 725 332 723L106 20Q104 12 100 6T88 0H37Q30 0 27 4T23 14Q23 18 24 20L251 723Q253 731 256 737T268 743H319Q326 743 329 739T333 729Z" />
<glyph unicode="0" glyph-name="zero" horiz-adv-x="605" d="M548 304Q548 221 531 162T482 66T405 11T303 -7Q246 -7 201 10T123 65T74 162T57 304V439Q57 522 74 581T123 677T200 732T303 750Q360 750 405 733T482 678T531 581T548 439V304ZM457 439Q457 502
446 546T415 619T367 660T303 673Q268 673 240 660T191 619T160 547T149 439V304Q149 241 160 197T191 124T239 83T303 70Q338 70 366 83T415 124T446 196T457 304V439Z" />
<glyph unicode="1" glyph-name="one" horiz-adv-x="605" d="M90 0Q82 0 76 5T70 18V62Q70 70 76 74T90 79H249V649L92 583Q86 581 78 581T70 591V642Q70 647 72 649T80 655L259 737Q271 743 280 743H321Q329 743 334 738T340 724V79H500Q508 79 514 75T520 62V18Q520
10 514 5T500 0H90Z" />
<glyph unicode="2" glyph-name="two" horiz-adv-x="605" d="M526 571Q526 512 496 469T396 378L300 313Q258 285 231 261T189 211T167 160T160 100V79H497Q505 79 511 75T517 62V18Q517 10 511 5T497 0H100Q92 0 86 5T80 19V100Q80 178 115 243T233 363L334 431Q365
452 385 468T416 499T432 531T437 571Q437 625 403 649T287 674Q248 674 200 670T110 659H106Q90 659 90 677V712Q90 720 95 724T109 730Q147 740 194 745T287 750Q409 750 467 707T526 571Z" />
<glyph unicode="3" glyph-name="three" horiz-adv-x="605" d="M521 207Q521 151 503 111T451 44T373 6T272 -7Q224 -7 182 -1T103 13Q95 15 90 19T84 32V66Q84 83 101 83H104Q149 77 193 73T272 69Q354 69 391 102T428 207V228Q428 248 423 269T404 309T368 338T311
350H129Q110 350 110 368V403Q110 422 129 422H311Q347 422 370 433T405 461T423 500T428 541V555Q428 617 393 645T272 674Q228 674 191 670T104 659H101Q84 659 84 676V711Q84 718 89 723T103 730Q139 738 181 744T272 750Q328 750 374 741T452 708T503 648T521
555V541Q521 490 497 449T426 385Q453 372 471 354T500 315T516 272T521 228V207Z" />
<glyph unicode="4" glyph-name="four" horiz-adv-x="605" d="M567 216Q567 198 548 198H461V20Q461 12 457 6T444 0H386Q378 0 374 6T369 20V198H80Q57 198 48 206T39 237V275Q39 296 51 312L347 727Q351 733 357 738T376 743H435Q461 743 461 721V274H548Q556
274 561 269T567 256V216ZM370 616Q370 622 366 622H365Q361 622 357 616L126 288Q123 283 123 280Q123 274 131 274H370V616Z" />
<glyph unicode="5" glyph-name="five" horiz-adv-x="605" d="M528 226Q528 114 462 54T273 -7Q224 -7 180 -3T97 11Q89 13 84 17T78 31V68Q78 83 93 83H98Q146 75 190 72T273 69Q358 69 397 109T436 226V241Q436 316 387 345T227 375H107Q100 375 96 380T91 392V393L119
726Q120 734 125 738T139 743H483Q491 743 497 739T503 726V682Q503 674 497 670T483 666H196L180 450H227Q297 450 352 440T447 406T507 341T528 241V226Z" />
<glyph unicode="6" glyph-name="six" horiz-adv-x="605" d="M546 246Q546 127 486 60T302 -7Q190 -7 125 61T60 277V452Q60 532 76 588T126 681T208 733T321 750Q381 750 421 745T493 733Q502 731 509 727T516 714V675Q516 666 511 662T498 657Q496 657 495 657T492
658Q454 666 412 670T321 674Q263 674 229 658T178 612T155 542T150 452V441Q181 448 217 454T301 461Q350 461 394 451T472 417T526 353T546 252V246ZM456 252Q456 292 443 319T408 361T359 383T301 390Q283 390 262 389T221 385T182 379T150 372V277Q150 216
160 176T189 111T237 77T302 67Q337 67 365 76T414 106T445 161T456 246V252Z" />
<glyph unicode="7" glyph-name="seven" horiz-adv-x="605" d="M533 680Q533 656 520 628L232 15Q224 0 210 0H150Q142 0 139 4T135 15Q135 20 138 26L440 654Q441 655 441 658Q441 665 434 665H93Q85 665 79 669T73 682V724Q73 732 79 737T93 743H458Q500 743
516 725T533 680Z" />
<glyph unicode="8" glyph-name="eight" horiz-adv-x="605" d="M551 207Q551 152 532 112T479 46T402 6T308 -7H298Q248 -7 204 6T127 45T75 112T55 207V226Q55 249 61 272T80 316T110 356T152 388Q104 412 81 453T57 544V553Q57 605 75 642T126 703T202 738T298
750H308Q359 750 403 739T480 703T530 642T549 553V544Q549 494 526 453T454 388Q478 375 496 357T526 317T544 272T551 226V207ZM461 553Q461 613 422 644T308 676H298Q223 676 184 645T145 553V544Q145 521 152 499T174 461T213 434T272 424H334Q368 424 392
434T432 460T454 499T461 544V553ZM460 226Q460 247 453 269T431 310T392 340T334 352H272Q237 352 213 341T174 311T153 270T146 226V207Q146 142 184 106T298 69H308Q383 69 421 105T460 207V226Z" />
<glyph unicode="9" glyph-name="nine" horiz-adv-x="605" d="M537 291Q537 211 521 155T471 62T389 10T276 -7Q216 -7 176 -2T104 10Q94 12 87 16T80 29V68Q80 77 85 81T98 86Q100 86 101 86T104 85Q142 77 184 73T275 69Q333 69 367 85T419 131T442 201T447 291V302Q415
295 379 289T296 282Q247 282 203 292T124 326T70 390T50 491V497Q50 616 110 683T294 750Q350 750 395 733T471 682T520 593T537 466V291ZM447 466Q447 527 437 567T408 632T360 666T295 676Q260 676 231 667T182 637T151 582T140 497V491Q140 450 153 424T188
382T237 360T295 353Q313 353 334 354T375 358T414 364T446 371L447 466Z" />
<glyph unicode=":" glyph-name="colon" horiz-adv-x="219" d="M153 437Q153 429 147 424T133 418H86Q78 418 72 423T66 437V530Q66 538 72 544T86 550H133Q141 550 147 544T153 530V437ZM153 19Q153 11 147 6T133 0H86Q78 0 72 5T66 19V113Q66 121 72 126T86 132H133Q141
132 147 127T153 113V19Z" />
<glyph unicode=";" glyph-name="semicolon" horiz-adv-x="219" d="M153 437Q153 418 134 418H85Q77 418 72 423T66 437V530Q66 538 71 544T85 550H134Q142 550 147 544T153 530V437ZM157 117Q157 115 155 109L80 -80Q76 -90 73 -95T61 -100H21Q9 -100 9 -87Q9
-82 10 -80L67 109Q73 128 87 128H144Q157 128 157 117Z" />
<glyph unicode="&lt;" glyph-name="less" horiz-adv-x="605" d="M482 150Q482 140 470 140H412Q404 140 397 142T381 153L140 357Q122 372 122 391Q122 410 140 425L381 629Q390 637 397 639T412 642H470Q482 642 482 632Q482 624 472 615L210 391L472 167Q482
158 482 150Z" />
<glyph unicode="=" glyph-name="equal" horiz-adv-x="605" d="M515 482Q515 474 509 470T495 466H110Q102 466 96 470T90 482V522Q90 530 96 534T110 538H495Q503 538 509 534T515 522V482ZM515 261Q515 253 509 249T495 245H110Q102 245 96 249T90 261V301Q90
309 96 313T110 317H495Q503 317 509 313T515 301V261Z" />
<glyph unicode="&gt;" glyph-name="greater" horiz-adv-x="605" d="M483 391Q483 372 465 357L224 153Q208 140 193 140H135Q123 140 123 150Q123 158 133 167L395 391L133 615Q123 624 123 632Q123 642 135 642H193Q201 642 208 640T224 629L465 425Q483 410 483 391Z" />
<glyph unicode="?" glyph-name="question" horiz-adv-x="446" d="M386 587Q386 569 383 552T369 516T341 472T295 416L250 365Q236 349 226 337T210 314T200 291T197 262V213Q197 205 191 200T177 194H133Q125 194 120 199T114 213V262Q114 286 117 304T127 340T147
374T180 413L226 464Q245 485 257 501T276 531T285 558T288 587V599Q288 639 263 655T186 671Q150 671 118 669T51 662H48Q33 662 33 679V714Q33 723 35 729T50 737Q81 743 116 746T186 750Q229 750 265 743T329 718T371 671T386 599V587ZM198 19Q198 0 179 0H131Q123
0 117 5T111 19V112Q111 120 117 126T131 132H179Q187 132 192 126T198 112V19Z" />
<glyph unicode="@" glyph-name="at" horiz-adv-x="767" d="M728 366Q728 272 704 213T634 118Q587 83 520 69T364 54Q289 54 246 90T203 193Q203 198 203 202T204 211L215 328Q223 405 269 446T397 487Q429 487 462 483T525 472Q535 470 540 466T546 451V447L516
134Q563 141 591 160T636 210T657 279T662 366Q662 413 647 455T601 529T524 579T416 598Q350 598 298 580T209 528T150 448T122 344L107 192Q106 184 106 176T105 160Q105 115 120 76T167 9T245 -36T357 -53Q393 -53 429 -51T501 -46H502Q508 -46 510 -50Q511
-52 511 -53V-85Q511 -93 507 -95T495 -99Q475 -101 438 -104T356 -107Q284 -107 226 -88T127 -33T63 51T41 161Q41 169 41 176T42 192L57 348Q63 416 90 472T164 570T274 633T419 656Q496 656 554 632T650 567T708 474T728 366ZM457 409Q441 411 424 413T389 415Q344
415 324 393T298 326L287 212Q286 207 286 203T286 195Q286 160 305 143T368 126H389Q400 126 410 126T432 128L457 409Z" />
<glyph unicode="A" glyph-name="A" horiz-adv-x="633" d="M604 16Q604 0 587 0H528Q521 0 517 4T511 15L446 245H187L123 15Q121 9 116 5T105 0H46Q29 0 29 16Q29 21 30 23L215 674Q221 697 232 711T258 734T287 746T317 750Q331 750 346 747T375 736T400 713T418
675L603 23Q604 21 604 16ZM336 653Q331 671 317 671Q302 671 297 653L206 324H427L336 653Z" />
<glyph unicode="B" glyph-name="B" horiz-adv-x="616" d="M566 205Q566 142 543 101T479 36T385 3T274 -7Q224 -7 182 -5T111 2Q94 4 86 12T78 39V705Q78 739 110 742Q135 745 177 747T269 750Q329 750 382 741T475 710T538 651T562 557V541Q562 485 534 445T455
384Q507 366 536 323T566 222V205ZM471 557Q471 593 457 615T416 651T352 668T269 673Q243 673 217 672T170 670V422H324Q367 422 395 431T441 457T464 495T471 541V557ZM475 222Q475 247 468 270T444 310T397 338T324 349H170V74Q195 73 221 72T274 70Q320 70
357 76T421 97T461 138T475 205V222Z" />
<glyph unicode="C" glyph-name="C" horiz-adv-x="545" d="M510 26Q510 17 504 13T490 6Q474 3 458 1T423 -3T380 -6T324 -7Q278 -7 231 7T146 56T84 151T60 302V441Q60 533 84 592T146 687T231 736T324 750Q372 750 415 745T492 734Q508 732 508 721V670Q508 665
506 662T496 659H493Q479 660 460 661T418 664T371 667T325 668Q288 668 257 657T202 619T165 549T151 441V302Q151 239 164 196T201 126T256 87T325 75Q346 75 369 76T415 78T457 80T490 83H494Q510 83 510 67V26Z" />
<glyph unicode="D" glyph-name="D" horiz-adv-x="641" d="M584 304Q584 224 563 165T502 68T406 12T281 -7Q252 -7 225 -6T173 -4T129 -1T99 3Q78 6 78 28V715Q78 737 99 740Q110 742 129 743T172 746T224 749T281 750Q350 750 406 732T501 676T562 579T584 439V304ZM493
439Q493 507 477 552T432 623T365 661T281 672Q246 672 221 672T170 669V73Q194 71 220 71T281 71Q326 71 364 82T431 120T476 191T493 304V439Z" />
<glyph unicode="E" glyph-name="E" horiz-adv-x="551" d="M496 12Q496 7 494 3T486 -2Q472 -4 448 -4T397 -6T341 -7T291 -7Q185 -7 132 36T78 179V564Q78 664 131 707T291 750Q313 750 340 750T395 749T446 747T486 744Q491 743 493 739T496 730V680Q496 668
485 668H292Q252 668 228 663T191 645T174 612T169 564V425H476Q484 425 490 419T496 405V367Q496 359 490 353T476 347H169V179Q169 150 173 131T191 99T228 81T292 75H485Q496 75 496 63V12Z" />
<glyph unicode="F" glyph-name="F" horiz-adv-x="551" d="M496 367Q496 359 490 353T476 347H169V20Q169 12 163 6T149 0H98Q90 0 84 6T78 20V564Q78 664 131 707T291 750Q313 750 340 750T395 749T446 747T486 744Q491 743 493 739T496 730V680Q496 668 485 668H292Q252
668 228 663T191 645T174 612T169 564V425H476Q484 425 490 419T496 405V367Z" />
<glyph unicode="G" glyph-name="G" horiz-adv-x="612" d="M534 30Q534 11 516 8Q479 2 434 -2T317 -7Q270 -7 224 9T141 62T81 158T58 304V438Q58 529 82 589T144 685T230 735T326 750Q396 750 441 746T516 736Q523 735 528 732T533 721V671Q533 661 520 661H516Q494
663 474 664T431 666T384 667T326 668Q291 668 259 658T203 621T164 550T149 438V304Q149 242 162 199T198 127T251 87T317 74Q363 74 394 76T443 80V366Q443 374 448 380T461 386H515Q523 386 528 380T534 366V30Z" />
<glyph unicode="H" glyph-name="H" horiz-adv-x="680" d="M602 20Q602 12 596 6T582 0H531Q523 0 517 6T511 20V352H169V20Q169 12 163 6T149 0H98Q90 0 84 6T78 20V723Q78 731 84 737T98 743H149Q157 743 163 737T169 723V433H511V723Q511 731 517 737T531 743H582Q590
743 596 737T602 723V20Z" />
<glyph unicode="I" glyph-name="I" horiz-adv-x="267" d="M179 20Q179 12 174 6T161 0H106Q98 0 93 6T88 20V724Q88 732 93 737T106 743H161Q169 743 174 738T179 724V20Z" />
<glyph unicode="J" glyph-name="J" horiz-adv-x="257" d="M179 -37Q179 -109 143 -144T24 -180Q7 -180 -8 -177T-29 -172Q-35 -169 -35 -161V-124Q-35 -116 -29 -112T-15 -107H24Q64 -107 76 -91T88 -37V724Q88 732 93 737T107 743H160Q168 743 173 738T179 724V-37Z" />
<glyph unicode="K" glyph-name="K" horiz-adv-x="607" d="M564 10Q564 0 551 0H473Q460 0 451 10L169 353V20Q169 12 164 6T151 0H96Q88 0 83 6T78 20V724Q78 732 83 737T97 743H150Q158 743 163 738T169 724V401L457 734Q462 739 465 741T477 743H549Q563 743
563 732Q563 726 559 722L258 382L559 22Q564 17 564 10Z" />
<glyph unicode="L" glyph-name="L" horiz-adv-x="514" d="M496 16Q496 11 494 7T486 2Q466 -1 414 -4T291 -7Q251 -7 213 -1T144 24T96 80T78 179V723Q78 731 84 737T98 743H149Q157 743 163 737T169 723V179Q169 150 173 131T191 99T228 81T292 75H485Q496 75
496 63V16Z" />
<glyph unicode="M" glyph-name="M" horiz-adv-x="761" d="M684 20Q684 12 678 6T664 0H615Q607 0 601 6T595 20V613Q595 616 594 616Q593 616 592 614L449 318Q441 303 432 296T404 289H358Q339 289 330 296T313 318L170 614Q169 616 168 616Q167 616 167 613V20Q167
12 161 6T147 0H98Q90 0 84 6T78 20V714Q78 726 86 734T107 743H172Q186 743 192 740T204 726L369 383Q374 372 381 372Q388 372 393 383L558 726Q563 736 569 739T590 743H655Q667 743 675 735T684 714V20Z" />
<glyph unicode="N" glyph-name="N" horiz-adv-x="680" d="M602 29Q602 17 594 9T573 0H511Q487 0 479 16L170 603Q168 606 167 606Q166 606 166 603V19Q166 11 161 6T148 0H96Q88 0 83 2T78 12V715Q78 727 86 735T107 743H162Q183 743 190 739T203 723L510 139L512
136Q513 136 513 139V724Q513 732 518 737T531 743H584Q592 743 597 738T602 724V29Z" />
<glyph unicode="O" glyph-name="O" horiz-adv-x="661" d="M601 307Q601 224 581 165T525 67T440 11T331 -7Q272 -7 223 11T137 67T81 164T60 307V436Q60 519 80 578T137 676T222 732T331 750Q390 750 439 732T525 676T581 579T601 436V307ZM509 436Q509 499 497
543T461 615T405 655T331 668Q290 668 257 656T201 615T165 543T152 436V307Q152 244 164 200T200 128T256 88T331 75Q372 75 405 87T461 128T496 200T509 307V436Z" />
<glyph unicode="P" glyph-name="P" horiz-adv-x="593" d="M548 520Q548 457 527 415T469 346T380 308T268 296Q244 296 216 297T168 301V20Q168 12 163 6T150 0H96Q88 0 83 6T78 20V717Q78 739 102 742Q134 746 179 748T268 750Q329 750 380 739T468 702T527 635T548
533V520ZM457 533Q457 609 411 641T268 673Q245 673 216 672T168 669V376Q177 376 190 375T217 374T244 373T268 372Q371 372 414 407T457 520V533Z" />
<glyph unicode="Q" glyph-name="Q" horiz-adv-x="661" d="M601 307Q601 232 585 176T538 82T466 22T374 -5V-48Q374 -67 376 -78T386 -96T405 -104T436 -106H495Q504 -106 510 -110T517 -122V-156Q517 -169 496 -174T436 -180Q399 -180 371 -175T324 -154T296
-114T286 -49V-4Q236 2 195 23T123 83T77 176T60 307V436Q60 519 80 578T137 676T222 732T331 750Q390 750 439 732T525 676T581 579T601 436V307ZM509 436Q509 499 497 543T461 615T405 655T331 668Q290 668 257 656T201 615T165 543T152 436V307Q152 244 164
200T200 128T256 88T331 75Q372 75 405 87T461 128T496 200T509 307V436Z" />
<glyph unicode="R" glyph-name="R" horiz-adv-x="625" d="M586 13Q586 0 573 0H509Q500 0 495 1T483 13L304 311H278Q253 311 231 311T168 314V20Q168 12 163 6T150 0H96Q88 0 83 6T78 20V720Q78 731 83 735T102 742Q118 744 139 745T184 748T232 749T278 750Q337
750 388 739T477 703T536 637T558 535V528Q558 486 547 453T514 394T464 352T401 326L583 22Q586 17 586 13ZM468 535Q468 610 420 639T278 668Q266 668 251 668T221 668T191 667T168 665V391Q201 390 231 390T278 389Q324 389 359 395T419 418T455 460T468 528V535Z"
/>
<glyph unicode="S" glyph-name="S" horiz-adv-x="550" d="M500 193Q500 157 489 121T451 57T375 11T253 -7Q200 -7 160 -3T87 7Q74 9 71 13T68 25V65Q68 73 73 77T85 81H88Q105 79 126 78T170 77T214 76T253 75Q298 75 327 83T374 107T398 145T405 193Q405 212
399 227T379 258T342 289T285 327L188 386Q119 428 85 470T50 573Q50 664 112 707T289 750Q311 750 335 749T383 747T428 743T463 738Q480 735 480 721V678Q480 662 463 662H461Q428 664 381 666T289 668Q211 668 177 648T142 573Q142 538 168 512T251 452L343
397Q386 371 416 347T465 299T492 249T500 193Z" />
<glyph unicode="T" glyph-name="T" horiz-adv-x="590" d="M555 681Q555 665 536 665H341V20Q341 12 336 6T323 0H268Q260 0 255 6T250 20V665H55Q47 665 41 669T35 681V725Q35 733 41 738T55 743H536Q555 743 555 725V681Z" />
<glyph unicode="U" glyph-name="U" horiz-adv-x="662" d="M587 270Q587 127 520 60T331 -7Q209 -7 142 60T75 270V724Q75 732 80 737T94 743H148Q156 743 161 738T167 724V270Q167 222 175 185T202 122T253 84T331 71Q377 71 408 84T459 122T487 184T495 270V724Q495
732 500 737T514 743H568Q576 743 581 738T587 724V270Z" />
<glyph unicode="V" glyph-name="V" horiz-adv-x="643" d="M609 726Q609 722 608 720L424 69Q417 45 406 31T381 8T352 -4T322 -7Q308 -7 293 -4T264 7T239 30T220 69L35 720Q34 722 34 726Q34 734 39 738T52 743H110Q116 743 121 739T128 728L302 91Q308 70 322
70Q335 70 341 91L516 728Q518 734 522 738T533 743H592Q609 743 609 726Z" />
<glyph unicode="W" glyph-name="W" horiz-adv-x="825" d="M791 723L680 47Q675 16 659 6T618 -4H575Q554 -4 539 9T518 46L420 416Q418 423 417 424T414 425H412Q410 425 409 424T406 416L307 46Q301 23 286 10T250 -4H208Q184 -4 168 6T146 47L35 723V726Q35
743 52 743H110Q124 743 127 726L224 89Q226 81 226 78T229 74Q233 74 236 89L334 459Q344 499 381 499H445Q482 499 492 459L590 89Q593 74 597 74Q600 74 600 77T602 89L699 726Q702 743 716 743H774Q791 743 791 726V723Z" />
<glyph unicode="X" glyph-name="X" horiz-adv-x="646" d="M604 14Q604 9 600 5T588 0H525Q517 0 513 3T504 15L321 306L142 15Q132 0 121 0H62Q54 0 50 4T46 15Q46 20 49 25L271 378L51 719Q48 723 48 729Q48 743 63 743H128Q136 743 139 741T146 733L326 448L500
733Q505 740 509 741T519 743H578Q586 743 590 739T594 728Q594 723 591 719L376 376L601 25Q604 20 604 14Z" />
<glyph unicode="Y" glyph-name="Y" horiz-adv-x="583" d="M549 729Q549 724 546 718L391 370Q377 340 364 325T337 304V20Q337 12 332 6T319 0H264Q256 0 251 6T246 20V304Q232 309 219 324T192 370L38 718Q35 724 35 729Q35 743 52 743H113Q118 743 123 739T131
729L269 405Q277 388 282 384T292 379Q297 379 302 383T315 405L454 729Q456 734 460 738T471 743H532Q549 743 549 729Z" />
<glyph unicode="Z" glyph-name="Z" horiz-adv-x="597" d="M544 18Q544 10 538 5T524 0H139Q91 0 74 14T56 68Q56 81 59 98T71 126L429 647Q432 651 432 655Q432 662 422 662H90Q82 662 76 666T70 679V726Q70 734 76 738T90 743H446Q488 743 509 731T531 677Q531
663 527 646T515 618L158 97Q155 92 155 88Q155 82 165 82H524Q532 82 538 78T544 65V18Z" />
<glyph unicode="[" glyph-name="bracketleft" horiz-adv-x="327" d="M303 -174Q303 -182 297 -188T283 -194H97Q89 -194 85 -189T80 -175V724Q80 732 84 737T97 743H283Q291 743 297 737T303 723V690Q303 682 297 676T283 670H169V-121H283Q291 -121 297 -127T303
-141V-174Z" />
<glyph unicode="\" glyph-name="backslash" horiz-adv-x="355" d="M333 14Q333 9 330 5T319 0H268Q260 0 256 6T250 20L24 723Q23 725 23 729Q23 734 26 738T37 743H88Q96 743 99 737T105 723L332 20Q333 18 333 14Z" />
<glyph unicode="]" glyph-name="bracketright" horiz-adv-x="327" d="M247 -175Q247 -183 243 -188T230 -194H44Q36 -194 30 -188T24 -174V-141Q24 -133 30 -127T44 -121H158V670H44Q36 670 30 676T24 690V723Q24 731 30 737T44 743H230Q238 743 242 738T247 724V-175Z" />
<glyph unicode="^" glyph-name="asciicircum" horiz-adv-x="605" d="M505 572Q505 563 494 563H434Q423 563 419 567T406 581L303 701L200 581Q192 572 188 568T172 563H112Q101 563 101 572Q101 578 105 583L220 732Q228 743 233 746T250 750H356Q367 750 372
747T386 732L501 583Q505 578 505 572Z" />
<glyph unicode="_" glyph-name="underscore" horiz-adv-x="494" d="M525 -90Q525 -98 519 -102T505 -106H-10Q-18 -106 -24 -102T-30 -90V-65Q-30 -57 -24 -53T-10 -49H505Q513 -49 519 -53T525 -65V-90Z" />
<glyph unicode="`" glyph-name="grave" horiz-adv-x="372" d="M243 630Q243 623 234 623H180Q172 623 168 626T157 638L44 764Q40 768 40 772Q40 779 51 779H117Q126 779 130 776T142 764L239 640Q243 636 243 630Z" />
<glyph unicode="a" glyph-name="a" horiz-adv-x="519" d="M451 20Q451 12 445 6T431 0H385Q377 0 371 6T365 20V42Q329 21 291 7T211 -7Q179 -7 150 0T98 27T62 77T48 155V167Q48 207 60 237T101 288T176 319T289 329H363V369Q363 432 339 457T256 482Q207 482
170 480T103 474H98Q91 474 86 477T80 490V525Q80 541 101 544Q132 549 168 553T256 557Q360 557 405 507T451 369V20ZM363 266H289Q244 266 214 261T167 244T143 214T136 168V156Q136 102 160 84T228 65Q263 65 295 75T363 105V266Z" />
<glyph unicode="b" glyph-name="b" horiz-adv-x="541" d="M491 240Q491 184 478 138T438 60T370 11T273 -7Q228 -7 182 -3T89 10Q75 12 72 17T68 33V733Q68 741 73 746T86 752H137Q145 752 150 747T156 733V547Q185 552 217 554T273 557Q382 557 436 494T491 312V240ZM403
312Q403 392 375 436T273 480Q261 480 246 480T215 479T184 477T156 473V76Q182 74 214 72T273 70Q347 70 375 114T403 240V312Z" />
<glyph unicode="c" glyph-name="c" horiz-adv-x="452" d="M408 26Q408 16 404 11T388 4Q363 -1 331 -4T263 -7Q212 -7 173 10T106 59T64 136T50 236V314Q50 369 64 414T105 490T172 539T263 557Q298 557 330 554T388 546Q400 544 404 540T408 524V488Q408 480
403 477T391 473H387Q354 477 327 478T263 480Q203 480 171 440T138 314V236Q138 151 170 111T263 70Q300 70 327 71T387 77H391Q398 77 403 74T408 62V26Z" />
<glyph unicode="d" glyph-name="d" horiz-adv-x="541" d="M473 33Q473 23 470 18T452 10Q405 1 360 -3T268 -7Q212 -7 171 10T103 60T63 138T50 240V312Q50 430 104 493T268 557Q291 557 323 555T385 547V733Q385 741 390 746T404 752H455Q463 752 468 747T473
733V33ZM385 473Q360 478 326 479T268 480Q231 480 206 469T166 437T145 384T138 312V240Q138 158 166 114T268 70Q294 70 326 72T385 76V473Z" />
<glyph unicode="e" glyph-name="e" horiz-adv-x="544" d="M492 269Q492 247 473 247H138V233Q138 144 173 107T277 70Q321 70 370 73T455 81H460Q466 81 471 78T476 67V33Q476 23 472 18T456 10Q413 2 371 -2T277 -7Q234 -7 193 4T121 43T70 117T50 233V323Q50
431 107 494T272 557Q327 557 368 541T436 494T478 420T492 323V269ZM403 323Q403 408 371 444T272 480Q207 480 173 442T138 323V314H403V323Z" />
<glyph unicode="f" glyph-name="f" horiz-adv-x="381" d="M356 706Q356 691 338 691H290Q255 691 242 677T229 622V550H334Q342 550 347 545T353 532V493Q353 476 334 476H229V20Q229 12 224 6T210 0H161Q153 0 147 6T141 20V476L44 487Q25 489 25 505V532Q25
540 30 545T44 550H141V622Q141 662 150 689T178 732T222 754T281 761Q301 761 314 759T337 755Q356 750 356 739V706Z" />
<glyph unicode="g" glyph-name="g" horiz-adv-x="559" d="M523 502Q523 492 518 489T505 483L469 476Q483 462 493 438T503 373V365Q503 282 450 238T281 194Q241 194 214 199T165 214Q140 202 140 180Q140 167 147 160T171 148L320 110Q357 101 391 90T453 63T496
22T512 -37V-45Q512 -117 460 -158T284 -200Q165 -200 110 -158T54 -41V-32Q54 10 73 43T117 95L110 98Q86 109 75 131T64 176V177Q64 197 74 217T105 249Q82 271 71 299T59 365V373Q59 406 69 438T105 495T173 535T281 550H500Q509 550 516 544T523 528V502ZM416
373Q416 395 410 415T389 449T348 471T281 480Q239 480 213 471T172 448T152 414T146 373V365Q146 348 151 330T170 297T211 273T281 263Q321 263 347 270T389 291T410 323T416 365V373ZM424 -37Q424 -8 397 8T302 41L189 70Q167 51 154 29T140 -32V-41Q140 -62
147 -79T170 -107T214 -125T284 -132Q327 -132 354 -126T396 -109T418 -82T424 -45V-37Z" />
<glyph unicode="h" glyph-name="h" horiz-adv-x="557" d="M489 20Q489 12 483 6T469 0H421Q413 0 407 6T401 20V349Q401 424 372 452T294 480Q282 480 266 479T230 474T192 465T156 452V20Q156 12 150 6T136 0H87Q79 0 74 6T68 20V732Q68 740 73 746T87 752H137Q145
752 150 746T156 732V526Q192 542 234 549T309 557Q349 557 382 545T439 508T476 444T489 349V20Z" />
<glyph unicode="i" glyph-name="i" horiz-adv-x="247" d="M169 658Q169 650 163 644T149 638H98Q90 638 84 644T78 658V738Q78 746 84 752T98 758H149Q157 758 163 752T169 738V658ZM167 20Q167 12 161 6T147 0H99Q91 0 85 6T79 20V530Q79 538 85 544T99 550H147Q155
550 161 544T167 530V20Z" />
<glyph unicode="j" glyph-name="j" horiz-adv-x="247" d="M169 657Q169 649 163 644T149 638H98Q90 638 84 643T78 657V738Q78 746 84 752T98 758H149Q157 758 163 752T169 738V657ZM167 -64Q167 -103 159 -128T135 -169T96 -191T42 -197Q27 -197 15 -196T-12
-193Q-30 -190 -30 -177V-140Q-30 -126 -9 -126H32Q61 -126 70 -114T79 -64V530Q79 538 84 544T97 550H149Q157 550 162 544T167 530V-64Z" />
<glyph unicode="k" glyph-name="k" horiz-adv-x="496" d="M461 13Q461 0 450 0H378Q370 0 366 2T355 13L156 259V20Q156 12 150 6T136 0H88Q80 0 74 6T68 20V732Q68 740 74 746T88 752H136Q144 752 150 746T156 732V316L356 541Q361 546 364 548T376 550H446Q461
550 461 539Q461 533 456 528L236 290L458 22Q461 19 461 13Z" />
<glyph unicode="l" glyph-name="l" horiz-adv-x="244" d="M166 20Q166 12 161 6T148 0H96Q88 0 83 6T78 20V733Q78 741 83 746T96 752H148Q156 752 161 747T166 733V20Z" />
<glyph unicode="m" glyph-name="m" horiz-adv-x="798" d="M730 20Q730 12 724 6T710 0H662Q654 0 648 6T642 20V374Q642 405 635 426T616 459T587 476T551 481Q524 481 494 473T434 454Q443 421 443 376V20Q443 12 438 6T425 0H372Q364 0 360 6T355 20V376Q355
409 351 429T336 461T312 477T278 481Q251 481 220 470T156 442V20Q156 12 151 6T138 0H85Q77 0 73 6T68 20V530Q68 538 73 544T87 550H137Q145 550 150 544T156 530V511Q186 530 223 544T302 558Q334 558 358 549T402 517Q444 537 486 547T568 558Q602 558 631
549T683 519T717 462T730 374V20Z" />
<glyph unicode="n" glyph-name="n" horiz-adv-x="557" d="M489 20Q489 12 483 6T469 0H421Q413 0 407 6T401 20V349Q401 387 395 412T375 453T340 474T291 481Q259 481 225 470T156 442V20Q156 12 150 6T136 0H87Q79 0 74 6T68 20V530Q68 538 73 544T87 550H137Q145
550 150 544T156 530V511Q198 534 234 545T315 557Q406 557 447 503T489 349V20Z" />
<glyph unicode="o" glyph-name="o" horiz-adv-x="545" d="M495 237Q495 182 481 137T439 60T369 11T272 -7Q217 -7 176 10T106 60T64 137T50 237V313Q50 368 64 413T106 490T175 539T272 557Q327 557 369 540T439 490T481 413T495 313V237ZM407 313Q407 390 375
435T272 480Q202 480 170 436T138 313V237Q138 160 169 115T272 70Q342 70 374 114T407 237V313Z" />
<glyph unicode="p" glyph-name="p" horiz-adv-x="541" d="M491 238Q491 120 437 57T273 -7Q250 -7 218 -4T156 4V-177Q156 -185 151 -190T137 -196H86Q78 -196 73 -191T68 -177V511Q68 521 71 526T89 534Q129 544 178 550T273 557Q329 557 370 540T438 490T478
412T491 310V238ZM403 310Q403 349 397 381T375 435T335 470T273 483Q241 483 209 480T156 473V77Q181 72 215 70T273 67Q310 67 335 78T375 112T396 166T403 238V310Z" />
<glyph unicode="q" glyph-name="q" horiz-adv-x="541" d="M473 -177Q473 -185 468 -190T455 -196H404Q396 -196 391 -191T385 -177V4Q356 -1 324 -4T268 -7Q159 -7 105 56T50 238V310Q50 366 63 411T103 489T171 539T268 557Q313 557 362 551T452 534Q466 531
469 527T473 511V-177ZM385 473Q365 477 333 480T268 483Q231 483 206 471T166 437T145 382T138 310V238Q138 198 144 166T166 112T206 79T268 67Q280 67 295 67T326 69T357 73T385 77V473Z" />
<glyph unicode="r" glyph-name="r" horiz-adv-x="342" d="M315 498Q315 481 294 481Q259 481 227 472T156 439V20Q156 12 150 6T136 0H87Q79 0 74 6T68 20V530Q68 538 73 544T87 550H134Q142 550 147 544T153 530V509Q191 535 225 546T294 557Q315 557 315 539V498Z" />
<glyph unicode="s" glyph-name="s" horiz-adv-x="466" d="M416 138Q416 100 403 73T365 28T306 2T229 -7Q215 -7 196 -7T155 -4T111 0T71 8Q50 13 50 28V63Q50 70 55 74T68 78H72Q90 76 111 74T155 71T196 68T229 67Q278 67 303 82T328 138Q328 161 312 178T253
221L152 281Q106 309 78 342T50 424Q50 463 64 488T102 529T159 551T231 557Q273 557 312 554T387 544Q406 541 406 524V491Q406 474 389 474H386Q360 476 317 479T231 482Q189 482 164 472T138 424Q138 401 155 385T207 348L306 289Q368 252 392 217T416 138Z"
/>
<glyph unicode="t" glyph-name="t" horiz-adv-x="385" d="M360 15Q360 1 342 -2Q327 -4 309 -5T277 -7Q242 -7 217 -2T175 19T150 60T141 127V476L44 487Q25 489 25 505V532Q25 550 44 550H141V648Q141 665 159 668L211 676H214Q220 676 224 672T229 659V550H337Q345
550 351 544T357 530V496Q357 488 351 482T337 476H229V127Q229 86 241 75T283 64H339Q360 64 360 50V15Z" />
<glyph unicode="u" glyph-name="u" horiz-adv-x="557" d="M489 20Q489 12 484 6T470 0H420Q412 0 407 6T401 20V39Q359 16 323 5T242 -7Q151 -7 110 47T68 201V530Q68 538 74 544T88 550H136Q144 550 150 544T156 530V201Q156 163 162 138T182 97T216 76T266 69Q298
69 332 80T401 108V530Q401 538 407 544T421 550H470Q478 550 483 544T489 530V20Z" />
<glyph unicode="v" glyph-name="v" horiz-adv-x="530" d="M491 533Q491 529 490 526L355 50Q345 16 321 5T265 -7Q233 -7 209 4T175 50L40 526Q39 529 39 533Q39 550 55 550H110Q123 550 129 531L244 95Q249 77 253 72T265 66Q272 66 276 71T286 95L401 531Q407
550 420 550H475Q491 550 491 533Z" />
<glyph unicode="w" glyph-name="w" horiz-adv-x="786" d="M748 526L651 62Q646 38 641 25T627 4T604 -5T567 -7Q547 -7 534 -5T512 5T497 27T485 65L398 405Q396 410 396 411T393 412Q391 412 391 411T388 405L301 65Q295 43 289 29T274 7T252 -4T219 -7Q196 -7
182 -5T159 4T145 25T135 62L38 526V530Q38 538 43 544T57 550H111Q118 550 122 545T128 534L211 78Q213 69 215 68T219 66Q224 66 227 78L325 462Q330 479 339 485T365 492H421Q437 492 446 486T461 462L559 78Q562 66 567 66Q569 66 571 67T575 78L658 534Q659
540 663 545T675 550H729Q737 550 742 544T748 530V526Z" />
<glyph unicode="x" glyph-name="x" horiz-adv-x="547" d="M511 11Q511 0 498 0H429Q420 0 415 8L272 217L129 10Q124 3 122 2T112 0H52Q40 0 40 10Q40 17 45 23L225 280L55 525Q50 533 50 538Q50 550 65 550H130Q136 550 140 547T150 536L277 348L405 536Q412
546 415 548T426 550H484Q497 550 497 538Q497 533 492 525L324 286L507 23Q511 18 511 11Z" />
<glyph unicode="y" glyph-name="y" horiz-adv-x="534" d="M495 533Q495 528 494 526L329 -50Q317 -91 304 -119T269 -164T219 -190T146 -198Q125 -198 102 -196T62 -189Q53 -187 47 -184T41 -173V-136Q41 -120 60 -120H63Q80 -122 107 -124T152 -126Q173 -126
189 -123T216 -110T236 -84T251 -41L261 0H247Q236 0 226 2T206 11T188 32T173 69L40 526Q39 528 39 533Q39 550 57 550H112Q118 550 122 545T129 534L247 100Q251 85 256 82T266 78H282L404 535Q406 541 411 545T423 550H479Q495 550 495 533Z" />
<glyph unicode="z" glyph-name="z" horiz-adv-x="482" d="M432 20Q432 12 426 6T412 0H110Q78 0 64 17T49 55V74Q49 95 54 108T72 139L330 460Q334 466 334 469Q334 476 324 476H81Q73 476 67 482T61 496V530Q61 538 67 544T81 550H375Q406 550 418 537T431 501V477Q431
461 426 449T408 422L145 93Q140 88 140 82Q140 74 148 74H412Q420 74 426 68T432 54V20Z" />
<glyph unicode="{" glyph-name="braceleft" horiz-adv-x="331" d="M304 -174Q304 -182 298 -188T284 -194H233Q187 -194 158 -188T111 -165T87 -123T80 -56V120Q80 143 77 161T68 193T50 220T20 245V303Q38 315 49 327T67 354T77 386T80 427V605Q80 645 86 671T110
714T157 736T233 743H283Q291 743 297 737T303 723V690Q303 682 297 676T283 670H238Q216 670 203 668T182 658T172 638T169 605V427Q169 374 154 338T98 273Q138 245 153 209T169 120V-56Q169 -76 171 -88T181 -108T202 -118T238 -121H284Q292 -121 298 -127T304
-141V-174Z" />
<glyph unicode="|" glyph-name="bar" horiz-adv-x="249" d="M169 -175Q169 -183 164 -188T151 -194H99Q91 -194 86 -189T80 -175V724Q80 732 85 737T99 743H151Q159 743 164 738T169 724V-175Z" />
<glyph unicode="}" glyph-name="braceright" horiz-adv-x="331" d="M311 245Q293 233 282 221T264 194T254 161T251 120V-56Q251 -96 244 -122T220 -165T174 -187T98 -194H47Q39 -194 33 -188T27 -174V-141Q27 -133 33 -127T47 -121H93Q115 -121 128 -119T149
-109T159 -89T162 -56V120Q162 173 177 209T233 273Q192 301 177 337T162 427V605Q162 625 160 637T150 657T129 667T93 670H48Q40 670 34 676T28 690V723Q28 731 34 737T48 743H98Q144 743 173 737T220 714T244 672T251 605V427Q251 404 254 386T263 354T281 328T311
303V245Z" />
<glyph unicode="~" glyph-name="asciitilde" horiz-adv-x="605" d="M514 467Q514 404 490 372T405 339Q385 339 366 346T329 367L256 425Q234 442 224 449T203 456Q174 456 168 440T161 397V371Q161 363 155 357T141 351H112Q104 351 98 357T92 371V397Q92 462
120 494T203 527Q223 527 242 520T278 499L363 431Q372 423 384 417T405 411Q433 411 439 424T445 467V495Q445 503 451 509T465 515H494Q502 515 508 509T514 495V467Z" />
</font>
</defs>
</svg>
