0 0
0.234867 100
0.415189 200
0.618814 350
0.769859 500
0.899929 670
1.05441 950
1.1698 1250
1.2985 1750
1.3901 2300
1.46718 3000
1.50654 3500
1.54826 4200
1.58357 5000
1.61612 6000
1.65056 7500
1.68761 10000
