10000 10000
5827 9851
715 4805
7938 3417
8860 5437
7116 9833
7335 910
5806 4112
4887 7851
7908 2828
1671 4707
2189 1587
1540 6426
7260 6103
773 8316
3024 8972
8911 3839
6918 1869
6884 4713
2173 9724
3661 6994
4730 6440
2568 3211
8798 1028
9139 3599
2149 486
3961 7129
6687 1981
1132 3686
6453 839
7493 4700
9828 9025
1096 8219
5822 6176
6235 6003
7154 7408
712 503
6984 4251
2672 9297
7377 1421
3315 4677
1870 2373
6014 5066
8096 5742
4948 1926
7296 686
6992 8857
8817 9407
3977 1630
9810 9148
9527 749
2088 9806
6501 6388
2492 7305
8184 6376
9809 2080
9695 3510
3528 7312
4636 1822
7463 6844
946 8227
3975 1284
9470 2844
4781 2235
2155 1231
8988 1433
1313 718
9865 2607
4926 1154
8239 8377
1736 1352
1876 456
9665 5833
3644 9473
4891 4862
588 9920
1726 2980
3505 2545
6153 5644
8962 4752
2101 3030
3523 9647
5472 1839
892 1080
57 6312
1274 1748
1447 5289
276 6348
7550 5158
4336 3454
8404 1345
4183 9186
4529 7121
2966 348
2054 5937
6279 9317
4928 3579
7487 6374
3069 6967
9257 1156
5070 7758
1475 7666
3693 8948
6455 1907
9553 8310
7790 5360
9519 2592
9712 3977
1235 4898
574 2079
448 1028
6403 641
4692 5511
3944 1237
4495 8654
5496 3882
3318 861
9860 651
1411 17
2775 4406
6511 8192
9020 30
9139 9618
2319 4287
6667 6640
6305 9392
1165 8988
5456 1325
1784 6465
2630 9829
1167 6380
4897 7121
2792 9836
6435 1191
3025 3110
6347 9006
6675 2716
1412 6578
3657 7599
9132 6922
1986 7682
4039 4376
6757 977
8773 785
2309 162
5042 9246
2757 6554
3660 2162
8893 9443
650 1277
3518 7005
731 3216
2931 1411
8413 82
1560 4175
3727 9347
4063 2209
489 6159
6337 8923
2602 7397
1474 3633
6578 9784
7192 9743
2737 9877
8893 7755
3712 7174
3363 2941
3167 6903
1111 1580
6302 1592
5753 8379
1664 1378
6107 2179
6893 9837
41 7843
6247 816
4664 4454
9935 1546
1729 8980
9529 9026
239 6155
5197 2810
6823 3551
1183 586
616 5535
6961 9194
6772 1706
6647 5182
7038 2866
5628 2009
724 752
1620 1356
6366 745
641 7838
9111 8688
5114 7952
5020 3803
7512 4689
1955 6698
7683 1600
9326 9973
2333 6944
5104 7045
5437 817
2111 2854
1903 780
6106 4827
921 1679
4013 6707
5361 698
3107 5755
8093 8425
9963 5940
5899 9747
9534 8870
323 706
1456 6596
5498 404
5029 9746
2936 3457
2295 4037
3756 7454
3861 1403
30 5106
2445 4315
2517 9207
5740 1229
5211 9027
9205 8348
8429 9191
6897 9019
8743 8248
4167 423
4064 1100
1853 9323
3266 3399
4893 6089
9293 7607
8218 4280
1275 1773
69 1625
1671 2877
8363 5855
3498 3463
4290 125
1543 5735
5172 258
728 9690
3722 7011
1239 2066
4669 2216
5297 523
7385 4762
4984 1087
8900 1418
1737 9703
9309 6
5214 5492
5048 1768
5364 6093
8633 8143
6207 5289
974 2626
4348 2847
9330 770
8599 604
832 7327
1583 2597
7429 3582
7367 5406
2185 4938
6638 2042
3391 5833
8369 2339
3658 6336
3503 860
5826 889
7294 8038
4712 1395
5820 6192
2071 1115
5016 7219
5947 2186
1122 2508
1783 7695
5809 651
5377 9423
1491 7052
8480 4330
9194 4675
3081 8319
1525 6830
1334 9091
1436 2902
7817 7694
8881 550
7664 3542
7731 3918
2185 9553
4900 1034
4615 1716
813 4575
8501 6385
5489 8118
2619 1265
8576 5261
5999 6174
2253 953
797 2325
9169 304
7210 5114
5409 6327
2005 1324
1278 4215
7200 810
3116 8533
270 1878
1877 7506
3677 8729
1502 976
9557 2951
235 5590
577 2517
495 9766
1726 5176
1094 9405
9138 4175
4806 7355
2864 6580
1330 356
5208 5343
9650 7718
7732 2188
7936 7436
5744 1822
4388 3714
3849 9011
3490 8665
8778 2426
7506 7693
9042 6611
5105 5334
5338 5094
2918 4284
8182 9206
856 558
8683 8391
3134 4725
5088 2734
2454 2164
6103 728
986 611
8525 2382
3263 6221
3584 5143
992 4278
7841 2302
3004 4721
1338 9478
2043 8416
7778 9643
1190 2845
8350 3195
5880 5273
3370 1381
8959 7156
1641 9136
1815 4460
8489 6543
1770 1497
9003 4067
640 4184
9554 5074
1117 1238
921 1399
924 641
8873 4410
966 2905
8731 1618
9416 7436
1020 9303
2115 450
5807 3197
9381 7014
519 5518
9593 934
68 5063
2586 4429
1325 9990
6910 3455
1664 9090
289 9733
6102 3339
9951 6234
5370 5220
7254 9940
2811 990
9418 3287
7536 8759
2635 4070
7100 2179
7381 5244
67 921
2183 9915
2171 5426
2374 5283
6630 477
82 6820
8735 4039
2440 8759
7603 5257
3818 1098
2002 4242
8429 8411
9557 3062
4209 4855
4291 4407
1382 9411
1615 5828
1229 2363
8516 5839
636 1065
980 4883
6695 3688
684 7429
3867 681
7484 7146
1052 4342
951 4634
6770 1765
5622 5811
4255 5408
1089 6161
676 1619
4512 6429
741 9685
5887 3460
7658 6650
7057 9625
2968 8936
6038 7741
9727 6472
3632 5998
1812 992
3890 6590
5970 9103
3274 8101
9373 2424
6673 9178
9944 8787
656 6302
6487 6608
5525 9369
6695 6622
6534 7881
6493 1819
7989 9752
8348 1036
8453 1085
3707 4719
764 2310
2086 2143
2778 3493
7075 4952
6553 4040
3928 4876
197 5950
9612 2982
541 9654
9371 9836
2106 5290
5774 1178
2672 4316
3658 6317
7076 4144
5255 4316
621 4539
6772 5806
3725 2474
9625 7160
9185 1877
206 4278
1543 7269
1546 9309
5920 6484
142 8350
1958 7189
1299 3741
8096 2836
9649 226
3956 8302
2498 6464
9916 2100
7286 4820
1196 6924
1272 5568
2130 8825
1952 8425
4127 156
171 142
9589 2570
9064 8490
3602 304
5540 1356
9676 4485
8681 9412
9037 3615
2386 4656
9746 1593
946 7113
6830 1187
4406 4584
1428 9866
712 7485
6708 362
1509 8993
1349 1169
3489 5321
7269 1061
1882 990
4701 4521
3178 7563
3289 2604
3857 3047
1382 8467
3442 4884
4988 9304
8940 967
1150 3298
9788 4825
5231 1639
7410 653
1176 4384
9137 2643
6984 5580
8459 9196
6171 1511
8396 6031
4238 4716
2293 908
7969 5945
525 3535
9357 3938
8467 9366
9385 7960
3622 855
7736 6364
2328 572
5381 2095
1793 2992
562 4139
7088 415
3421 4567
5191 8744
2132 8023
5064 9862
58 7795
8010 2736
9115 2985
5793 6782
7788 469
2253 4717
7750 6608
5473 2084
5989 1958
5607 408
4076 3948
1570 9741
3195 3346
7252 62
6548 8598
5985 6654
5610 3865
2851 3664
7227 5734
5712 2564
960 6288
3017 1524
2594 4139
8036 2574
6895 478
4796 3202
1853 1911
4919 9086
5183 3583
1097 5848
9782 3904
2552 3148
4457 4548
9295 695
4919 3936
3926 6723
2604 8657
8850 659
5075 7653
4889 8386
6636 1934
9177 7351
4782 9090
6601 2716
5406 1558
6080 3471
689 8333
9781 6328
9374 3547
9958 5244
7207 735
3661 8850
6601 4129
1056 4708
7330 7239
120 9912
6691 2222
5860 1407
2007 6247
9759 1085
2835 1328
7151 1803
9149 5973
3600 8298
9474 2343
1984 1929
7362 1740
1820 6424
4239 2566
2699 3293
6983 5448
4265 5431
2109 3943
327 4354
3695 1070
5057 8699
1075 5796
2096 2916
531 7841
1921 745
6812 8495
9189 2404
2449 9486
1754 6510
1445 4378
6283 9239
2681 1761
5380 1112
9186 4080
6424 9447
1039 5405
6838 716
5609 8410
8761 8689
9531 9112
1872 6014
8085 2875
9917 8758
556 7901
6033 6828
1556 6053
536 2410
4096 5353
6897 9940
5017 7393
2529 5912
6254 3566
8664 1880
2091 395
3364 8668
3565 4659
7029 1569
4628 6899
2577 119
5258 3377
1976 218
4243 9086
3626 3102
4693 4024
9768 5553
2411 9187
2617 11
9812 4024
542 7593
8049 1822
2184 9435
6608 6281
184 4458
5186 2528
2247 1582
6691 9235
5047 6335
427 1053
5482 1419
6192 806
1393 6711
6047 3612
6264 1209
8747 9412
1696 2838
3956 7771
7101 6311
892 5474
577 2385
3142 7801
3000 2517
6016 2954
8230 5493
7363 5610
4398 664
1336 124
5621 7296
782 7063
5878 7706
5577 7592
6102 486
2156 2171
59 6120
9674 2358
9433 9869
9289 8534
2813 2722
2649 1711
957 5890
6948 1422
1503 110
3894 1633
8282 8002
3343 7545
9467 4742
6614 2287
3112 8530
6864 9493
1370 1653
2 7822
1654 4856
6291 3856
6956 1806
4261 2377
3572 2543
4022 6000
758 1605
1426 3613
8889 5719
5099 844
2335 7988
9195 7982
5135 4546
5241 1985
4178 4440
1643 5841
6897 4872
2523 6206
6303 5345
7853 448
6708 1124
2528 4632
1721 4661
9746 4041
8939 4149
7593 3287
8154 158
1680 5023
2721 6766
3550 7975
8923 279
9230 5623
1267 2566
7162 4104
4556 7651
3144 9420
9139 6888
9354 5919
6786 3062
5697 3356
6375 2116
7010 4515
6196 9930
684 3449
8407 3005
3768 9104
4413 939
4578 3305
1779 2937
631 8311
1021 1771
9183 8646
4394 5749
7725 9004
5640 2095
4373 622
1124 9102
4174 246
261 7489
9384 8532
1178 4504
1439 4787
2288 2460
8832 1950
5736 4411
9691 1202
7833 2259
4970 5477
2450 5969
9345 9111
1874 250
7431 136
6796 1401
7316 6746
8053 8986
3675 8633
4768 3784
7818 520
9788 6850
1391 6014
1356 2226
1277 5697
4423 2401
8832 8657
2497 5397
9486 2009
842 3053
4782 7585
8982 3199
9309 5287
1804 7615
8782 2879
1059 2323
6033 2344
1450 4852
9912 5185
6070 6744
4198 9725
4129 6990
7353 3859
177 5305
6362 1240
4567 2001
7363 8353
9721 6566
432 8756
4883 9766
2648 9022
2217 2881
6622 9610
2944 8715
8611 3312
9294 6211
7438 61
7582 9553
911 6450
344 3781
2832 1967
9601 93
7133 1985
271 5927
2838 585
720 568
2546 7279
8556 4412
1990 2215
7 9424
9959 1171
1355 1227
4620 9561
8246 2356
5367 8726
7072 9568
6390 1587
5328 9067
4309 487
1103 8057
1622 9214
45 2189
1236 9257
5138 5450
7492 6133
5672 9465
4684 6464
2871 282
6777 553
2417 9165
380 4376
880 3763
4708 6350
9500 9393
5666 2798
9137 7622
3753 4700
256 9997
5269 6260
709 4117
349 2350
6874 62
7308 1057
2601 1446
4044 9750
4759 9718
6628 2319
7040 2583
4564 3047
9933 280
6237 6475
509 1636
839 2106
7747 864
6685 2057
8764 4723
9660 7929
7844 3945
6140 2045
1290 7913
2270 8871
0 5253
8583 8403
1735 1825
5675 9014
43 5208
6542 7080
571 2236
1895 5344
5581 3165
6854 1806
6479 5628
7463 6015
8416 9808
4983 5148
6128 6297
6406 2949
8469 1283
6206 7100
3135 716
6867 4900
3311 3625
9196 1564
1124 9446
577 3334
1349 4014
2629 4830
7478 8618
438 4759
8485 5084
8659 8551
9060 4495
8813 5862
7788 9287
481 8115
5855 831
9908 1896
1583 3715
6768 3807
8718 2874
3487 1077
8245 6489
1893 5678
137 9524
9906 1161
6314 4245
8552 7365
174 9362
9259 3732
6718 6715
1719 5311
3727 561
5670 7275
4004 7933
1153 154
8050 16
790 6884
5060 7942
6316 3064
6512 369
9059 9998
233 2195
1535 863
2615 9036
4919 1527
4084 5285
184 9481
2567 4491
5200 8851
855 4705
9736 2804
1336 3487
1137 9612
650 1695
3058 9859
643 2762
4032 6589
4169 3646
1040 8011
9365 2307
2073 1989
1540 8222
5470 1112
1872 4021
6954 2218
9710 1189
3692 7494
4473 1024
6741 1428
9471 8107
8608 1399
250 7895
2834 7870
2114 3741
450 1939
9233 8624
2714 3944
3576 1950
2654 7620
352 8439
1261 4584
979 8817
2454 278
2571 9947
8301 2276
1579 737
2174 1645
5038 384
3648 249
6428 1898
8014 8239
9172 1483
2402 9528
278 9933
611 7813
5936 2153
3089 2627
6204 4991
2014 7982
9960 8232
5615 8180
4326 9114
6755 2556
1157 7196
995 1751
9536 6267
1931 6661
5349 5036
7944 3115
7336 6066
9235 5732
8537 9154
349 181
1459 8614
1083 6053
183 3439
356 8477
3432 2574
9143 7485
9512 4884
7875 8175
6692 6505
9730 1119
8683 5786
9717 6235
7733 6822
6678 6808
8977 4092
2826 7782
8415 7325
4933 2404
463 3783
2675 3046
218 6421
4388 3942
9152 657
3623 8634
5985 8235
4426 757
1008 8127
5505 9887
52 3570
4885 6169
2833 3965
2175 348
9880 7501
9861 6338
5546 7065
3524 5080
530 9158
1328 4673
3875 1305
519 5550
6639 8587
60 573
6139 8801
8803 3920
8479 252
6824 5872
2130 893
5765 7809
421 7022
419 9623
8319 8974
2337 5545
1353 6331
1523 1046
6699 4276
7181 1893
9639 6191
1696 6337
7107 6905
3907 1493
29 4012
3718 4900
8107 4886
7299 8940
2976 2504
2183 956
6422 7547
415 4259
9736 2218
5862 9659
4318 9372
7934 3943
7103 8416
957 6904
3394 2191
6362 8006
7318 3500
7816 9165
5683 2767
658 4758
1616 2066
7287 424
6711 8715
8169 8814
8325 9836
6256 8506
5414 5975
1749 1290
3985 8598
2187 9131
3695 3994
5280 6012
7490 3330
7925 4276
4532 9247
7130 7893
9405 9797
590 3347
9722 5221
1717 7344
2602 937
107 2506
7882 6895
3927 8536
8067 7113
6292 1265
5922 6772
5484 7533
1593 2392
5574 7232
773 9695
9874 1524
544 1290
738 9205
7975 6000
9051 6835
878 6008
8604 9044
6066 1754
1023 1897
7199 4769
5197 1250
7203 5635
8135 675
7971 8308
1618 7497
9742 9063
2227 3832
7599 6407
2939 1639
438 6805
5572 9279
7064 9811
3965 9663
758 832
387 5363
7596 2181
6321 6726
8347 9744
7336 2390
569 4670
9634 1463
455 1887
2164 1851
7667 5444
5123 1216
5295 1276
8552 2746
2370 304
9430 67
7502 3995
7851 6240
2769 398
870 3958
4912 4451
1832 1869
8929 2112
9758 9683
3912 1662
9534 8692
6212 8507
1775 3737
9946 2637
2670 1390
6371 2488
9263 8425
2754 1762
8352 2375
136 4740
6612 4441
6139 9155
7775 7152
9892 7233
381 2404
3097 398
4360 6939
8763 3362
2874 856
1008 7535
5551 8834
1475 1795
8750 7063
490 1468
1466 7697
8872 2031
4036 3831
484 6682
420 1287
8667 9832
3688 6803
1906 3525
4075 3561
9214 355
4953 2231
8775 2204
1154 5855
5690 6233
1438 8007
62 1106
4176 1141
9289 5063
190 4713
1156 2206
5199 1707
524 2286
118 4214
1755 1596
7983 533
8758 3028
2807 8910
8296 2458
3616 5468
7088 1473
7429 4673
3878 6556
6411 7723
8995 899
7609 9366
6737 7720
490 5315
1873 1867
1136 5672
9436 283
5563 5911
9724 3662
5018 6099
8300 306
1713 6769
6573 7460
9547 2940
2490 7746
4434 1307
6734 7036
5390 4230
6101 4176
5466 7863
3648 1191
9229 1902
4797 2073
5399 5528
8967 3272
5658 4240
9497 1804
4396 9398
649 5642
2714 5616
5667 5259
1918 5230
1314 778
8116 2674
4566 3806
554 5648
2387 537
678 7794
5831 5648
9020 4063
1710 9916
2592 5165
9049 6432
9721 9076
8652 3435
9031 2437
695 336
5479 4443
8840 5397
9700 529
8366 2266
2512 8277
225 4458
19 5163
5280 3734
2594 3972
8779 4848
7476 7632
563 3253
5921 6530
5518 9759
5469 7300
239 5498
836 1675
9318 2901
4005 2251
1252 7563
8276 5902
2130 9011
43 2753
9570 2484
4160 8256
1061 8061
221 99
2398 3684
8636 1336
6248 5038
1713 6564
7252 9455
1117 5732
7285 4033
4224 7529
3424 7290
6655 1987
5901 3449
2870 9005
4339 7634
1935 5994
2276 3819
6228 717
1060 9797
5377 847
8672 8431
5710 5213
5596 503
6860 3200
8414 3811
1805 7442
5993 2463
6632 541
2172 6839
3341 6518
9981 7272
6007 6810
4512 5122
2992 9031
3340 6016
3833 8494
8991 5067
7498 6232
8353 4828
3238 6743
2903 449
6451 5534
361 3682
1833 4419
7174 5908
88 7588
2262 2909
9407 3640
4385 937
3498 4280
6942 9117
796 8254
702 4346
7069 3996
586 8196
70 6799
4858 9204
4427 6741
6071 6666
519 5950
7203 7191
2766 1440
8 2874
1503 7197
2415 4506
6217 2632
8786 3763
8769 1877
5667 4404
976 7041
3807 4265
7345 9890
5677 8532
252 8464
7419 2257
8364 1845
6923 425
2056 1456
2954 3384
7376 7040
882 5035
1718 7183
7776 9740
6592 2733
8584 9345
4027 6367
5975 1809
9698 312
6826 1160
3935 2262
5149 6413
5680 6592
8295 2386
9662 719
7284 5773
1210 7738
1506 6005
521 726
6496 6414
3282 9197
1444 312
4821 9903
4268 4724
863 3975
903 3018
7579 6624
6454 7447
187 2455
1645 282
8311 2002
3934 961
4596 5473
2231 4096
2473 2980
9514 3810
8031 2958
143 1650
215 9736
613 6492
288 9033
7806 2608
6009 9733
508 1559
7012 3315
134 5593
1755 9475
4752 6062
6535 8671
2138 3027
2911 5058
7847 1536
9134 9015
7872 6439
856 7651
5082 4016
2062 6949
5798 563
5072 3933
2936 7301
3155 5291
6986 1302
2003 7001
6338 9466
3435 1836
1441 9720
3730 535
1725 9855
5064 2912
7889 7567
2881 9591
2499 1015
6609 8036
3207 2859
7177 1264
1346 8344
3025 583
1026 6363
7623 909
1740 222
807 5551
6581 5365
9547 9915
597 8617
6164 6274
4585 2818
1754 3964
6904 1866
64 7613
3961 5903
220 695
1491 6249
8438 240
9444 1230
5438 6149
3222 5266
9875 8176
3439 7123
1537 630
360 2788
187 5731
9648 5319
5658 570
8786 7761
436 7080
2052 377
3120 5353
2177 4929
5849 4781
1194 7864
7761 7372
9496 3886
8200 8615
5189 6426
4669 4273
8892 5225
7828 9534
3134 3096
9337 8906
2311 3316
5908 8381
9840 2927
8590 830
7590 7878
6355 9110
9130 6960
8999 1687
5723 4954
3518 1852
2305 7905
6631 2131
7755 1136
3352 936
2395 3979
5792 5395
9168 2730
6537 6773
6981 4474
365 1343
6664 2016
1227 372
6174 2416
745 7600
1813 765
3740 6184
1930 3234
4438 7956
491 8080
9503 9275
5920 4537
9047 6157
4726 8092
4251 823
1499 1906
3206 1875
321 6617
3610 4558
5309 702
2223 542
1359 433
8651 7683
199 51
7826 1356
7094 7043
2592 1662
6723 4537
4149 1473
799 3843
9457 9644
4251 847
128 498
392 7767
4055 8204
655 5955
4304 1177
9938 956
9906 8499
9922 4733
3093 4404
9539 287
4644 1289
1725 8021
9939 8550
3957 6773
3363 122
6155 8424
2404 517
7924 7747
7755 8391
3627 6583
8261 3258
6804 7222
9338 5794
8434 5160
324 1636
714 9037
9554 1893
2374 531
745 4292
1678 4330
5658 763
9268 6038
3402 9394
1487 8421
78 5509
8475 2498
9781 1304
3199 6473
8954 1111
8671 5180
9562 8978
1027 8565
5859 521
5719 6349
4686 9764
6196 3548
5134 5079
7407 8290
6441 4292
5024 1237
8263 3265
7814 2348
6648 1227
9578 5532
9867 5467
9169 5680
2941 9288
1797 4799
2270 7533
4406 5721
3674 5725
653 9345
7990 2660
8290 8513
1402 9296
9999 1067
4190 5904
1556 748
2136 3100
76 4646
597 1493
8528 750
8085 5117
9098 3250
2140 1066
3917 399
7878 9863
8483 8995
7835 876
6935 7086
3652 2656
4324 5134
2685 8220
749 9355
539 2225
815 880
7071 2365
948 8748
3643 3178
2681 7320
7925 5335
5331 3641
5722 4027
8493 4888
2917 5943
6725 352
7888 9547
2359 247
4905 1084
970 257
9945 2533
7130 1954
9858 3499
3461 1235
2055 2645
1515 8295
560 7868
4255 7437
9421 2528
7011 7304
6123 9083
8339 7854
1525 7610
7680 3870
4957 5912
1697 2582
9467 3181
805 708
9701 232
1468 6811
1248 4089
6550 4280
4549 1202
2971 5285
4984 3838
6813 6109
517 7602
827 1713
1308 8643
5848 5819
1583 7433
4171 4194
3705 1955
5608 4029
6449 1835
2127 43
8478 7771
2419 6802
110 6720
5518 3879
3906 589
4355 1822
8268 2115
6068 1713
3932 8608
6101 8262
935 8150
768 8924
6586 9102
6219 535
125 4732
6503 1469
3723 3653
5738 4207
6560 9118
4304 6956
1476 646
845 1778
4488 1015
8774 4678
8190 5929
6896 1254
5502 9416
9465 2110
4758 4567
2070 7352
8162 7588
5725 1431
3517 3086
9572 5493
3398 8100
7337 6987
4006 496
1171 6738
8928 8773
953 6168
8362 3189
5906 2741
9020 7589
9996 590
1431 6916
9041 5033
7096 5146
3751 3474
9884 9886
3431 9246
1990 2219
2689 9646
8831 6324
2205 4278
445 405
1285 7710
6983 2668
17 4713
8792 7879
8771 9941
8066 2719
4996 9250
6406 2694
143 7110
1409 2030
4349 1936
6648 570
1264 7643
1543 6777
36 2630
838 4239
210 2338
382 8038
8103 5355
2299 3270
9492 1706
7154 4400
8712 5258
212 4369
1755 8890
7699 4421
4732 7923
8021 2794
2334 9659
1527 9127
1662 9609
9316 1916
6536 7354
1446 5435
7178 2434
7196 2824
8697 4471
2205 2382
3715 8971
7275 3778
9349 1336
1083 4427
4510 8385
9701 9074
2467 5878
6423 5878
1604 3688
4191 83
1903 494
5784 7924
1780 6072
244 615
5753 18
523 5713
9982 5883
8227 1681
5444 5702
3217 8041
57 5152
7151 8442
3831 5220
430 3695
831 2924
6718 9773
3551 9304
28 5497
124 4275
5610 2330
8396 4404
7669 5905
6706 9379
9411 5543
6463 7517
4012 6486
6967 2410
8780 4938
6963 8108
6005 633
1221 491
4489 1488
6017 4527
136 2304
2409 173
4871 8666
1657 6885
227 1399
9525 5195
3508 7211
3360 8277
7173 5146
4511 6693
9331 8683
6925 8168
1092 2748
4944 221
3577 7350
2203 5642
2023 2195
5285 9244
9779 3630
1706 6525
3036 2026
3297 6955
6142 6309
8222 8214
9123 797
6713 7962
6493 3108
9918 6062
194 7489
2310 2764
6390 4487
7847 6402
927 8713
4615 2088
8421 7310
9238 52
265 82
2093 7866
2040 5773
433 9064
5615 984
1277 224
2593 9421
2207 1191
6071 3694
8385 6654
5511 1642
1515 9295
345 6795
5479 7195
4598 338
549 4001
6033 4791
1968 1793
8874 6316
7745 4066
657 3570
5123 913
1832 2143
119 8923
8044 974
1912 8317
5397 9798
7377 5545
2028 1072
6637 5403
8445 1123
3071 877
3789 5074
7124 2185
6189 4729
7974 2429
6512 7188
7155 1507
8585 1873
3885 8897
921 2022
6387 991
3448 6022
6895 2343
1521 5872
8833 9906
5811 6920
1533 1920
8004 8475
9280 3144
937 1117
1769 4865
2004 1861
2725 2447
1870 9755
2731 3955
533 304
8986 1340
8935 687
2671 3923
8159 9683
4795 1782
1647 2762
7957 7106
5871 7768
6604 5590
4709 6127
5376 3590
1446 7309
3633 8221
8108 7478
2552 1207
3737 2371
3333 2846
3002 4715
4600 483
6767 7922
932 7232
8314 6992
1040 683
1142 9891
3712 1101
6506 951
644 6787
2942 4644
895 8437
5597 7273
6539 2038
1180 2776
572 2412
2506 5105
946 8192
3193 5700
98 4807
5579 8498
4006 98
4128 8707
7204 835
7200 2861
9485 4146
5619 211
7512 3359
5577 7452
718 5496
1767 7462
7223 3757
639 3866
37 258
9844 5058
9902 8181
7852 5016
5680 9840
2326 5009
128 2145
605 6906
3876 6857
6862 1745
162 2834
5623 6871
3944 3205
8193 4837
94 8490
768 1853
3032 3088
4616 4962
1633 6144
6946 6523
7716 7598
8095 2051
9212 895
2412 1445
6927 2081
7847 6678
7511 1831
9024 4931
673 4452
1411 4701
6905 3339
902 466
6694 132
9198 5774
8561 2609
9319 1842
7372 2561
6516 8947
8705 6373
5715 918
1816 8482
8004 9371
1901 5974
5404 9879
3729 1102
629 6551
128 152
9224 8882
3380 5268
766 5854
7640 6608
8835 3109
4734 964
3692 2809
3765 5755
2715 7542
4550 3460
3328 8343
430 7703
98 2204
7696 9916
4382 9578
3148 3128
5791 2355
2747 9417
8591 2184
572 9525
1229 237
9956 3934
2288 4908
1537 5800
4091 9612
1200 1454
5297 4578
1104 4578
314 1240
1063 228
3927 4366
4099 1588
5299 2223
5587 9467
1898 1446
9975 631
2414 3680
8789 5174
456 676
8382 8390
6860 432
1744 1801
6416 3221
2221 7582
5134 9638
6844 7342
7079 3964
7566 2741
2619 2062
7220 3810
9239 7247
3216 1552
174 2745
2585 4357
7371 2473
7106 7755
5445 2154
7917 9181
212 6343
7452 1749
3811 5051
1960 2532
9911 5579
1814 6145
7263 7063
1335 9573
9117 2892
4110 9030
8004 7277
5527 7123
8769 7892
9735 1551
1679 243
9823 5938
9542 5712
5220 2765
244 3985
7860 5804
6750 6115
5393 3712
616 194
7218 2622
4900 8612
5691 4930
2968 4902
1865 3384
3107 3148
7507 1484
4801 7938
3166 1456
1677 7257
399 1438
8502 3487
4358 6975
1253 9405
2233 5244
7006 4967
4222 323
9909 3263
4670 6236
2307 6555
1446 1787
8169 4153
5344 2681
8692 9024
3714 1087
1522 3832
2612 930
8996 1149
1335 3525
7028 672
1013 5659
9864 975
7300 1549
1256 6470
2511 5051
6205 2021
6950 9718
7226 3747
2917 7085
1872 6132
67 1686
6700 7992
2395 6752
612 5108
4272 2742
7010 372
6861 2231
31 8353
1466 8371
2612 6479
4358 3065
8413 3323
6657 527
4575 4467
9113 65
268 6902
1961 8846
3092 9214
6732 2303
5806 5115
4248 2346
2392 354
9656 118
1291 549
7338 9903
370 8469
7339 5388
8396 1333
1680 7375
8304 3009
966 3805
4449 590
892 6895
5906 1140
2895 1640
9979 394
9638 4328
2621 7697
7424 1296
6531 8787
1131 1223
7481 77
5030 3949
7489 235
3193 1086
4756 5763
5795 8377
2390 5925
9492 4433
3069 2641
3533 99
5939 1785
4420 4953
3706 2569
5708 6703
3279 3140
6357 6149
2386 337
2991 8564
4437 9222
741 2292
4067 3283
4600 8972
3940 6018
457 6028
9070 5677
8812 6440
8365 5137
3705 917
9910 8674
964 5786
9240 1456
7663 9999
2853 7976
7695 6936
2624 6333
3932 4824
1862 3048
4829 5904
4658 6222
4852 4983
6652 2977
2581 4542
6578 5146
4365 3188
3754 2805
7168 4184
6758 2125
6995 6829
2137 1418
364 6355
73 7384
5207 6787
3093 7770
5914 4603
6441 3503
1035 3339
9584 8660
7905 639
73 7050
1640 4238
4317 9753
3672 7122
5584 2389
4664 2201
1750 3248
1439 9227
4984 4272
2604 2253
8199 3250
967 86
8592 9839
5736 176
2657 3774
7062 3313
5755 3867
9138 2507
3400 5703
2885 7712
4575 7263
1046 7642
9765 209
2273 5849
199 9436
6997 4030
5877 8823
7853 8025
593 518
2977 7774
1688 6296
1549 1805
9632 4692
7763 706
2131 997
5357 8650
1066 2308
6581 8951
9742 7045
1736 8869
427 5860
2088 9198
4151 4146
882 6443
3793 6906
7920 7149
9053 3897
2079 7707
7887 1934
1251 4748
9893 3981
3625 3287
3194 6394
5614 665
4568 1589
9614 8823
559 2609
9951 805
995 2409
5279 8486
9722 8149
3019 820
4311 1177
275 2195
1344 5775
8938 7585
1559 8855
9442 4560
7575 4475
7015 3288
7084 9672
442 3063
120 3754
4417 6170
9252 9895
9325 2416
9012 6702
9100 8348
4654 4129
8048 4332
1004 2481
5760 8137
1328 5050
1006 6062
2696 9279
2489 8827
2226 8518
2435 2364
3281 4983
5990 8582
6176 881
3906 6082
5238 1102
4282 4190
4459 3976
8224 3839
6971 1628
6718 1291
1657 622
5735 8199
8917 9613
7644 3564
4881 5048
5795 9855
4384 6993
9702 7297
6656 8273
200 3524
3849 4892
5053 5376
4662 6102
74 20
2292 5030
2410 8977
3257 1627
259 2035
6775 9293
7081 4209
2033 3109
7169 1016
9645 6558
6184 8611
2763 205
3061 62
469 464
733 2138
2759 2820
7622 1763
6352 1657
6270 6321
7865 5513
428 988
4214 983
9302 7283
619 3477
9653 6447
2689 1001
1670 7555
5898 3440
6563 7207
9825 7987
3474 6214
3428 601
1340 1380
4246 2717
4560 2724
1009 1121
5768 3592
1049 660
2877 2506
6903 3856
8327 1867
9012 951
7991 2363
2948 2735
1225 520
6821 939
8260 842
6216 8381
5380 766
5711 2728
6378 9090
9240 8059
561 3505
4505 2075
1972 1102
5404 8879
7487 8118
9821 4818
1508 8305
130 5940
6783 1754
3770 8882
2907 2463
3385 6488
1414 9707
9587 9524
6418 6754
7366 1789
5534 9501
6446 9524
8053 3031
8899 105
5109 3926
2661 9857
6947 3854
3611 1670
4956 3939
7624 9152
831 7325
991 483
9258 337
4889 7017
9442 4094
1221 7473
5095 5476
1679 3384
951 9756
6723 1559
1153 4836
5252 1100
7405 7290
8888 7166
1146 9067
7206 9628
8280 2108
6116 7317
6248 9913
810 1357
8577 988
426 9966
1172 4912
8580 7341
6097 8710
933 3119
4795 9816
9952 6892
3274 1788
6945 2131
5504 3180
4285 4270
4335 7764
4093 8103
632 811
2877 3082
4246 7749
2864 1053
1069 1944
1238 5630
8989 4365
2913 5436
8892 4650
6532 8888
547 5870
5325 7661
6326 2972
2501 7582
8138 1212
6821 1951
5411 526
2331 7735
8011 7265
205 6677
7914 5827
1149 3024
5186 4393
2302 2243
1050 5777
9398 9289
5278 5718
7060 7316
9428 4724
7364 149
9970 9181
1681 1063
31 8908
2283 1405
5959 87
2377 5246
4675 5402
3376 7613
8616 5202
6996 8046
9790 1991
367 837
1892 1789
8976 8817
7075 5372
101 7562
7408 3295
7084 8407
7621 3691
7718 9027
5314 1041
7565 6560
144 4629
1464 8028
8807 239
8685 5972
1153 4434
5894 7894
4878 8811
8919 9579
7977 1436
3806 1493
3626 4986
5228 5573
8830 4964
3795 545
3364 9221
3281 116
5722 892
828 1750
2583 6153
7310 8845
2089 4907
7075 1524
7091 9176
2993 1179
7295 4556
680 9695
7402 4422
9337 1083
2448 7935
5851 1983
229 6924
2524 5105
3095 2854
1525 8497
2368 1096
6610 3650
4304 4793
5184 9941
8682 7851
1095 4887
7710 7027
8634 2159
2039 7738
3660 8689
2021 2931
5558 2678
8862 7950
9319 2111
7632 2604
1019 9608
6187 1956
8574 2602
413 598
3363 835
2637 3006
4144 8905
7276 7963
7453 3261
7513 2576
7933 765
3076 8170
299 2509
581 4835
5945 4183
1150 119
1413 1424
4894 9893
1757 3773
5015 9480
2164 6277
5843 1543
4085 8361
4338 4362
1560 6850
8327 8078
1219 2153
9284 8682
1027 1901
1235 7155
1243 8528
215 6653
9451 6371
9410 6499
7429 3235
4696 2648
6780 580
4180 4639
1118 2541
921 1112
2788 1156
1819 9357
8071 9084
1839 2924
9941 4588
3345 2149
5076 2050
2309 2422
2054 7416
9024 5941
3422 8453
9719 1966
9811 4135
7431 9438
6466 431
2728 2687
7608 6654
6460 5796
4064 255
2844 6168
2810 388
8421 4098
2797 5814
9662 7228
782 839
318 52
8593 3818
2332 7186
1264 646
5446 4587
7914 711
2982 1446
2669 2661
5250 2749
8567 1289
1923 4342
8345 4125
1881 8786
3550 579
8188 453
1834 3465
1013 4936
7286 3419
8463 412
5787 4361
904 4704
5965 6219
8589 2100
6491 6275
9557 4302
9203 1970
9612 5725
7131 2237
3667 7965
7502 4033
5782 2139
3283 5429
8894 969
404 8271
6024 563
2670 2841
2086 1443
452 6725
2900 4482
2233 671
3581 1584
4622 1778
5663 3719
9928 638
397 9355
5845 793
6788 4676
8913 2947
9040 8958
2644 782
2143 5520
8606 4189
7334 6893
3926 8924
1251 9080
3232 6801
7122 3387
29 9890
1812 4074
6599 9624
4909 483
3565 9634
1998 5576
1611 4476
434 6753
5885 1360
396 7211
2166 2590
593 182
5500 1977
2658 430
4695 4466
4509 1079
586 1337
9011 431
9952 1729
9485 9310
8363 9028
6955 241
8905 2854
6590 936
9640 1806
3575 5452
4860 7235
8639 1941
5310 3667
3656 3723
4775 5705
6740 9228
781 4688
9125 1549
4669 3875
932 8068
42 9911
886 3654
1268 396
2155 4060
3373 5311
3689 5179
72 6164
1081 468
1747 7010
1696 2041
7959 6943
6576 8369
8893 1597
1536 8542
2835 2453
8890 7725
8352 9076
9460 8686
5508 3795
9073 2949
3107 300
6424 6447
8595 7961
5893 6633
1460 3646
3439 5278
8912 4074
7914 6079
387 1723
6541 7640
3949 9936
1367 7985
9605 1314
3102 7794
6912 4757
4888 394
354 2123
2221 1666
5861 8987
5580 1741
424 3216
4766 6755
2473 4612
4712 5902
8358 575
9189 197
2145 7643
9203 55
3906 42
5916 6858
1569 8297
2744 693
5956 294
7969 8362
1941 7217
3783 6904
104 3983
3541 6608
2587 6613
3764 2886
5855 4435
5438 9915
3431 1902
534 6649
6847 1138
1222 1342
6814 9976
8617 4108
702 1253
7002 1952
4316 99
4205 898
219 1140
8540 2860
6142 5907
7460 8047
9718 2670
1538 1154
6760 9585
4632 909
7811 180
1556 9061
3552 1433
5779 712
4715 1134
1874 204
7873 2234
6149 2306
9818 5109
3292 1425
6361 4408
1026 3904
7810 2648
6343 5092
188 9181
833 8556
4438 1368
8671 5720
5631 4852
8638 8241
6368 235
7120 6005
2141 4924
6217 5682
669 7708
7771 7797
2181 4572
9749 7251
9020 3129
1767 6328
7482 1417
8537 2973
8162 1364
765 4912
1538 5729
1667 1471
7832 8547
955 7364
4055 3860
2144 1544
1099 4913
1171 2593
1641 4933
7285 5310
6027 5338
633 6277
5978 5869
8281 7354
1437 6530
8024 7043
1633 7337
2168 1145
3993 223
813 1874
2424 2503
1730 1917
2156 5162
9130 7085
2958 9037
121 5114
4231 9123
7749 4244
8726 9890
5127 8089
4975 1850
1542 409
9221 1795
3046 2281
1835 4646
6109 549
6232 2095
5606 5865
9753 3825
9274 9361
1756 6507
4811 6895
1130 9562
8835 7421
644 6911
8045 3075
3281 306
2705 3964
6710 6231
38 3093
8296 7056
2707 3989
6334 2723
6 2883
6986 430
137 5396
9994 280
6274 2388
6938 5897
7131 9815
1292 8140
529 1712
1882 6276
5504 3474
9451 6622
1710 8838
9637 7926
151 7916
6531 5020
1226 6741
6279 6967
545 9055
5344 6602
3958 2066
5663 1527
9556 8860
7639 866
1677 9368
1796 8296
9755 2597
1901 3951
9464 5203
380 1886
2737 3168
9726 161
3928 9941
5542 4054
4697 3787
119 9500
3984 7906
9570 5085
5017 1570
6828 5688
3415 2915
596 132
649 107
5924 818
298 454
6069 499
1209 2939
3464 2634
73 956
9250 306
7081 926
8503 9075
1462 618
7483 6593
3327 82
2340 8214
8809 3496
9652 1410
8132 7132
6327 4832
1278 7749
504 5018
5527 1075
1000 7471
9989 8066
7361 196
329 6928
4855 441
8177 6882
6481 238
4591 1652
3367 133
2682 2689
284 2521
5827 2690
4254 4144
5067 58
1275 8093
4867 1009
1927 3017
6836 4446
6395 659
4593 7835
2640 3093
441 3188
9133 2665
4289 1424
972 1980
994 9108
8675 2482
4878 8148
1026 8522
9929 1851
4233 7603
2085 4060
6012 927
1071 8618
8361 1095
937 341
1033 1535
167 3686
102 220
5421 1358
8092 6531
2536 7338
8194 7235
1805 9993
8139 9974
1424 5264
4552 2820
2022 1134
7664 3401
9820 6764
9059 2296
5177 6263
1083 8048
7633 2338
1237 7870
7436 6837
606 2643
3398 3466
1537 5191
6184 9834
656 6589
3480 2243
4593 2713
5964 1021
8699 5952
6436 2109
5312 9215
6809 4233
2942 3759
4881 3534
2017 3047
6228 2830
9035 2482
803 2318
2423 3379
200 4399
4890 2534
5625 3466
1579 3177
9953 402
2804 7403
3712 1077
2201 9267
7313 3539
2473 3108
621 8706
3571 2880
9679 9425
3003 8763
2039 220
60 6833
1859 2768
3488 6986
4683 5583
2686 4268
939 2773
6612 4354
8967 7132
1366 6797
1849 1357
7413 5544
863 5256
7426 5888
6579 1830
7845 7507
7227 2237
9010 1908
6507 5200
3078 9512
1652 8507
7860 7822
5858 9486
2352 6937
9934 3075
7562 1678
137 2130
4445 4855
9527 287
3242 3141
8001 8052
2085 9401
9686 6624
5326 3908
1411 2976
8834 9374
467 2573
6098 9284
9223 8790
2389 1430
6057 767
810 1920
430 6170
3041 9606
7914 3990
9659 8805
5320 4741
2398 9784
7979 9362
9853 441
303 4962
39 6328
7683 7306
255 8785
1723 3266
7661 281
4448 537
1635 777
8251 9817
3922 1422
3346 6300
5037 3856
1826 6302
2318 4657
6702 4629
6393 3833
2695 5279
382 4736
7341 8779
6914 3067
1316 5531
2352 9131
2539 1671
7595 8674
9897 5766
9960 5415
8680 8985
7802 3980
8646 3704
3294 6798
2954 6561
7960 5996
2740 2430
1917 5996
1737 1687
6339 6763
3373 3207
710 659
9857 387
7164 82
7375 25
1323 969
3955 741
2825 2754
4317 1226
5140 485
2085 1759
4020 6732
1998 2695
5694 1941
2494 3190
8010 4089
5132 2769
5351 7979
3115 8133
5261 1827
9030 6378
3779 667
8540 1657
6962 7801
319 1996
506 8735
3239 8214
483 8191
3900 131
2199 1443
6724 7376
623 7148
8474 2926
8955 1241
1120 4979
1557 4155
8918 4690
4232 4135
2827 9820
749 2939
7235 6919
2102 3300
2121 846
2479 3183
4823 7641
9218 9342
2565 2494
2090 398
5454 6776
4266 6567
5401 3463
4942 9667
198 8136
1346 6963
8231 6407
6706 6030
289 4674
1010 7435
1619 9808
9887 1330
247 5905
1829 4750
1942 9255
9539 6181
2769 9654
7932 1579
9581 280
2447 7779
6207 437
2153 712
8888 593
3801 1131
4882 2789
8373 3134
9484 8338
731 144
8595 8916
6250 9978
2274 6996
6546 9194
1754 2976
8361 2637
4469 9055
4160 1331
2152 3087
9285 6749
1031 8482
218 3578
3822 9337
5398 8355
8957 447
555 2259
4627 6745
1528 8843
303 284
3135 6485
8386 1471
5097 7607
201 5875
5545 8282
3418 6432
5439 6876
9148 4802
6126 4899
1788 165
7199 8099
8765 1532
5815 5426
8816 4472
9543 2201
5493 5079
1314 5757
1585 410
517 320
7936 5452
6818 3410
7260 1360
1677 7163
446 2282
2603 8974
8101 2737
647 3334
9733 3923
7719 2516
738 6025
2238 8572
3869 2573
2308 4300
3838 8378
1523 8879
7091 7730
7411 2145
8343 9302
3592 9652
1462 2273
5482 6498
2256 9525
6518 996
2637 9643
3923 8754
144 3109
4391 3516
9711 2583
3787 56
8881 4501
4461 7357
873 4046
3204 5040
1506 2234
681 653
2524 5823
4276 1592
8390 3546
116 5060
348 2108
8531 4484
1427 3507
4681 4096
5554 7388
9873 5018
4019 1221
1897 8562
5211 8199
6525 4999
7926 980
9734 2447
1143 3677
3247 3496
5278 6663
5113 2703
2922 7199
4864 5170
3618 12
781 577
495 660
6668 7370
6732 1522
5841 2342
896 8150
4455 45
4491 1372
7609 1585
2463 738
341 8266
1873 5749
5245 8141
5280 7723
5456 4163
390 7031
4265 7495
4653 1304
6726 2112
1907 4466
7291 8976
5905 6017
4984 556
9960 5323
5065 7821
8813 1606
2716 2614
6231 6523
5384 3254
2294 649
2060 7168
8359 3980
6774 8122
3637 9615
4581 4900
9073 6895
1153 3017
309 6386
857 7562
7734 5289
7389 2409
1849 7810
3982 5603
6583 2481
2163 5266
8163 5407
5645 9474
476 6355
2780 4466
6846 5585
5683 973
5166 1728
9626 522
6901 8001
8499 1680
8620 7036
5471 3646
8714 5037
2498 1418
5802 431
6116 6297
2576 2823
8089 9791
2637 197
9587 38
4705 3366
231 3460
8993 9662
3278 6281
2265 9300
6316 8646
835 6878
8566 260
5881 1439
4768 4899
4167 3262
5076 8274
6245 3417
1562 3647
5379 2089
100 4320
8662 9575
7641 609
6770 240
2741 8286
4008 2885
9166 2084
7235 7206
458 2483
9773 3793
351 2166
9367 6101
2476 9094
6441 7403
6374 9996
3878 7463
53 3830
1188 2220
1009 7484
7658 5246
1479 1571
3531 1052
8352 7969
2547 5421
3299 7586
6143 4105
1417 8299
8193 8460
4578 2621
3156 6391
7591 1836
7949 3992
5248 5521
5779 1771
5415 8109
4385 8080
8556 2670
489 3023
9929 7399
4443 538
4841 507
6230 1314
421 5194
382 2092
3248 2527
5711 4452
6724 8361
7585 963
2619 617
6957 94
9619 7787
5390 2687
5868 8553
2795 2184
867 6588
5236 6581
5668 5988
7835 2977
731 7098
310 7596
412 2916
6146 9819
1733 2809
1882 2672
3632 1845
263 4284
9901 2479
3754 8018
8143 3226
2153 1614
2885 4105
6342 886
3660 1974
1478 7424
468 1684
4224 3348
832 9395
5828 7651
2562 9076
5647 2264
8118 671
9500 7293
685 6033
1660 1874
5709 9433
4058 4090
1383 6405
2120 6870
5066 681
9774 8838
8662 3440
1317 3805
403 9077
8846 2804
5602 6180
2792 7890
8741 4525
2258 74
1147 9113
7005 5365
8958 5888
9494 3779
3745 2298
4339 2956
1732 3060
8060 1099
1866 7510
7116 1197
6781 578
3079 9831
3696 5488
1870 3782
3764 5112
7153 7738
6911 3039
4021 7382
3883 8341
470 4545
6571 8478
1102 9184
5571 8801
2695 7784
7544 8621
94 3839
1526 5714
2968 9138
4433 3487
1609 7484
8749 2872
3826 6790
2818 1482
2651 122
9306 210
8322 2716
7373 1226
6226 7835
1328 3558
1064 2164
5145 6623
6130 584
3493 3341
8441 1903
9086 1786
5376 4317
7623 4212
173 8964
154 6004
9175 1867
6885 253
7105 477
1183 4710
5399 36
2113 28
9878 3367
3331 2018
209 834
7140 8282
7681 7926
5375 7113
1180 1216
9914 9814
7881 158
4961 7747
51 3136
1106 2127
1900 779
6714 8218
1716 227
2800 6875
5802 4058
4448 2127
258 68
9755 4099
8200 9470
3004 1316
4436 1822
9678 6324
9663 7660
1421 2976
4676 1601
7595 9295
1578 2430
1892 6158
146 625
7699 1498
2060 9988
2822 2158
6078 1543
1456 8622
7463 7423
893 5826
7969 9694
2107 4663
6486 6756
1240 8610
3253 1638
966 8423
3268 3935
1094 2521
5832 3989
2884 2803
2899 9373
1999 5206
4877 7361
7964 116
5030 673
4411 2732
3707 5096
7994 1719
343 4128
2568 1155
7228 2008
2509 445
3426 6261
3449 4725
8558 1927
2794 5660
823 126
4737 6721
5734 1868
7831 9421
5948 2269
8140 9243
2057 2676
9889 5884
9785 616
4471 9465
1617 9247
807 5034
5691 4537
1763 9768
5518 1056
4700 1982
9362 4318
7478 4501
674 1024
9673 5040
3522 3882
3114 2149
4227 9323
7017 4285
6085 9522
3532 5821
7149 4897
7276 598
8567 8049
2526 4235
5774 9607
5940 6881
8601 949
8645 1467
824 8564
475 2518
384 5184
9579 8898
7138 772
3131 2787
9843 8312
2783 9319
3655 7656
8932 1513
7744 8551
2512 901
1334 5284
2217 6973
1351 8716
3110 1195
257 1536
7283 3368
9116 7240
9769 3756
5118 535
349 8759
4378 4145
1704 6943
1145 2923
8391 1963
3771 9186
9411 6592
543 175
2067 377
4209 474
497 1309
4916 4764
2747 3372
1633 809
2363 4409
8830 973
857 8303
9570 1110
8990 8029
1496 483
2797 3795
7155 5563
7358 8786
4689 4145
1322 1183
338 6007
5806 5624
5386 1921
2345 4282
5333 3579
9720 8131
4651 9453
2437 9027
6325 4686
2556 9800
9535 5127
5966 8666
2189 217
2472 84
9699 2065
6950 4981
8384 331
7093 4774
9659 4454
1623 6588
6945 166
8954 7312
829 6655
5707 7277
1033 8353
6759 4601
3651 4959
3474 8664
2500 4308
2859 2670
6141 3192
5984 1636
8019 1551
3326 7277
366 2659
1724 2280
3148 9347
856 9464
251 2108
4114 5363
6646 1447
7944 4360
3487 4163
2033 5685
6126 9765
4766 9384
4761 1789
1054 1444
9941 8538
9921 4006
315 6304
4927 4856
2719 9593
3738 9989
3213 4811
3937 9870
4373 5769
6135 8893
2249 1932
2883 2057
8739 7139
4729 2649
2637 5432
2089 1740
5867 8789
4278 6488
6955 9542
2506 1010
1617 1841
1288 1102
7420 916
9826 6118
9213 2814
3340 5904
8857 9073
3937 7147
8733 1142
196 2779
5329 2241
7385 8598
1312 9494
5782 301
9606 4300
2404 7247
667 2882
4714 8442
5216 8816
3724 8163
4423 8238
784 2680
5800 1402
4865 6293
2753 4486
5063 5204
4734 6417
839 4056
41 7543
1959 7211
4996 3051
4325 502
3412 4740
8904 4466
816 213
3175 1565
1515 4626
601 1631
6814 8048
3709 797
4009 8508
746 7709
155 9935
3641 4427
9617 1216
626 5804
7259 1578
1877 4753
9957 9135
3499 5054
1381 2894
1323 619
1328 1489
7984 3051
6434 1450
1339 1772
6733 4239
2342 3198
1073 3619
8121 1991
318 4023
7744 2550
710 1745
5964 4406
358 3644
9049 5670
8710 2416
8608 5591
4655 8035
734 2357
7677 4592
1461 7993
645 9639
8625 2462
1608 534
1134 7764
1752 8102
4024 9041
3227 424
3090 3678
2302 3842
8091 1361
3708 421
6606 1015
4383 7633
1402 1781
2662 6539
3377 8046
2024 9597
3124 3111
7751 8127
671 9801
4552 821
6625 9223
3939 568
2591 9985
7894 9466
2378 3368
2990 9092
6957 2932
6121 578
7291 9746
918 6898
9225 3713
5406 5928
5816 8943
5671 3318
2022 9359
7606 8170
1925 2159
5541 5672
9404 2247
1333 4410
108 9748
2278 1157
1366 581
9268 2398
6619 1493
6612 3053
8436 1051
6352 145
5891 7807
6175 7411
8842 6430
5289 8607
5515 7568
3673 8081
2991 8119
5076 5036
8698 3675
4697 2657
2671 7476
4249 1710
4049 7383
1321 1237
1578 4852
1446 686
1759 8207
7480 1183
7619 8046
4074 283
6666 9219
8617 2377
2257 9531
9834 6327
4781 6213
785 5711
8241 5863
5280 7897
1765 5662
6797 8224
2051 3108
8295 7385
2738 999
6906 9793
2137 1671
5920 2743
9404 1536
2522 1994
2331 1609
7344 1268
4204 780
2950 4679
6581 6727
2064 8967
94 6930
1127 5801
3319 3619
8300 2537
8438 2158
252 642
84 9041
8276 7994
1432 6831
487 908
2243 986
3134 1466
9262 5910
9311 8306
6257 2556
8098 2624
6886 9677
2575 7365
4446 4616
8348 8135
9378 5550
4118 2745
908 3395
686 9436
2438 6999
3942 3637
6627 8566
987 993
1469 5261
1557 343
8671 4574
5133 6269
900 1973
2351 6862
4560 4140
9120 4794
2526 4621
6353 126
7961 6710
2645 165
8558 9057
2799 8015
1873 1220
1248 850
8784 4839
7088 5086
8054 2740
4250 8693
5649 9780
7997 3243
1157 7895
5087 1130
2369 708
8373 7353
1891 6930
5745 5742
2376 5141
3307 5186
1047 1790
6980 660
1151 1308
2406 5680
4237 8520
6480 1153
1091 4176
7233 7076
4565 1393
3442 1616
4309 7498
4537 611
1714 3503
1531 350
1229 5275
9122 6836
8972 2922
7808 815
4962 8150
1426 3044
9886 2112
9416 1832
867 8594
2420 3938
2408 6114
3473 3186
5729 6569
3846 1091
974 148
8107 638
3363 1835
1307 735
1608 4929
1611 7563
3057 9500
1002 1410
496 2453
1673 3074
3369 4353
557 8252
679 2273
7187 5243
7693 1847
9939 530
4352 6555
4600 7412
1779 6781
1103 6890
515 7931
62 2385
3028 1845
1559 2787
7163 7215
2892 4151
3437 2359
1589 9451
3736 1592
7617 8576
3249 9613
1097 2278
9358 8378
1163 1178
3157 8264
6085 2462
9013 2480
3088 8152
6147 4026
2000 797
1047 8342
969 6800
5128 6938
1796 3045
7701 1757
4354 8139
7430 6803
3008 9161
3570 8314
6203 9368
6162 8485
6774 1314
4326 1703
1642 201
134 8307
7566 1307
8908 6513
359 1380
6176 6467
401 7860
2596 1961
2479 1347
6178 2705
1535 8387
162 2259
1921 6341
3136 300
1098 1694
6510 858
7700 2491
7461 1000
3672 1794
7570 5609
8239 6251
6303 2746
1269 495
2975 8435
863 2544
7422 6191
1646 9402
7912 381
1541 617
1177 6149
3320 4090
2917 3311
4261 6982
1513 9072
3143 4748
4993 6550
8344 8398
7211 7159
7367 6399
7292 5077
9403 235
1075 9556
8487 7736
2891 1583
3774 3180
1060 9128
6184 3375
9267 95
886 4258
424 1844
3442 5968
3665 8992
5435 4500
4286 6209
144 8795
5765 2821
6250 5387
727 1914
9071 4996
2306 738
9429 1942
5544 4684
8771 3892
4112 977
7086 136
8780 3757
3907 4566
7211 8559
5295 933
2127 4290
4615 8683
2513 1340
3349 7592
9187 5799
3361 567
663 9759
9265 3440
3839 619
337 8834
8836 8303
4470 6287
7611 4369
4047 2967
6549 2378
9197 5466
1782 8144
1509 1448
1720 6274
900 4443
5712 7796
419 7144
8065 987
7834 2210
1600 2619
4777 1935
4888 6543
4597 2383
7167 1128
784 6906
8200 6315
4973 8329
1818 9636
658 1945
2098 303
5662 9387
7077 5144
9485 5199
7448 3809
3482 1410
3699 8725
3396 3013
4850 5514
1124 2257
2446 1068
2910 9895
1517 504
1478 6685
3413 2982
2069 3878
1799 6539
9884 3872
5433 205
1672 6821
4580 6344
5575 9434
9760 4864
2138 6892
5836 5464
427 1131
3826 6339
6624 8759
4218 8282
8593 1851
3566 285
7623 1495
735 7901
6837 7971
454 457
8268 9104
3597 2679
1737 6065
7551 6550
1586 7242
8860 8145
2673 9464
1970 6983
5535 3633
8553 25
8917 2077
4653 1539
9375 5125
4418 4974
818 1451
1027 5733
5200 2458
8699 8407
617 784
2360 7181
5268 5513
6700 4045
1822 1869
3990 5390
7890 733
672 6540
9915 842
6570 782
1254 2871
3960 918
2683 6544
6952 985
3036 3371
1382 624
4655 9997
387 5278
281 6464
3267 691
4556 7124
7910 9072
6578 8516
8489 5676
6234 4715
7358 5479
131 3382
6073 9325
6007 4107
13 6285
6986 3338
7046 2394
1778 1507
5352 4481
2201 8168
2536 3276
9648 3700
9273 663
4663 9821
3819 1250
4619 1030
5343 5446
9215 1384
1997 8059
926 7458
3977 6824
5199 2703
1156 1053
9243 3879
9119 782
2939 9240
6853 9569
5829 2534
4537 682
7080 9728
5774 1348
4533 5749
9766 5619
4658 2151
6877 951
8601 6848
9063 148
2166 9586
6470 2672
4257 8771
1072 8061
7352 1608
5857 2231
1153 417
4910 3696
3406 9398
9066 7259
2001 7296
6315 6053
4483 4267
3151 6106
5680 9450
9164 1687
5317 5420
6885 9292
8893 302
8740 9781
2167 3281
7556 9273
1932 2141
8046 466
6160 3302
1239 4542
1303 5485
8199 1925
6890 9627
6093 7596
5370 6602
2929 1994
3956 484
6362 4457
2406 5056
9937 7295
1521 4505
7254 9134
2735 1122
8050 4104
4199 9224
2669 7495
7742 2598
9536 5227
1952 7903
2109 997
9136 9335
5454 1205
7564 4530
1692 3215
613 8242
3393 9843
1421 7147
8623 8989
1922 6009
1010 7306
2090 9956
9332 9148
415 7843
6432 6911
9917 2079
9369 621
2233 8377
1051 111
7493 8927
8034 9350
5889 4763
7050 3481
3588 844
8167 287
8876 4073
3926 655
6274 7139
36 1270
1137 4586
8669 1977
136 1219
7175 2284
5406 8617
4945 1858
2502 5586
5078 5381
563 1987
838 7689
8846 8550
7990 444
1238 7818
1319 2625
2294 2956
3653 2669
3821 3125
785 545
4906 4932
7665 7769
5959 1870
5414 1940
8760 4195
3647 2566
9059 1443
8364 1530
9890 3760
4725 1148
439 1141
4155 8502
4175 135
7423 7049
5099 6220
995 3390
1163 3370
5806 365
9451 4112
3348 3742
4306 6059
7396 6431
5752 3282
2451 6421
2361 3282
1674 2822
1704 401
7084 4231
5045 253
8651 3457
8161 8021
9499 873
4946 9995
9398 400
2466 9320
2689 3000
125 1952
7279 8473
4347 1192
677 7202
9306 5
3902 9092
208 582
6736 875
9903 7125
7471 4142
1690 9610
2944 1242
775 6049
9073 3098
2614 7325
2759 3338
3537 7037
5383 8923
9571 1949
8761 2761
110 1824
4842 620
3224 4669
8961 1852
9462 648
2388 7320
8156 7298
7196 2329
6739 4387
1063 3490
8524 7655
396 731
7573 8711
1092 9519
8873 4794
9943 2642
2636 5483
3524 4039
6280 4269
3286 5696
769 6796
1971 5479
1056 3254
1798 5390
3870 2874
1664 8114
9855 2303
8890 3509
4369 3224
2158 3499
6261 1430
1143 4277
8317 2735
6278 7485
391 3454
3990 6065
6585 2091
7619 9843
4909 7645
6582 5728
7839 5452
2772 3936
7285 7420
5208 654
6238 7367
3629 72
2302 9418
8497 1913
1529 6947
567 597
5901 457
1803 8965
6005 8060
795 372
5260 9263
3988 4840
8959 1076
1883 7733
5286 3318
1070 3503
7364 8476
1689 9950
4748 1549
7357 455
4055 959
1150 3449
8643 3205
3900 8293
1070 7848
6869 1297
8676 6596
9512 8270
4949 311
3789 6713
1051 6
1876 2975
2106 7200
2587 5349
6216 7543
2291 4391
9551 4764
8389 1455
2705 3786
3905 3064
2924 5142
5736 51
9982 597
9563 2218
8170 1503
4418 5124
1099 4418
5010 648
3929 7498
2633 4453
9274 1280
1548 1633
9083 7825
8243 2160
4271 1216
2962 4648
8422 8638
2892 5570
7794 3609
6995 5236
5622 3539
9763 3181
208 3189
4304 448
4776 1107
3740 6949
5817 3569
8126 1372
8352 1222
3968 8452
6707 6976
359 6763
757 8649
6664 8294
1751 4904
6649 995
7248 8619
3110 2605
4175 7108
5574 4192
7392 8609
3421 4030
5998 7681
1474 1762
473 8275
7188 882
2712 3937
7368 6554
3296 3262
982 167
9749 3451
5350 3825
9328 5024
1653 1084
7059 3897
5548 512
3001 8366
2018 2856
5457 8280
4721 5001
5964 3921
5127 7044
6004 4668
7246 5213
6816 1109
2605 3564
6245 5145
832 2100
1088 8809
9878 3346
6705 971
5706 4232
1930 2050
2709 2091
9161 9727
8513 3946
7217 871
2305 496
8560 1431
6927 4588
3964 4134
1125 3438
8415 42
5585 2085
3621 6574
7875 4551
1988 9906
3976 4224
1915 1875
8732 1903
7566 3309
1644 3805
6801 5150
1610 9071
611 7884
5332 1646
7565 7594
8967 7942
2762 3431
3007 3467
8202 3768
5795 4131
34 1975
7503 15
5334 6139
4465 1195
4921 7242
424 4905
1924 3325
5994 3801
1717 7379
7830 5709
5082 56
1385 1193
8511 9223
6788 9984
5204 846
2157 5789
4531 5377
9877 3487
1968 914
8811 4841
3730 6671
4847 2696
1665 5276
1241 2758
4160 2963
9003 3983
8620 633
9236 1586
4214 8258
5991 3258
718 7112
8315 3662
1888 2472
6676 1638
1780 8350
1810 1983
288 3667
4120 4976
8049 4195
4272 1678
4010 1844
9884 493
4923 1747
8976 9016
1142 6609
4431 2802
4398 9646
148 1694
7841 5317
7154 6589
3832 1145
797 7734
9148 9998
3899 7434
2203 3819
6533 1640
1131 926
722 5454
910 3600
1590 6578
2663 1739
7910 7712
4380 6073
2976 1493
3613 5663
2553 5579
4596 9770
8710 1477
5885 1592
1823 878
8200 1195
5073 4157
876 4041
6516 5900
5374 2472
1964 7177
6562 8040
5907 4972
5138 2865
1111 4474
1453 9422
3328 970
7953 3546
6852 1334
2636 4074
4750 5700
1983 3915
2541 9477
5156 6414
7641 3981
4514 7953
2284 1381
8255 9601
4350 9454
4085 1500
7233 8023
168 6667
6382 4704
5191 5103
1055 8623
4256 9996
3215 2947
1369 2884
4415 2120
4140 8501
7531 9739
4707 181
332 6798
5877 7436
1151 77
7743 2308
2390 1026
1287 2701
5069 2150
9469 9316
1056 1705
2162 3300
6970 3253
7117 2317
9009 2574
6252 2148
4993 5564
1432 2604
3958 2539
5821 3955
3438 1954
5576 624
2158 8340
129 1452
4724 5492
4123 5438
5581 444
8794 3164
520 7904
4629 4206
7466 5598
3707 1669
6355 8969
7578 3676
2145 918
1038 9566
7555 2550
8920 632
3249 6325
1343 9312
7131 7570
4363 4967
2799 2368
9311 155
9279 5005
3942 2160
3762 9153
2514 5535
4393 2585
6209 9007
8404 5749
5505 3300
759 3374
6517 4293
2440 76
6761 9602
6058 807
5570 5478
2638 7581
970 73
7880 6083
9738 9258
240 8239
4168 6379
8331 1398
2260 908
1849 5121
1454 3885
7824 7669
8986 9646
6569 1731
7542 9801
6185 2749
5003 627
6163 2154
9282 4575
5707 9484
4105 196
9310 8288
3958 2064
3841 1046
844 540
2727 3090
9372 6977
4439 9954
9885 2507
6381 1088
5871 7086
9712 4362
92 1847
1732 5360
2480 548
5825 4206
3770 7446
3443 4540
8196 6310
1347 6754
3408 5142
5814 2447
9075 7929
3813 5404
1879 2005
1613 4988
2187 5560
9751 7895
141 8345
3307 3512
8123 1808
7744 8835
5638 9561
711 8202
1449 837
4953 8866
9881 6962
1486 7490
332 3484
64 1548
7807 579
1439 9007
5187 6255
1398 9020
1863 3713
446 1655
4796 796
5730 2609
5717 2868
322 3684
4845 1526
747 2846
6526 7096
2951 1249
5007 5618
3762 1034
7918 3981
1261 225
2894 7131
8966 8528
2146 1016
5543 3576
6571 719
4957 4352
2958 9776
476 5200
5002 5648
8498 2045
2552 1649
1785 1029
7683 4932
5761 7166
1563 8508
5918 8921
6053 3077
3213 4029
1445 4933
1052 9026
4079 3409
2587 778
5417 467
3278 167
2325 2939
7188 6633
9038 2804
9629 4566
9505 7257
2295 4527
3807 3767
2009 9649
1967 5908
4116 6553
4233 7920
5031 4796
3440 7627
530 8182
4096 1208
3662 272
5481 2832
555 200
1705 6058
8185 6636
7105 9817
1579 6662
3281 9910
4504 1231
3430 9904
868 9485
3013 2978
1135 879
7336 1828
6076 3515
1864 1572
6629 405
6923 8918
3245 8691
3681 7449
7526 750
906 6765
9348 3932
7098 402
3970 156
2559 5202
1875 5793
1538 9186
316 1539
6700 1396
4032 8850
6236 6145
2779 9724
134 6181
4660 7633
8269 6331
7789 9158
5124 4715
6716 1815
1474 9250
1039 5488
1428 9937
9227 1869
7127 6168
7430 7008
727 5876
8422 3075
4897 8358
2777 8895
6848 7606
5110 444
7878 2600
7476 74
2232 4446
2314 3679
7264 3774
9175 6722
1437 6405
6995 920
45 6860
1861 9021
2398 7275
4182 1270
7410 2187
2885 1780
2593 4800
9661 1194
7859 2230
5157 8755
190 891
5686 2478
5500 7374
7442 396
5009 8295
8466 1276
5196 1975
5825 8051
5724 1761
3768 9794
741 4921
7737 9283
1154 1835
7056 773
9901 3439
9462 3656
6285 1452
3896 1818
1856 8459
7736 3476
7289 7294
3378 4687
4891 1072
2674 6075
8503 5198
548 1200
9266 1623
6492 8278
107 4176
791 2419
1403 8827
7393 7507
8830 456
4920 7661
6641 1516
4785 9971
2749 946
682 9722
547 1488
3056 6571
1255 2075
9874 7625
2002 3437
6677 4371
5283 5286
810 5565
1638 8768
1549 9002
8856 3624
8718 5549
4810 4346
8917 2625
4116 2027
1314 68
9291 3869
451 3451
6598 7647
6314 3554
2605 4819
1422 1908
3539 1717
7968 6458
7286 1416
9057 1111
3956 9138
1699 7219
4257 2523
525 2917
5142 7474
4354 4535
7356 2177
6708 3205
4329 3027
884 6902
4906 8002
1150 2271
5522 8021
643 3700
4130 1002
8183 0
5514 9344
2253 5686
1982 473
2831 1065
7836 1150
1938 9817
8381 8148
3737 2751
9115 1789
6585 9628
1842 1298
4653 7277
2905 2911
891 6545
3667 5071
7254 8877
7633 6282
2453 160
9626 396
196 8787
766 3848
1578 2196
647 9597
9051 515
8337 1671
7327 7115
2060 793
787 5781
2848 9258
2750 3834
9264 1710
198 4152
3745 1687
3588 3895
1773 5034
8741 6540
5219 6055
5538 8606
5378 420
227 6423
406 105
1776 1564
7777 1425
6776 9841
9070 9631
3941 7831
6162 2319
3775 6503
5540 3151
1696 6340
2110 3213
1256 748
4580 2419
5299 8335
2901 6753
7671 9140
288 4217
5042 5831
6921 3137
7140 3015
779 3524
6936 2080
2544 6074
7577 2580
191 1802
6499 3759
7270 4301
9527 4875
2184 7284
6019 257
8184 3580
2929 8833
5671 2529
4223 5124
9291 1954
4767 5904
9280 7363
7887 6316
8467 1000
1260 3301
1437 1857
1395 7536
2988 976
2009 8352
696 9155
7611 3898
6373 9198
2072 1640
804 6025
93 2539
2095 9978
5377 9540
293 7268
2163 2629
1394 5664
5616 5555
6803 2762
4538 6942
5177 3696
1685 9349
8268 6231
900 3908
17 9679
2307 5199
959 4311
9878 7987
9950 1555
1986 6459
4401 3517
1578 9921
3430 3643
8734 7733
6540 5360
3294 3603
4388 1765
2677 7536
4075 6408
4228 7285
775 4405
5372 8655
2431 7765
8321 4806
6576 2645
1515 700
7677 3320
2702 521
4087 127
4300 4197
7454 5720
1481 7029
5814 2261
864 1322
3853 6207
4085 3382
3245 8842
4138 7120
9773 9850
1077 8682
1404 4214
2642 7809
7217 3581
3013 1876
4748 8086
8835 6345
4609 8540
6594 3549
2055 2810
6030 5083
8828 7379
7245 2206
3899 6229
1541 9978
5792 2031
252 2120
203 6081
7952 2064
1140 5362
4745 1020
2510 3800
1692 6010
9630 979
3649 2915
3118 9883
791 3002
1245 8604
5862 583
6618 3119
6117 2580
5393 4395
8237 6583
1684 3067
94 946
5822 9425
3809 7335
5268 4091
7821 4832
4093 7126
8574 7230
884 7729
5059 9696
4379 7187
2375 8759
9922 6607
3698 1784
664 2262
2800 4817
9200 8845
9011 1743
4200 690
8100 6399
2167 9097
5008 4883
1669 5228
2049 952
7408 1138
4346 1286
828 1199
7367 3799
2506 2637
4020 412
5788 2344
6461 2988
7975 7632
5782 2174
234 6539
1964 5066
1454 2266
1100 5275
1519 3229
2898 3655
6619 985
2532 8162
376 1800
8944 3423
9402 9393
1347 1097
437 3818
8188 9617
6176 1420
4321 9769
603 8518
1728 3617
3250 7588
2312 8319
3826 6001
3001 2804
2620 8683
3561 1149
2136 8150
8889 471
4124 6676
5544 1367
2540 4483
8934 2808
8308 8279
8603 9718
8548 2330
1864 7451
619 2369
7694 600
2567 5345
2382 5447
4156 6194
1442 3646
6244 802
5434 1830
6517 9293
2073 1325
9353 7372
561 4089
4586 6827
5435 9790
1100 6144
9900 8786
1264 1688
3589 206
9974 7220
7514 9288
1842 1557
5781 6719
1091 7235
1563 6118
9376 900
9231 1509
851 2443
5222 4572
7099 1759
7227 5417
3548 2286
8740 492
1994 2242
245 5657
6534 2819
5155 1614
9239 7820
4555 8470
6093 162
1172 461
1827 7394
5379 2261
3571 8282
446 488
2574 8316
1986 9071
9436 15
8808 562
5328 2966
9670 2513
2063 1956
7442 4834
9011 2416
269 2972
1692 5382
5677 5412
1478 9054
11 1590
2304 1473
4047 422
2380 6745
552 1959
6099 8280
4209 9340
5659 1644
5008 605
6331 4145
4032 9244
6765 9480
9329 8569
4885 2231
4639 6643
9506 1168
4385 7312
99 9991
1986 3614
8060 8910
8293 1258
9129 195
1029 2290
2018 6604
2235 4662
1199 8594
8259 7492
4446 300
2673 4037
5395 365
5136 2177
2799 9569
3659 442
9332 8739
2208 8888
8567 7219
7249 1185
679 5799
6269 2763
8078 3951
7391 4756
4022 1437
2677 114
2477 8405
9604 7959
6732 209
5161 2392
7348 8936
3059 6270
5098 2320
7408 2956
9189 9089
6757 9153
8389 364
7218 929
7686 8636
2116 1391
406 204
9053 7230
4851 634
6721 4888
3432 6346
7459 5550
2090 8957
640 6050
6286 9491
8425 4881
3693 3551
6215 1317
3690 2251
9306 378
6563 6156
3650 9343
2519 422
1138 4079
1272 2675
4530 8113
3824 1984
1220 5036
2296 8169
7289 2543
2807 1478
853 8848
2184 7414
3392 8100
6271 587
9950 4287
3373 9781
9298 6588
8018 708
830 9326
7779 2456
8062 9656
4492 8332
9318 6586
1719 115
6728 7245
5597 8129
2267 4161
2173 796
8889 1429
2379 3124
8551 3719
3115 8865
9194 909
1118 3213
312 2915
8892 2290
7949 3045
275 757
9375 3824
4910 9955
1044 5924
9386 7290
5619 8012
4117 1595
3368 3665
8215 7311
5420 9324
966 3304
1844 7755
1525 409
2680 8214
2700 1192
423 546
2574 6019
2697 2725
4902 5089
9621 4779
1620 5435
6917 4409
4807 3787
5862 4208
4843 291
5620 2404
2277 9072
3046 2382
2732 8305
3014 3711
7467 5331
4548 8693
1044 3343
8107 1619
6599 8998
7443 9820
9075 8731
313 784
3980 7426
8236 3962
3278 600
665 6617
4273 9923
4202 6014
9261 3227
2842 7477
4400 3114
2220 7224
6366 1648
9805 6720
9544 1241
2326 7485
6784 275
4711 4152
3244 4810
9649 7031
3865 9239
8514 737
6049 153
5078 8610
9424 5042
2908 8241
8276 1797
5399 7377
243 4014
6742 2133
690 9155
455 1255
8035 2857
2695 3882
4382 2619
7628 1790
9667 4134
9111 3125
9646 2904
2740 1636
4253 9467
3172 1547
2350 6412
4413 1896
2636 4913
2624 8777
1628 619
8076 578
2675 3431
1601 2766
1050 7003
5303 2584
7541 7376
1616 2796
1744 1866
7083 2522
1338 1920
42 3595
3447 2536
2423 2263
65 6818
6530 8230
8591 2361
8734 9173
3273 5877
6909 412
1546 8500
3097 5261
902 746
6101 6656
894 2966
6371 2973
2066 280
9143 8473
4103 4592
5419 5925
4537 3592
5060 4418
7986 8885
9877 1194
1724 6538
4388 1547
4339 7117
2570 9941
8655 190
7390 5655
5825 2053
8932 3429
3307 3819
5313 4316
8725 4780
9458 137
1853 3260
1262 6391
862 5240
3482 7831
8181 382
716 1557
5312 7247
9810 7176
7959 1347
2291 1402
7136 8910
8694 3065
5726 8738
2609 2686
6361 5845
8965 9820
1604 9077
169 8315
2907 9785
2659 9013
1051 377
4558 5408
9447 8289
9273 4558
2535 6785
2988 6161
8372 7705
2417 9795
8242 932
1536 7493
6236 6610
1194 9702
6103 2923
4955 9478
4448 6960
586 636
2535 2580
8259 3189
4672 2955
1015 8414
7127 8769
7489 3476
2180 3150
6925 265
3567 5993
9044 5002
9446 9211
699 4943
6989 9142
6317 1522
3221 1750
502 8403
3088 3814
8913 2876
8020 37
7924 1041
4734 954
6411 3082
5849 4966
7410 8164
2671 906
9607 2132
7262 793
3167 7742
1391 1775
1399 3973
4372 4146
1246 2916
6959 2295
7298 2028
9467 568
7416 9007
6613 6693
7888 4301
2378 4488
9128 4844
312 5118
3072 2621
61 4579
4349 6268
7461 717
6562 8713
450 8524
2796 4581
6652 400
3405 3327
8092 9963
3579 4848
579 1800
3738 1571
1104 829
2935 4233
2274 9469
9574 8091
1163 2641
5599 194
2678 9400
1844 2740
346 1500
4119 2543
8462 199
6441 2875
5919 8646
5030 2603
2705 7949
527 4453
1539 876
2520 690
2598 7264
163 823
5759 6524
8332 5157
1706 4345
2039 8175
1425 5771
855 1914
9710 8999
7600 825
4078 354
5983 5050
2854 4812
8505 394
7834 3133
4401 80
9116 8734
7870 7145
6449 2155
6796 3840
1306 4535
2850 2257
162 7344
3172 9310
3203 4421
8985 7985
6639 4902
6256 3699
3611 3451
7134 892
1550 1112
7931 2540
5147 5503
2175 6809
3242 7702
3607 2122
3726 8650
268 1812
7667 4
2374 2851
1078 7627
7452 7515
6778 4346
8495 7103
9656 7396
2328 9169
8886 4406
8063 1404
3339 1659
1774 1919
8018 181
1445 154
5005 9531
5663 9854
7996 9150
1525 9392
959 8400
6305 4926
7848 5127
2646 1478
8388 8798
9214 4195
683 382
2580 4280
1830 987
1811 1394
2832 4385
8590 8521
9440 4177
7922 3448
1543 9654
361 4526
8725 3453
5296 9156
7840 8692
2555 79
1000 2274
7672 6664
7956 2488
9329 4746
7009 5894
4950 3115
1613 3953
618 383
5119 7588
6845 7546
1641 8004
5914 2581
9584 1961
6161 3187
9387 9801
6600 436
2475 2135
8494 1321
3594 7484
4528 3416
4599 1253
9231 1779
1232 4766
7009 2100
8385 7852
9751 4988
6269 1233
5280 6621
1465 1724
4316 660
5297 6527
1524 4971
518 6853
1687 8029
7893 9907
4456 1339
3038 4398
7446 1663
2130 4318
9004 6000
6606 1058
4874 5429
808 1380
6691 6749
8856 8542
9930 335
249 7485
6902 1453
2160 9061
9245 7310
5788 7605
992 1067
7326 8524
1604 474
3227 5115
1745 1450
943 4685
2430 4719
9749 4870
2908 6271
4500 6840
6849 3323
9100 4603
2376 850
2690 3853
9608 9266
2392 1736
6082 4960
720 9284
2927 8267
5314 8509
7673 1020
3580 5910
1849 2752
522 365
593 7225
2166 737
8138 5857
3041 3122
8721 97
8419 487
430 1890
1920 9542
37 274
268 4800
9088 217
1056 858
2061 4316
2188 1604
6244 7313
2431 2611
940 5924
9414 6817
6078 9290
1745 6056
8473 404
3916 683
3048 5526
4301 502
3233 4072
8505 1815
4208 1085
3292 7372
1315 4147
8232 7263
711 4074
4957 6896
3507 7416
2059 7521
2163 92
1220 5272
8072 4481
7541 2016
9086 5638
3030 8481
1646 9388
1760 6769
1621 3519
2270 1035
837 4824
6967 3615
9562 3826
2220 4586
7920 9949
1405 3288
1571 7088
417 407
1254 8241
5909 62
2776 2809
7316 6813
1317 7988
152 8567
9417 823
7344 8141
8234 2165
4674 5549
3558 4179
211 4827
9402 1578
3621 5950
9764 6989
7392 4415
124 1868
2197 1789
1407 2745
1006 3220
3884 5913
9290 4736
6595 3116
808 8300
7337 720
353 7648
2673 6163
2331 2842
6008 3560
2059 4268
4816 8861
3146 791
6848 7050
7836 6630
7641 6268
7053 430
6588 2402
1341 8036
1370 5640
6830 1664
3116 3778
7867 5888
8869 395
2155 1632
8628 8655
2166 2233
2318 9654
551 6343
6427 1443
9747 5408
4432 3787
1353 1714
3965 3737
3962 2619
6712 1521
6987 1695
8906 3363
5497 1478
2248 5379
7900 276
6517 8359
6575 6925
9846 5905
4350 1192
9462 1438
1409 1411
8410 1901
4441 9192
1688 9396
1369 2334
6500 1776
263 5171
2571 3003
9154 4249
3204 1971
9653 5630
3459 5672
5549 6192
3120 2038
7768 6001
9383 4932
7327 6552
9889 5724
1494 9992
2723 364
6033 724
3830 1468
281 9411
7575 7730
1934 6497
3039 6146
4911 3399
1606 9562
6537 6507
5379 365
4829 7514
2456 4093
261 742
1164 2094
2327 91
5640 9129
8682 2726
9318 9087
2537 2280
2982 8543
3495 215
7811 9002
8578 4293
1478 6036
3546 4037
777 13
8036 7484
5007 1521
9530 2517
9282 9133
6933 6008
4605 9683
3838 203
8956 5472
5473 4952
3456 7947
7283 6017
1719 3985
2965 7874
5355 1535
4377 4647
986 767
6229 6510
7270 6856
7174 5645
2205 5615
7175 2039
3852 6450
7042 3019
3488 6582
9398 4686
957 7182
5002 2522
9251 7968
5025 8710
2189 9539
2318 8360
5820 4764
1193 5736
1235 5705
9027 2519
4340 8205
2326 8560
444 6429
4865 6894
8410 730
9267 6511
5813 1760
6613 1431
5807 9102
3581 216
9924 6728
1680 2128
9848 2026
9352 4083
32 5181
7478 7994
4847 7614
9066 6492
9812 7053
4897 7245
4594 6884
2974 8773
8417 7625
8636 7986
6003 1733
402 3584
3177 9590
3336 2599
6854 9393
6233 6550
4084 1132
7642 3855
9334 748
5946 67
7454 7258
2986 9183
432 827
4751 359
4759 7760
3078 3282
6439 7019
9127 6086
3858 2276
6413 582
7070 9899
5845 4217
4951 910
1189 6045
2625 4093
1695 6827
1697 7484
8773 1981
765 6233
1775 9005
6432 3887
5739 8112
163 4010
5269 2771
9481 3211
8296 9348
7177 622
5763 404
1489 7835
815 2972
3224 9258
2448 2094
3701 6907
2922 7373
6879 4660
5862 4688
2325 6460
677 2962
3903 2408
52 1998
4852 7859
7392 793
5837 2067
6508 48
5386 6730
4705 1668
4388 203
678 35
2994 3438
4352 8489
2048 21
699 6231
9692 4672
1273 2483
4675 3197
6571 8207
5917 9348
8670 2046
5396 8786
471 5860
6698 6693
4835 7166
3051 8776
7336 9827
9168 9262
8544 8153
5990 5812
151 5770
8623 9218
866 1016
4871 3555
7026 3615
8682 614
9818 4394
5716 1523
2989 1097
5545 18
9740 3121
902 1944
2479 9492
1879 6995
929 6115
7643 1721
5489 450
9269 9532
6582 7067
1636 240
9330 3749
1989 5024
7851 3285
2039 606
8502 7862
4879 7738
677 5654
7774 6261
8034 2065
1920 1829
1804 9057
9621 1483
7090 6262
149 1012
4877 8835
1328 5134
499 7449
277 2987
5273 6632
2660 8714
8857 499
6020 692
2693 2275
1017 1701
1642 2191
4609 3852
4184 3355
9294 6724
8273 9742
9849 8867
2160 1448
9525 8003
493 4100
817 880
8382 9274
1250 6417
3311 7736
353 4618
1861 5730
1664 2289
47 6760
6403 5727
2110 6775
477 4186
4231 7970
2552 8737
8631 9731
2713 968
8374 6396
947 9348
1727 4675
6235 9401
5759 7774
6556 594
8044 7387
2732 8240
7400 8739
1055 3320
646 9551
6202 1270
7564 1339
2506 7766
1049 7131
7670 5732
617 348
6370 9474
887 7068
8022 2939
7506 7660
9983 7365
6595 3844
916 3820
8030 7176
3451 1229
1415 8842
5949 6656
8279 3552
9559 4602
4431 2328
6547 7425
3868 2505
2854 2145
2459 6540
5163 5726
1727 522
7744 7947
9426 327
431 3947
2600 8896
5777 8327
5994 5969
8414 5215
8257 8858
9159 6628
9280 8163
1783 3525
3879 9965
4535 4216
2374 5643
3730 3276
4543 1729
5321 4092
3936 7291
871 8663
7487 4034
3047 2222
822 9179
8741 4173
9553 2048
6818 2733
2661 7170
3964 1097
9348 3135
77 8512
974 3857
6243 8987
1178 1032
3792 1824
4085 9353
9347 358
938 3270
8647 3721
2292 9184
4058 336
6096 6762
3648 7773
9893 6048
1193 7861
840 1271
9280 2129
6235 4823
1670 8612
9799 4887
1535 7598
2090 5288
9419 3777
5842 3365
3255 674
587 856
709 3937
1989 1648
825 876
89 1186
5254 1121
3565 3102
2009 899
3319 4644
8195 8559
4911 9671
8061 7680
8423 6336
1095 4319
5263 1621
5921 9663
6916 460
8718 9256
3209 8667
662 4370
3385 370
7147 8836
2907 1739
3726 2158
2247 816
450 4820
6729 8462
7410 8764
7348 5129
9135 9738
1368 3121
8524 6009
9046 2259
93 3997
5907 3090
7229 390
5404 9383
4320 1320
6122 5303
2728 3673
7462 532
7820 8507
7342 3191
4757 7354
4151 6764
6443 136
9270 1790
3008 1000
7466 1909
3291 5447
8108 9037
5736 8737
8331 9866
6205 8467
641 2456
4608 5789
1033 3447
599 5851
709 1863
5344 7620
5147 3264
3443 3506
3184 2102
2453 195
6456 9227
8750 8783
8012 101
6989 6252
5373 5921
8682 830
8536 3480
1628 2050
2219 5074
3837 8205
3735 264
10 6305
4902 8046
4239 7424
3039 3536
1699 660
1319 6492
592 4301
2922 8721
1862 1276
5227 1350
4079 1313
3752 895
5046 1968
2370 8923
6260 2041
5195 1953
6891 7816
4545 6989
4919 2890
5098 2725
6722 9889
1152 144
2151 1881
5855 3417
8521 2588
380 1345
2245 707
409 6067
20 4863
5558 7132
5814 8951
1274 2107
2492 3602
691 2901
5252 4951
5802 235
9098 7955
3306 9088
8749 2059
8930 7718
1808 1539
9881 3561
5634 2158
4498 5374
1776 486
9648 7069
9657 2879
28 3676
1683 6615
3748 5518
6988 4849
6230 3789
4931 2594
3390 851
2152 4955
8908 1231
8322 9912
5498 9814
2527 8392
7724 6808
5601 95
6296 4724
6935 2888
5224 7390
1097 239
5150 8737
8329 7870
7639 8880
4230 8582
3571 5425
578 8576
5492 6876
3030 8228
2790 8848
6581 5562
2590 3367
5151 1984
2645 4091
471 5931
6967 2825
1270 4897
1814 6149
9457 9959
7621 6014
4297 9430
4274 9731
4226 8819
4723 5350
6502 4047
1109 9104
3434 2172
2849 4133
6914 2114
9632 5017
9536 1312
5536 100
35 2519
9991 8274
4238 9411
2247 7310
5269 4619
4179 7616
2512 5628
1121 660
9369 8129
2528 3181
3480 3542
8588 5961
4673 6252
9216 9815
924 687
5852 9879
8054 5463
1415 5329
5750 2412
1158 5432
2883 7902
8525 9856
2996 7907
5 2894
5095 5506
3983 607
8022 1183
4536 4556
3350 3368
4382 492
9570 3600
7474 3370
7129 5898
1614 8921
1827 4728
2473 8053
5705 8996
8041 4155
9062 5840
7944 2684
2744 7177
9593 6142
7579 6193
1133 628
696 6700
1906 3216
7930 4715
139 630
3586 1960
7141 354
8444 2785
7881 4460
7905 1896
14 5146
3934 266
5073 1207
1444 5647
39 7635
1889 2018
5154 972
1760 8225
1283 8315
6604 1047
5455 6722
2123 4984
36 3396
9097 5357
2013 1717
946 3793
7221 4388
6660 2682
4473 182
1459 2156
9793 3702
5439 7227
6320 2921
9956 5887
1337 1350
6480 7501
2437 2790
267 6116
8898 440
962 805
6910 7433
195 6150
3461 3138
8896 5864
1095 7410
7582 2216
8814 1581
861 1043
686 9893
1533 1902
9149 6504
6591 8565
277 522
5609 2466
584 6341
430 8144
6484 5295
14 1936
1863 6811
2586 1548
2836 1233
2971 1771
854 978
5539 2276
2789 3079
5571 4454
7287 426
719 6615
1736 7687
6879 9883
8509 2884
3111 1512
2054 6767
1434 87
5506 519
3354 2750
3928 3309
3619 3804
690 220
6073 4852
6268 9751
3983 5998
414 6690
1865 1914
822 7061
4564 183
6042 6012
1061 7395
6813 2161
5551 5507
4031 3534
6041 5909
1546 5838
8351 2804
4122 8404
9975 7821
6636 2190
1511 2191
3147 3034
1174 1544
647 266
5824 4990
1415 1365
1086 4634
9664 4030
757 2908
8102 7593
1933 2587
7506 1562
8821 3691
7973 480
2277 5349
2349 4291
1269 5729
9429 6890
2844 3239
3425 3936
2347 3591
43 4279
5371 9957
8616 6541
3812 201
6638 3055
1535 3926
5497 2075
2287 1193
92 3866
4459 3956
9270 7726
6431 2508
5925 2616
9221 2624
9855 9086
8653 7851
6670 1483
1924 7980
3548 1639
4308 4036
2352 5512
7336 8959
9383 6745
3299 470
3814 138
8914 820
9599 1944
7471 5464
8627 1502
1863 6603
6967 3436
398 4530
4298 9400
1361 134
2821 1811
205 5331
1747 1949
5503 9069
435 2714
315 3722
1804 7799
8320 9931
8481 5240
1531 7964
9014 1764
9852 3807
4738 9091
7766 5732
9716 1382
1819 5741
8362 8393
1223 975
1280 4581
4187 3530
9030 5976
9086 1884
4982 585
735 5939
8468 6454
4749 7650
2359 1312
7642 4150
2247 5930
2078 8457
5206 3246
5112 4775
2276 7729
986 6591
9502 4248
5222 6732
5720 3066
5427 9093
2523 5320
7269 3074
1215 4971
9932 6432
9421 6684
9979 8198
1518 4378
1948 2281
2376 6663
578 4029
6843 2244
415 2077
454 1486
7959 9884
1232 1065
3524 6525
7396 2365
4412 8993
1323 3486
1648 9423
288 2416
9750 1640
3681 937
4361 7211
18 1305
159 5414
3446 4905
1564 527
1968 6528
7126 386
5398 3132
3160 4092
824 2399
3402 5399
8032 8007
8369 470
3306 4434
4595 2516
2805 7121
6366 4760
4555 1005
1625 1500
6414 1992
8251 4846
131 3766
506 2454
5459 203
8647 7673
592 6870
4697 4654
2453 2318
3095 463
2305 8364
8602 3986
2069 8826
609 3480
2363 986
8119 7205
9178 330
8194 8370
4824 7286
1261 5424
8831 3759
8201 4654
4435 8618
5200 4236
338 6284
9962 3488
4909 3989
7843 7097
2055 1418
9804 9587
3611 1704
7536 4267
5347 54
9179 8707
1414 5338
7302 6519
2033 4126
4566 3921
2186 7412
8262 3978
5920 3080
402 7907
5303 790
2070 2483
6291 9115
2261 9105
6723 7776
4222 3380
400 4612
6284 6664
4598 8633
5758 8085
4530 2178
1622 331
1932 2716
1989 1600
1463 6427
1447 5278
391 5173
7483 5894
4642 6677
1894 4025
9450 7977
1736 6521
5530 7997
1263 2859
1791 6507
2971 2048
4889 3795
546 244
18 5384
2628 1638
478 587
5729 4201
3636 476
7802 6507
7148 2174
5446 2308
9497 779
2854 9089
2729 7512
4859 1106
6970 6297
6198 992
4623 9240
880 4292
1044 1506
6715 2051
5582 370
5945 9246
6759 4195
7659 4778
4024 6992
9725 8954
1127 4350
6800 6070
5236 1005
1720 6726
2366 3962
215 7087
4348 8249
9465 3538
8937 1329
1698 3153
4031 2200
389 3715
2503 6289
3671 7354
1823 290
4371 2163
2397 1019
9246 3102
2628 2404
3790 3775
1236 5159
6247 388
7623 9406
1510 8855
3113 6494
4241 7606
488 1972
190 5186
4637 878
6132 7701
2808 77
159 4407
6851 2809
616 2642
9120 646
1380 5044
7860 2470
6428 6070
7112 7376
5053 8779
4014 6639
2992 5963
7025 7198
9309 1665
720 9010
91 7169
8348 6600
2395 4125
1824 3137
7783 7802
4641 3514
2100 7599
309 8177
415 1662
5657 9062
968 4422
3101 7262
280 1128
355 3166
4536 3736
6569 1430
4277 2231
7219 1723
1983 4031
5676 7881
1297 1278
5454 6569
4694 1702
2144 1488
4313 9812
735 216
2957 7328
5633 9091
415 8356
4598 1244
8265 2417
9023 273
9400 7247
8372 2318
961 35
7792 9851
3695 9189
768 4218
5200 1890
6252 233
7905 8288
7237 2671
326 3312
5120 9781
4158 3561
8513 577
5719 7459
3180 2907
2622 624
9863 6874
5898 5090
3044 6015
6730 4473
8894 3109
5259 4203
5474 5782
5726 2745
1920 7730
2442 6928
6098 5612
1486 5005
2733 3621
4953 5653
3461 861
7550 6964
2693 8886
6194 8116
5631 5804
1368 5184
8321 1506
9343 5113
1978 9823
5994 5657
4491 8313
4272 1462
1360 3632
4357 537
3601 6142
6857 9760
4244 7053
9776 449
6966 2395
2385 4000
8010 42
2258 7267
4945 2682
7525 3667
3419 2042
6140 2918
988 652
3618 1707
3026 3978
2877 4197
6566 4454
7918 8508
9233 2406
1339 384
2961 7519
5072 1903
893 9249
6033 9017
6533 8756
9939 6579
4013 3521
8348 9
5931 8756
1111 5655
8703 7552
204 1305
1715 948
7456 7665
387 925
6265 8425
8367 4924
2149 5258
6015 873
8540 6620
8262 6856
2322 7599
6233 571
177 298
4642 9944
5751 3873
1488 8349
2108 604
9313 5793
2087 6198
691 156
2257 6884
2744 1354
5418 5159
8904 2059
2074 5842
2715 191
3243 9216
3575 2593
2245 3968
3686 2081
1066 1827
6572 1126
7412 3192
4264 2468
5099 4581
1385 3498
6235 7656
3059 1327
1205 2510
6113 1343
8149 3109
9885 8048
4100 2653
7790 2522
6079 165
3201 9110
8952 7555
1868 6501
316 2515
6111 7765
8772 7556
268 1280
7103 7758
920 2677
4208 4185
2450 2491
4724 4427
6099 1955
1895 5104
4423 9150
6887 6543
6267 5519
6905 2298
1847 321
8075 2678
1807 1788
9290 3068
628 1829
7445 9327
880 6547
1954 5790
3746 5129
1743 925
8934 5057
6459 799
41 965
166 6951
7836 6340
2486 3264
3702 2595
555 7368
2943 2418
134 3332
9546 3793
1829 2385
1059 1858
4802 7207
9626 9648
8366 4386
6766 1041
7688 9940
2237 6152
9554 7589
5803 9918
8853 4700
6721 258
7907 5395
8520 846
382 6534
5126 2124
1272 9308
8056 9145
5946 8746
7969 5065
4665 6180
3682 8603
1077 1461
6859 9822
676 4240
4400 7908
9231 9592
143 7174
1195 3453
2177 9880
4715 2360
3727 2095
6004 4826
7576 8416
1409 528
448 7323
8232 25
8410 5287
492 3034
6314 1247
1140 6114
804 2510
5213 4122
2537 4135
6235 7824
2195 9033
7878 2004
8270 4209
5474 1553
9962 1296
5583 8640
6990 2062
339 7530
1552 1950
1556 6605
8498 6628
2235 6465
4063 9237
8453 1515
726 1630
5292 2674
9798 9432
7445 2624
4395 8666
5579 7226
2967 2719
156 7908
8548 1850
8706 8191
3881 7223
9333 85
2332 4628
7231 1974
632 6912
673 3731
9791 4306
4308 7291
2545 2749
2130 2885
7069 7059
4197 9165
7286 9864
9648 9122
7098 8952
5805 8320
816 3051
5111 121
528 8071
314 1673
7144 2135
7495 8698
8603 3740
1212 6085
8172 6737
2403 2954
6748 675
2890 5346
9952 1520
9715 2883
8407 4255
7789 7652
9643 4689
6851 402
6821 3942
5954 6946
9334 4819
9073 3079
7059 3970
8684 3046
1824 1387
9874 1737
7681 498
5201 6097
5405 7025
3309 223
6500 9415
7256 5509
594 705
9807 2280
5972 1688
6769 4296
3115 3723
1158 580
3311 430
4781 5592
6053 8307
6214 1336
2372 6137
1121 6865
1028 3490
8983 3678
6424 9177
4328 6329
5774 7443
2068 9682
8229 2149
7358 8117
6270 2615
2333 8103
9302 1016
5077 721
2514 4114
1463 6432
4348 7967
2628 5452
542 1339
5351 55
1484 3516
7267 6905
1927 96
90 4202
399 1398
4305 5151
6760 1344
4016 1289
8000 2246
1598 5018
5808 7039
5724 2137
3698 9452
2609 7544
610 9845
9398 2132
4311 9336
6323 7452
8740 8863
394 7238
3082 4130
641 7263
9953 7533
8758 5586
630 3106
8351 1258
9639 7554
9167 2299
3229 2056
1472 1182
2537 3287
8173 1419
258 7702
6494 2236
9470 24
2330 3391
6831 7505
312 1437
7552 2118
871 1337
2208 5044
7487 6267
654 2211
327 7805
2310 5868
537 2293
2266 9257
1554 3701
1237 9373
926 3407
5852 3172
8084 1533
4294 5611
7549 7008
9741 4883
5803 1464
3238 898
1448 7523
141 3643
572 9977
1332 6207
5876 6391
382 8660
559 7962
1879 9269
4746 6543
1495 8442
5438 3736
3606 6697
264 8434
5810 621
1834 9317
6318 4902
817 7627
8493 9489
4102 9941
8944 9786
7241 9642
4877 2943
7962 225
8913 4775
7834 8498
9110 3746
7778 9112
6696 8706
49 825
9684 7435
4540 5289
4003 2055
3698 8763
1814 6238
5182 9258
2050 3012
3600 5031
3918 2402
7677 6948
1786 7434
982 6785
7122 1381
5783 2740
979 6511
481 6110
2702 9510
3402 2972
2635 3214
1874 3771
2543 5385
9210 6528
6881 1989
5905 1734
2009 2342
3679 4393
3739 2950
6965 9571
5827 346
8500 5669
7664 9143
9886 4105
6374 6036
9658 2997
2350 4466
6347 5075
8833 7274
3347 3550
2390 1445
8788 207
9368 8610
8312 2025
9035 9491
2241 6306
160 4025
5043 8755
4519 866
4737 9746
1316 5055
8453 6430
4309 523
7332 2986
7940 2793
1426 9166
6856 1341
8865 9866
5312 5902
1216 8044
195 9386
786 5396
2465 811
2891 3286
2031 1800
6258 3088
1089 2383
2228 1373
5160 1329
8726 2937
4526 3375
4573 2646
8512 5796
9201 8638
9340 9458
4863 7690
9066 1890
4718 9298
9728 7942
6820 4822
7248 7298
2122 6540
8357 2682
6253 4667
878 8221
9175 2712
7898 995
1213 3071
4917 5858
2074 3412
2818 5063
5629 9402
4681 3188
910 1124
9106 4901
9974 7658
2707 9639
9215 399
5959 5626
1402 9120
7392 2230
3776 7983
302 6477
6443 2721
4656 5040
8982 660
58 9044
8882 3125
936 1926
5450 6338
6866 5549
5561 2059
7504 5263
8107 7310
1376 4199
6913 9044
2726 4085
6841 1238
7555 2886
7118 2611
1801 2709
5099 6438
1709 1042
6662 7540
1678 5378
8106 5523
2214 5992
2389 5330
6222 7539
6884 2276
9495 4695
6556 254
7622 8672
6363 1156
3952 7669
8461 5263
6983 9001
355 226
1363 6776
2769 2829
84 6048
631 1617
3462 8413
2099 740
2774 2298
7316 3720
9845 9492
9698 7304
2155 5041
5084 466
2894 514
1298 235
6322 9909
3893 1087
19 2510
4907 680
2049 598
3991 8210
1867 8308
1929 4764
1024 1228
4850 4113
3825 8741
4074 3480
6347 7472
2198 8088
5188 4421
3748 1984
9732 3888
3000 438
5014 9516
5308 3215
5566 7086
2836 8479
557 1718
3648 6449
4163 9554
2453 9352
8548 371
7486 3575
9551 8867
575 4222
9051 1239
2299 7542
914 6322
8022 3120
9395 683
7341 5128
8578 1568
3796 720
7299 7994
5696 5274
3639 5586
4007 2149
7462 6693
565 8348
9374 4596
609 2492
1802 7823
9039 9909
1831 2292
1910 786
5315 9442
1668 1548
5590 5954
2721 8348
38 4264
8274 4992
1925 103
8143 5872
4190 2259
9543 2833
7217 9723
834 1641
6474 7110
584 5284
9928 5500
672 215
637 4233
4555 9107
9362 158
1906 2669
8589 6505
5484 2555
2517 806
4405 9009
9765 7702
7948 8028
7199 5166
7308 9999
7971 2579
1918 9677
4752 4885
1228 6070
4026 5113
7864 8709
6445 5484
2862 4569
177 1236
3192 1955
4398 7865
9857 6863
9858 1428
3212 9207
5537 2615
6998 3780
3068 1022
9161 2294
8565 6308
9714 5366
5393 9913
3525 4458
1647 162
6319 2825
6665 2753
3933 5919
1417 7303
9707 8163
2014 695
7295 2072
1166 5149
4392 4321
1486 2543
7425 3848
7424 7027
8714 5776
988 4241
9065 4729
6338 2122
9452 1333
2862 1433
2002 377
1837 377
9451 3989
9488 3303
526 4904
6815 7241
2122 5309
4816 2255
2958 3787
5640 6761
2796 9020
7232 8090
4843 3867
1835 683
5885 9108
9912 8195
65 1063
6019 5269
9962 7773
9105 4827
3295 6414
3468 1362
7572 8322
2059 9653
376 3062
4085 2158
2977 242
5191 8155
4053 3257
1557 398
6762 1984
9134 39
3617 1378
2579 4325
2398 8067
632 6923
4363 9588
1436 1376
4574 7286
4086 3706
6056 4131
9121 4027
2255 4169
7801 8284
5486 1944
4406 7209
1371 1983
6488 8974
3754 7298
8388 9585
8832 1310
1247 1791
7019 608
983 5307
8944 1251
4714 4996
276 2648
8129 2871
79 6187
3709 1797
766 1555
310 9527
3752 714
880 5854
4404 2462
4110 7247
3321 6296
2763 4944
8453 2699
8935 3644
7410 1615
6862 4653
614 5774
5056 3355
6810 8494
7900 863
8813 4145
2990 7149
4394 9369
4779 2082
9559 320
1435 5978
6367 4167
8870 5205
3155 7821
5906 3802
4220 434
3628 8813
244 7709
2100 2605
5862 3947
5534 3729
2451 6041
1654 9573
231 5332
6372 6831
8811 7518
304 5831
7692 3956
3432 9174
1211 1134
5232 7358
1766 6582
5513 5226
5176 5853
4181 9143
6029 522
6410 884
9032 9540
2069 3222
184 34
5713 8127
4584 2209
4456 6559
6230 9814
7720 2300
7 7605
9578 5582
2729 2353
2127 9422
7017 3573
1084 1185
853 3010
504 8895
4276 1210
1028 1448
9621 2797
266 9001
7670 1281
5880 7611
7367 1015
2111 2270
3598 2635
7095 6676
7931 9629
8790 240
7438 4046
5313 9409
328 9629
9666 3178
6736 3587
810 68
3127 827
2136 4101
622 5894
363 9827
5702 3645
7157 1156
7799 3129
9728 3000
2950 5408
4389 4297
945 3648
395 353
9197 945
7613 1389
5026 710
7488 753
1732 6453
8067 316
5430 407
4711 6509
7818 2754
817 3270
4028 3029
7677 9376
9808 9043
6293 7056
409 7491
3651 5784
7580 7111
3780 33
8899 8125
8157 5943
8454 8819
7746 3381
311 686
1220 5123
1213 4667
8459 1773
9300 9479
7701 2022
4211 541
8206 1757
1534 4959
656 1631
5884 1703
9468 3389
2636 7342
3706 1167
2756 7724
7198 6808
2922 6865
1515 2828
902 6371
4556 7600
6231 8361
9281 6850
2150 6728
6775 4953
7320 1404
779 6285
8199 7881
5088 1817
8883 1378
3279 2720
549 8090
5390 2958
2677 5049
9940 3713
2813 9969
3756 5000
4733 7057
8456 9466
4992 618
7752 9274
9135 913
1644 9530
7828 3924
6758 6222
354 9217
4275 2754
2499 9955
5931 6430
7362 77
166 3257
4858 2684
5346 1532
5854 1689
9523 2408
1627 6508
2602 2362
1179 4615
1898 8078
4523 466
2470 8051
896 9650
654 5886
7413 2944
1532 3440
359 8295
5818 2172
1397 1326
8791 5300
5170 5415
3338 6835
4622 2118
6357 7937
484 4070
1213 8338
21 6025
7625 4832
6116 9135
1866 6426
4387 7337
3386 7981
9582 2013
5383 5330
8774 3357
5426 488
6626 9059
3475 4676
5761 7520
9760 3030
6914 5110
5822 6413
9736 7010
9495 1870
5528 1166
3916 81
661 2997
9021 7356
9614 3353
4534 1764
9782 1361
1228 9057
2532 487
73 3714
8812 7906
2660 2449
5934 5070
4677 7032
3837 3877
5527 547
5939 5208
8303 7784
8227 446
604 6645
4031 2097
1039 201
3659 1972
9581 6278
6961 3529
1522 6965
8455 819
617 2618
5838 7256
521 2921
8940 6041
5042 26
2525 4997
313 6329
5525 9786
8783 9777
3081 2301
2617 1833
8862 3549
1276 7967
5122 9059
7239 8837
6890 4460
2757 6666
7756 3706
9891 5434
2574 4200
303 5544
7758 236
6258 7739
211 6242
2240 1222
4308 9527
1853 3709
5832 2963
4513 8789
7821 1147
431 667
9997 3845
3923 7640
2878 733
4810 8387
2553 2472
2679 5655
9710 9367
707 966
6389 2926
3668 3231
5320 837
8514 876
1455 3279
9366 8415
3164 9834
2563 9022
104 4646
8057 5292
3534 3385
3863 9754
4839 4562
946 6686
4821 5100
4788 9123
147 2534
6566 6897
2093 3729
1696 7007
6301 4377
3312 9829
7621 4967
8890 6327
1524 2119
9280 991
9346 5446
6658 7209
2910 2062
4055 8278
6827 6116
5116 5017
1254 1185
140 8326
3435 5505
8753 8236
8456 6793
1242 2096
4962 2364
157 236
5015 2175
9119 9416
2772 6667
5522 9816
1160 1683
62 3381
5064 9831
2099 5617
1460 9049
5470 2469
986 9438
5291 7629
6922 646
9913 2055
90 1039
900 5335
554 311
8207 7487
4635 1073
2112 1869
5963 2491
9968 8261
1700 7933
4403 353
8967 6948
8277 2054
6450 7535
6246 2409
9914 6714
6264 2626
5205 7049
2214 368
102 2679
7351 972
5822 1425
9107 1826
2913 8668
1109 6958
7272 5310
4482 7283
3957 827
7225 3122
2668 542
9275 2265
399 5355
1869 7274
874 2418
5147 1005
6529 2247
7536 1720
55 1984
1907 2302
4049 2287
2068 2359
4074 6657
5816 2463
296 1750
7313 5024
2542 3473
3057 8276
2259 2050
2944 7237
4963 6210
77 9848
4693 9871
8849 9355
9421 217
8010 5610
7859 2236
9462 5128
1075 4335
142 571
3830 364
3718 425
3506 4545
2834 1218
1357 167
5882 5374
3703 5153
5633 1961
1433 4294
8787 1275
3304 3395
4862 3757
7583 827
8386 9241
4540 7744
2987 8753
6857 5207
1791 9763
2430 9014
2099 8796
5 2657
8947 9546
8926 3014
1474 1030
7268 6614
2254 962
6688 9221
2007 143
141 9955
8577 9219
795 5020
905 5544
888 9933
8757 6792
7948 2568
5374 5640
5267 5898
5042 8163
6992 5066
1045 8745
1936 277
1561 743
157 9672
6174 7865
1669 9405
8875 124
7306 3035
3165 1945
3883 6087
3711 1343
4290 3471
5435 6081
2351 312
7248 1248
5398 9781
517 2649
4388 9388
893 5186
4359 2692
1723 9713
7519 1314
8295 8639
8832 164
3905 3115
8553 2029
1462 3793
4058 4882
8850 8604
3985 6980
517 1065
1702 9903
2616 5519
5560 7634
1841 4940
5543 3265
7429 5409
9491 2936
6030 3681
5733 7984
9981 6678
5756 6774
3154 2293
7147 2538
3209 1395
6578 2102
2743 5959
1833 9680
6630 1522
7300 1057
6174 3964
5555 6807
4165 6065
1369 6647
375 252
3968 7879
6505 8883
6635 1692
106 3843
9053 2607
7131 4029
5752 1461
8161 353
6247 3791
1801 58
6208 9119
4763 3995
772 8541
1058 8024
3386 9945
7035 3895
6795 4433
7915 1208
479 6037
1046 3220
871 8297
254 1314
6348 7035
1177 3680
6537 9494
6694 9151
5332 8102
1425 8383
4243 1356
8261 6254
2220 2676
1889 6235
8605 966
1374 6527
1326 1418
2112 8511
3763 6016
7707 9451
2423 9310
6376 1450
4357 4475
2599 9290
4168 2172
9079 9954
774 716
1413 3723
6536 9810
2690 3903
1086 7837
600 7408
9665 9027
5773 1116
7256 3675
3945 4335
1711 7735
7445 2489
4197 7927
2900 5122
4196 617
8054 3148
6311 9749
8251 9256
1447 6969
1829 5147
1526 3072
7569 3346
2432 3480
216 2979
5407 3459
1680 8790
6702 8574
1016 3397
8911 545
933 8224
577 7847
1622 2947
4092 1391
3694 6908
8512 6593
1875 3223
2813 7269
8051 765
8547 1744
5495 9357
6174 752
9114 2569
6330 3211
59 6852
8653 4531
9361 2634
3221 7852
9390 2113
5727 9009
4760 2127
4042 9012
36 7468
7900 1461
531 5785
3379 373
1842 6049
2046 5210
3773 2351
5981 917
3252 8848
1942 2515
6336 3786
5722 5282
1143 2253
2887 5781
6718 2826
8031 2440
927 4993
5337 8183
8364 8687
1510 3805
8594 2167
6647 2457
8673 4512
253 3318
8379 3152
1826 9706
1035 6808
886 9903
6840 9984
5612 5313
330 3843
9686 1911
5501 8991
6509 7013
2083 3910
6742 7137
2495 2904
897 2389
7855 6821
196 9924
6169 9613
792 1744
9194 3754
739 1068
2778 769
1238 8254
5684 1413
4662 3111
5957 5964
5632 5189
1555 3894
6553 9513
3232 5691
4085 869
9151 2277
4377 7064
3686 8622
7554 8541
2036 842
9287 3248
965 7848
2700 8451
8355 1461
601 6849
8064 7426
2523 9761
4898 4168
3177 3500
9598 2345
2793 5266
1416 9736
9508 7258
3705 8347
4727 3209
1810 9519
8684 1573
2512 542
8536 4026
4944 2381
1590 3516
533 6505
4292 975
1256 1027
5293 8484
7792 6920
4743 1684
8994 8822
1517 7073
8106 8572
4991 1435
4555 9858
1369 753
8707 3177
113 9065
3075 3956
3701 6930
3949 4103
1957 3351
798 6623
8028 7271
8655 9554
2181 4963
5559 5016
1084 6503
6179 4090
6626 1036
4568 4394
7925 621
2711 8932
8864 1929
4163 5667
3918 4953
9072 8902
8293 7379
1948 8340
2960 9486
3202 3695
1261 1446
7500 9029
5337 2354
7385 5772
7977 7940
9936 7055
9226 8897
5092 4292
1819 9714
648 1153
3977 8874
5765 1198
9979 7817
2457 4955
9184 5409
4322 3333
2662 8983
5004 2966
5084 9323
295 2267
5754 2971
9772 7002
1519 2885
6593 755
1611 2716
459 3750
2063 9565
9604 3525
8225 2627
30 4939
6708 4903
2311 8542
5432 1388
4813 1393
3117 9994
3651 8302
1198 3993
8676 4786
8572 545
9831 8664
3704 1039
8084 6490
5574 5786
9735 37
5374 1271
8930 9229
1988 8490
4872 1633
8682 1214
6391 272
4213 6535
3605 1917
2221 373
7807 655
601 6652
2061 6139
3627 7986
3498 6566
8359 5881
3779 9893
1066 254
7214 4616
9000 3504
1581 9303
7126 5285
2995 5259
1290 1769
950 6160
5728 1913
6582 1785
1502 9407
7948 4613
2506 5598
6006 5329
6250 8849
8467 8334
541 9279
1194 3124
9864 706
2192 487
8307 9160
1673 1705
325 5337
5582 2928
5293 8219
8208 6745
2691 6594
2332 1597
1535 187
400 6595
8760 6043
5165 1143
7407 4020
2669 3705
1453 440
1094 5737
5369 4369
7728 6354
9903 7536
3108 7428
6254 2100
4150 2102
3729 1117
6388 2379
5808 4033
6959 8341
7383 3935
5417 4648
9800 9955
2767 9472
2621 5402
4554 7845
1520 3942
7489 1182
8894 3779
3777 9876
5081 635
6895 5816
1694 1000
9773 5560
2183 920
827 8238
2833 1349
2640 1257
4224 2997
8105 3232
7601 8943
4546 1220
2800 2416
8307 2326
9852 9069
6940 9337
1080 4106
9956 8
7347 9386
5710 3051
5882 6135
1565 8118
2269 4997
3194 3923
15 3330
1859 1954
913 4001
9382 2509
3618 5831
5791 4545
4544 6293
2126 2649
3618 2599
636 9261
665 4540
3136 4540
4963 936
6365 2278
6530 3942
2542 6141
2109 9874
9924 5068
3526 4166
7551 9977
1212 659
4876 3367
1185 3458
9038 5503
7663 6635
1728 2320
8070 7078
90 8564
313 8081
9602 869
6746 2369
788 7487
5507 284
7525 3400
2854 9847
2181 6894
7351 3179
3219 176
2745 925
3717 5824
1014 1006
2584 7623
7972 5504
4789 1434
1188 9067
4981 7579
2188 2351
982 2546
807 6490
5374 7470
2763 4876
1039 5382
7708 5640
2268 4357
335 9710
7915 390
4305 6472
811 7772
5225 674
88 2774
1372 4125
1693 9184
4112 5541
8042 285
8674 3618
5206 4724
6332 9900
4838 2569
8017 9027
1726 1149
2587 7645
2487 6520
3767 8065
2274 5062
3903 1331
716 2752
3017 529
5491 4925
222 1486
1528 6377
8141 1069
2549 9540
1392 3457
625 4429
6848 5826
625 3793
4581 3218
8466 7615
8464 6784
2164 5950
7293 3037
7113 385
3875 3213
382 3737
2974 2081
1177 876
5535 4211
3956 5989
3921 9201
8393 4716
5599 4493
7951 1384
5077 4500
8755 9314
7524 7902
5626 9355
2363 7542
3286 6928
4530 9690
5863 8717
8504 7109
5828 1616
1087 2683
4235 2304
7414 8677
5 494
8504 7758
9245 1018
7587 7452
6435 1641
5676 9891
7132 5589
832 647
1724 2486
2862 2368
758 9888
6628 1475
34 9740
4023 2095
1985 6412
1815 245
4734 2137
5394 4315
3846 8415
9303 3154
9225 6860
6014 5495
6641 4661
870 8807
1250 7705
5119 8999
4914 6970
4682 6899
7451 4169
238 6789
1295 401
7980 152
9260 567
1700 7133
6576 4528
9401 7806
6718 6084
6163 8962
673 3506
9860 3600
865 6547
3150 7767
900 1075
3682 1293
6374 2670
155 8150
5580 3287
4285 8072
2134 15
152 5148
6051 8932
3506 7192
1449 8200
4883 7739
4005 8756
6098 8952
4208 748
8865 5591
7843 8548
3861 6616
5276 8019
2568 5226
977 3783
5554 2187
4852 8026
9077 6032
9144 3668
6456 7751
7827 5408
8231 3547
9669 1203
8168 1145
2328 890
7009 3664
5896 9892
4665 8254
7268 4609
9100 9641
182 296
3059 9642
5248 9919
2403 1729
6519 470
9540 1045
2132 5989
629 6843
4488 5800
2799 7113
912 5335
7927 1915
3466 7003
1991 1173
103 1838
1439 3450
4146 2627
7288 4397
6863 7094
9658 150
2631 9700
3263 5448
9123 3230
6567 9584
3543 5498
4237 3376
3057 5755
4793 6237
5522 7010
952 5462
8941 9653
9641 2982
7613 271
5177 5532
2348 1495
4898 7945
1889 6950
111 2761
4361 9267
6131 9701
1241 6337
7643 4344
3731 4364
3617 9569
2520 1200
5874 9097
6349 6843
3826 3302
816 2420
5647 2782
4525 1147
6083 6032
3564 1970
9022 1599
9117 6781
2243 3857
9175 5126
161 6775
845 9460
3238 5278
5939 557
303 9638
6767 9978
6947 8207
547 6890
4064 2701
8090 9081
5701 1300
6881 1442
2611 6772
9304 6227
654 8523
1033 4528
5384 5319
1416 4347
8095 3771
1051 4690
1462 2532
2044 1705
7554 236
1853 2266
5014 2495
5148 7178
7377 2140
7623 8973
8245 4366
2705 4141
9948 5068
8758 9671
8886 4206
9867 6711
2694 4193
4154 8438
4094 8348
4204 9680
7032 3428
807 219
9527 1725
7979 7860
2029 5682
2599 5100
9742 6663
7281 372
4308 7436
2550 5380
2693 8325
799 946
9906 1656
9797 3569
3857 6
4374 408
9598 558
4505 3189
621 2303
7966 1329
6178 7788
6873 54
7365 9989
5632 5310
7984 3
3635 7870
5275 2147
684 8595
2667 2776
791 8780
5622 1082
3859 8168
5066 8675
1065 6705
526 6796
6670 3865
1945 8595
6532 8227
3362 4096
4997 9894
3591 1416
9794 5821
7090 8034
3401 3443
6745 2904
2037 1389
3477 9200
8603 6088
3317 8027
2402 7062
9620 4590
290 5058
1512 8671
1457 940
6429 8322
2793 1137
3809 1829
4302 2074
5041 3464
7470 5353
3508 1665
8394 2255
3494 8175
1957 2305
9832 366
5914 6412
1334 8491
2435 2278
2665 1160
2551 4743
4478 9889
5539 3833
6918 7360
1452 3628
2480 5502
8820 1965
7156 4652
8508 2551
5425 5873
1913 8266
2922 8948
2794 9371
7244 8124
1352 1741
6019 4101
6207 9279
9101 8375
9932 6085
8495 5634
6567 2715
7511 1868
787 2535
4721 6191
4820 8687
8238 3580
1104 1499
6498 2996
5257 252
909 1001
9930 7437
5021 880
2608 4953
9410 8474
75 2077
5250 243
1525 2960
9149 2634
8578 8560
6068 9346
793 9534
117 2169
9570 77
1770 8775
9312 7526
2339 2521
8465 3904
5953 2543
8499 8031
5429 2770
1945 6538
3960 9051
926 7681
8396 2992
4810 383
6659 4223
2611 9820
8463 400
4758 2615
1081 2981
3686 3826
6293 438
4660 8989
3462 1643
3343 2776
6399 665
8926 9203
4234 1425
3164 1593
8235 485
9506 6124
2023 1356
8556 6738
9890 2152
8757 8273
6839 9350
6436 4247
5676 2086
859 6621
9492 7772
3165 2076
6310 7750
1809 4193
1278 7166
3188 7405
2563 546
7331 7216
3289 5555
2393 9943
7463 8123
8294 5059
1516 4818
1105 8045
3678 5458
4048 1271
1587 954
2245 8516
67 3664
8794 7866
3133 5882
1440 6455
7258 959
357 1170
9951 3130
8917 7716
695 2431
7506 5990
5952 6128
7798 4172
1636 898
8616 2419
123 1020
3118 1607
4559 5936
9954 2664
7904 381
6616 9774
185 7396
8063 506
3267 9130
3942 8031
3848 1549
7936 2929
3819 7690
2107 5741
2870 9406
3598 3929
1076 2699
4881 3325
3120 2750
1 4339
2062 511
3972 2554
2888 5113
6266 6593
8395 1802
4308 8562
4868 4301
233 2749
8853 950
647 2791
2684 6029
5432 1906
3254 8831
4885 7039
1072 6338
9358 9185
2142 3784
7019 5220
6128 21
2029 1342
7793 6436
7880 3909
913 166
757 8401
390 3325
9363 594
7295 9241
7966 8533
8297 4384
4275 3044
181 5123
9250 4044
282 7519
3061 6819
2647 7617
3216 4441
2284 9822
3546 2830
5593 5442
4971 8917
6134 6503
1382 7511
437 4328
6921 2075
7910 6902
6914 1332
8665 1579
2149 1835
8681 5005
4891 6095
6103 1285
3405 1659
2756 9185
3985 3783
4499 4311
8516 5569
5550 907
1929 2669
9528 2771
5425 3034
4931 7128
8763 6056
6723 8832
4094 8791
7907 1034
9093 4257
7670 6761
810 4843
160 8789
7366 2151
2439 8846
8903 1246
2004 163
1715 1052
8430 7330
4013 3532
6729 7312
8502 3831
8235 5131
6837 3383
8591 9134
6042 1136
2206 7669
5519 849
2122 8866
5648 7479
7901 703
1053 6611
8930 2165
5245 5645
2993 6956
7862 3465
1809 8436
5834 5433
1833 1076
1235 8467
6967 1568
4371 1796
1013 7216
7797 9845
2489 3919
1816 1774
1356 2194
4525 5640
2590 1850
8047 8055
5512 7419
9555 6039
5969 2989
9792 5798
2597 5154
8320 1907
6562 9338
967 2694
7381 9268
2548 5312
9013 4422
9878 1204
2494 2446
1824 5622
9314 9049
1136 2354
7498 2373
6317 5008
6147 2195
9359 2327
9287 2671
995 4880
4809 4946
2047 7213
1045 39
6547 9577
9510 2349
4865 1633
4682 1245
1790 1620
9332 3404
4857 6775
9681 595
11 204
1037 8781
2848 6579
2647 2353
2341 1873
3666 2401
1010 1201
3725 5330
9514 4441
165 5645
65 7550
6041 725
6206 2010
1870 522
5041 6477
6468 5981
2678 9233
6009 8677
4058 9811
2637 5281
77 687
3462 4447
6121 4667
821 4365
3043 3318
1688 3758
5327 1442
5601 911
8729 6785
5591 282
8545 9084
9787 2010
5462 3017
958 2081
3350 4670
8433 4887
3796 9665
4589 7027
1132 4545
9717 5951
6132 7403
8696 407
5987 9958
9915 1410
422 2640
8150 8533
3248 844
2478 5588
2450 8555
1380 3466
3803 9036
2891 2490
6034 7695
3040 5895
8050 4702
1477 4017
2421 3965
334 5282
1172 1136
6447 9720
9758 655
8341 7091
3591 470
9365 433
2370 624
8371 504
7826 2181
3620 8996
8430 9745
7637 1
2676 5927
4685 7612
191 822
1344 4037
1035 8250
4646 5687
4312 9686
5019 4811
3965 3601
8952 8154
5824 4543
323 2370
3315 3074
1906 5963
2800 8560
37 2570
9065 5942
3301 902
665 3565
2071 9369
1215 5964
3174 9817
141 9134
8176 6519
859 5574
4496 5479
817 4480
9532 6978
1957 4842
1023 4536
8370 2963
265 26
602 4930
4341 3175
8636 6634
8460 9942
9449 8636
4377 2196
6868 1710
9564 8541
6249 3115
5699 1488
5536 2379
54 974
6465 3077
7921 6515
6233 2322
2872 297
7854 1699
197 8841
7376 2246
3750 387
657 7556
2581 2496
7062 6207
2072 406
3134 2650
5946 5916
35 729
7081 8047
5038 4764
1538 516
4896 6550
777 1118
6254 290
782 1891
6492 8696
9548 2378
4622 3708
1332 9351
7931 9191
8650 1450
5539 7531
6141 8085
9010 865
8637 2317
7973 9350
7256 8579
7501 1637
2502 2355
1185 6134
6918 4204
1305 9288
7528 785
3849 9466
3389 2671
8554 7777
619 4209
8511 805
8101 9665
7334 6364
2810 4944
2749 443
2445 9559
7368 1354
6630 9214
7360 4359
6951 8317
3470 8942
4961 7521
9097 6904
5191 3026
956 7922
3827 2723
891 2448
2856 217
1751 2416
6057 7519
8943 5811
920 2969
6922 5546
4577 7336
4979 4254
135 3582
4820 355
1951 7698
454 7789
5164 3334
1800 596
795 9767
7006 3828
3424 7189
9180 1992
9360 1443
1619 1223
2945 673
4298 4607
6126 6633
5265 338
480 7238
4595 3998
4202 7932
3498 818
947 7172
4087 5614
265 6854
7745 8777
9268 380
8414 1369
7608 4084
9632 5535
8000 4119
1202 2240
8359 2984
6003 2987
136 8879
6674 9192
4714 3574
4827 6078
3860 4931
9296 7800
3191 9768
9484 8056
6299 9176
5652 7373
2986 8778
95 2833
7549 946
7815 9926
3955 3775
7696 578
1545 3215
6809 5800
4855 1482
4833 8889
9975 4893
780 827
6747 261
5158 9353
2415 3615
4503 139
3277 3133
1143 6903
9504 2844
659 5224
3963 660
7409 110
5290 5615
6465 1462
1593 14
2165 5964
9044 456
995 6142
4783 8820
3191 4514
4727 6090
5982 347
9096 3493
1937 2920
5457 2155
9198 9006
3957 5728
462 3815
2243 1031
674 5434
6424 731
9263 3709
35 141
876 1273
5673 7439
8569 5085
4027 6881
210 7525
3893 4937
8196 5756
1752 3576
2000 2688
7882 8107
8734 2550
8652 3999
179 9213
7516 5001
4054 5462
3900 4820
4927 8756
8931 9612
1761 2305
323 8619
7483 3442
3947 4050
8361 4444
1181 6923
7808 8231
5282 2892
4057 6865
1053 5247
365 374
2029 1855
1027 1487
8039 6021
597 2744
8596 4804
9802 1575
8375 3522
5504 8714
3906 616
4663 479
2984 7132
6 3674
5766 6685
3128 2547
1358 9550
5719 2574
1028 7367
2925 8975
3533 9320
2742 5165
7076 3983
2442 5222
1087 7228
9385 4499
2945 6995
360 9518
1154 1490
2155 2065
4540 7588
9827 1233
4535 5109
3674 1707
8407 9111
6285 2046
8980 6484
5322 8489
5147 9621
1529 2502
1651 7730
575 5271
1378 443
5265 4143
7825 5174
6919 837
4109 6906
129 7029
3696 9708
6302 8055
2592 7864
3130 1748
1126 6098
5239 5734
5345 157
8864 9599
8635 2604
9002 3277
2348 8023
1916 6636
2655 8481
7137 4125
882 215
2731 3734
3937 3483
7546 4138
3141 8674
2045 8826
7001 4634
8504 1531
6878 5537
2807 2394
895 7314
930 9614
9063 2769
3873 669
1746 1288
7522 449
5794 4595
2888 6540
9571 9994
1526 1322
5216 5324
7101 951
9015 3684
4067 2752
714 7207
5509 6462
968 5211
5566 3152
7564 9215
4023 5144
4884 4134
5729 8874
8148 5861
4113 3104
8588 6848
9772 1521
1272 336
1700 7187
7094 7192
2753 9582
6189 2584
1843 3235
7836 2001
1222 3309
9489 7865
7975 359
3835 9906
1287 3471
82 3031
942 5241
3733 5078
5681 4422
6596 4964
9191 9063
384 4221
2793 1052
8239 587
6008 4914
9701 2970
6387 8349
2079 3497
5129 6306
2353 1075
5595 7160
1027 4927
1702 1695
4199 5300
7296 5794
7614 4737
2256 7801
6172 1724
7059 3971
4633 1642
7693 2322
6745 6831
6957 1543
5406 9622
5908 7135
2333 6306
5766 3406
4319 806
7441 8139
5624 6018
2831 4716
5277 1151
9063 6020
4801 9006
3065 8457
433 2139
377 8747
2834 1880
699 2243
6839 5719
1760 6696
8727 1079
2480 8983
590 6964
1305 2708
98 8088
7910 812
1673 4438
7107 3261
1993 7720
8496 2408
1841 9975
3029 6102
3814 4300
5557 345
2112 2773
7926 8532
1863 458
4896 8446
535 5664
1923 2162
7228 7485
7262 4250
6186 9101
3837 4302
8219 181
2915 9800
7887 4550
6713 4298
1983 7093
1349 1826
2563 6040
2366 7580
6821 8467
1278 2424
8757 675
6186 8494
7533 5307
5791 1279
6568 2846
3261 2542
3167 5516
3288 7919
2133 4000
2444 1871
8852 9449
2529 7669
9590 1208
5135 8471
5129 3177
4532 4863
1613 1734
7540 5087
7983 7768
5808 5922
7867 7647
3178 1078
2973 6276
6759 7367
2041 2429
5030 2590
5149 4609
6497 7706
7427 6540
6242 8301
7531 7781
4968 7482
6600 79
4921 5021
297 6205
4265 8284
6267 6985
9644 2700
2989 1830
9577 3752
5141 980
5841 6078
8049 9237
2526 2313
5905 5198
2254 22
3987 3359
3074 5313
1278 1223
1058 1072
2643 1538
9988 9012
8016 7540
4204 1595
5016 2202
5398 1528
1792 1231
8962 2727
3946 9580
4528 2411
7687 148
3532 4587
905 8879
1211 2237
1575 6645
2471 4641
9637 8110
1974 9298
6659 3031
7730 7176
68 7000
5285 5697
2418 1796
5044 1553
8447 7008
3822 9464
8271 3095
3156 7107
6677 7357
6378 4373
7948 1027
1167 7895
7879 7082
9402 3646
2410 380
6581 253
1146 3719
479 1802
8578 27
5757 5733
6377 8007
9136 3782
5984 1711
6301 4086
3376 8000
5752 3922
1987 1623
178 6091
4881 271
5014 2641
4479 8009
910 1329
7699 7745
8555 8700
6362 9246
8261 6442
9006 4186
1071 687
7522 7939
5327 4493
5056 6834
8381 1930
5350 8890
1866 9716
8443 1843
34 1874
5976 8615
4661 7836
85 8508
2802 1326
2993 4276
3509 3481
4055 2273
7635 8810
4109 4157
7459 6991
2222 7769
720 8919
2523 6484
8540 6186
4509 5550
4791 5785
7311 8094
1729 1367
1721 1633
2844 6856
5759 4212
9013 9112
3996 1348
9780 5632
8105 5315
9873 1636
7363 9838
6634 7025
6364 637
9075 7077
1008 8570
7021 6591
26 3846
874 3209
1400 2328
4016 4082
4781 8583
5004 4225
4981 1146
2024 3639
1934 9566
9072 949
3878 7192
4626 6158
4255 8012
597 894
5082 430
9099 9819
7427 310
809 4346
5433 921
758 2341
5777 3957
8274 7708
2379 8221
4602 8634
853 1030
4281 8841
9918 6337
609 5080
7486 9547
9562 1372
3093 7473
3578 4309
6721 6823
9574 7155
1043 91
7687 8744
4532 5638
1105 9839
772 9779
9616 2494
5716 8099
1284 8920
2853 8895
2366 4790
4640 2144
2379 8103
5079 2236
7649 2213
2411 8065
7928 6475
208 3175
1291 6484
2430 4897
2335 5060
3962 2613
3811 2109
2980 668
6888 4491
3730 1612
7858 5137
4365 4212
9248 3144
8602 6839
7609 692
7371 6380
3192 1306
8583 325
2697 2063
6456 4512
9060 5811
9427 4171
4106 5982
3630 4603
8925 3017
8349 6350
6917 6512
9213 5662
6928 5478
6596 5753
5466 1290
4536 1152
3709 344
3808 5117
8746 6995
3656 1529
9401 7618
2169 1484
2061 7625
2552 4502
716 1658
653 2861
2318 9851
3496 2376
4900 3785
5055 8572
2331 5021
6906 501
3312 6446
9971 7943
2614 1640
3912 6197
9733 6779
2563 6706
1110 3863
1932 2006
2141 4502
4876 7715
5942 2170
5430 4504
1971 906
5346 5542
9492 4519
1385 5746
5160 9395
7608 7082
7652 9668
5470 268
5762 5446
4040 2643
7627 7599
9552 9186
1335 7030
6161 8134
7076 1030
7759 8168
2438 6608
6356 3728
110 7423
3869 8016
7902 1440
2007 8704
9084 2529
3876 6997
3141 8233
946 6152
7092 9513
6030 2388
227 9953
1637 6464
5185 4534
4363 990
4388 7587
655 850
7521 221
9695 8871
1210 6220
2136 8559
2311 2214
273 8378
6856 9454
1304 281
2394 3598
2045 6690
9000 5376
2110 4631
8836 1331
3650 6562
1398 235
2794 6980
9700 9946
3189 6911
3011 9839
6179 7520
141 2332
4172 5137
147 7580
658 7661
6596 9924
9412 8678
8863 7866
3141 5220
6774 8915
7932 5518
3604 7873
1005 7310
6496 1405
2584 3936
3330 7025
1536 4347
7253 5962
2383 9507
7277 5244
8232 510
7404 806
7245 902
4816 6151
3970 3166
2382 9793
6818 1689
2165 7980
5504 6615
700 2719
6176 8785
9374 507
2056 2919
2968 568
7313 2456
767 7540
2466 7234
1623 2937
7487 186
114 3119
5822 2991
9222 5314
9978 410
3730 7733
5723 5864
4209 854
9558 731
7680 1636
801 6702
6781 5855
1434 920
6929 3727
1016 7522
1775 8023
3218 2092
6269 4123
6367 5405
7187 1840
990 8522
4274 1235
4774 7305
1863 7788
2224 8854
3039 1460
52 9814
2829 374
8354 1642
3098 2754
755 7254
2252 1079
2046 8147
1354 8674
9726 2401
4655 1810
5188 8833
2494 9518
522 9378
7605 8809
968 5434
1268 3492
1306 5960
2655 453
8977 9031
7634 4967
2233 9126
9318 434
7179 1382
4465 5980
2004 2163
3570 3744
9046 8423
3645 542
4509 107
5555 5283
5412 1487
1975 9867
5273 3964
6908 8500
7039 4535
7155 8709
7987 6489
9411 2190
193 6334
185 9410
8519 9691
1587 1170
1866 339
8472 6428
7496 7099
4475 6356
782 2300
