@startuml MIS Сomponent architecture design

!include <C4/C4>
' !include <C4/C4_Context>
' !include <C4/C4_Container>
!include <C4/C4_Component>

LAYOUT_WITH_LEGEND()
LAYOUT_LANDSCAPE()

Boundary(MIS.WebApplicationComponent, "Web Application Context", $tags="CLI") {
    ' Убрать!
    Component(MIS.WebApplication.Системамониторинганаполнениясчетовэскроу, "Система мониторинга наполнения счетов эскроу", "", $tags="")
    Component(MIS.WebApplication.Dashboards, "Dashboards", "", $tags="")
    Component(MIS.WebApplication.Projects, "Projects", "", $tags="")
    Component(MIS.WebApplication.Bestemployees, "Best employees", "", $tags="")
    Component(MIS.WebApplication.PowerBI, "Power BI", "", $tags="")
    Component(MIS.WebApplication.News, "News", "", $tags="")
    Component(MIS.WebApplication.Articles, "Articles", "", $tags="")
    Component(MIS.WebApplication.Ideas, "Ideas", "", $tags="")
    Component(MIS.WebApplication.ORGstructure, "ORG structure", "", $tags="")
}

@endum
