@startuml SonarQube

!include <C4/C4>
!include <C4/C4_Context>

System_Boundary("infrastructure", "infrastructure System", $tags="") {
    System_Ext(SonarQube, "SonarQube", "Статический анализатор кода")
}

@endum