@startuml Сервис поиска объектов

!include <C4/C4>
!include <C4/C4_Context>
!include <C4/C4_Container>

System_Boundary(ObjectSearchService, "Сервис поиска объектов ???") {
    Container(ObjectSearchService.APIbackend, "API backend сервиса портала", "Python, FastAPI", $tags="")
    ContainerDb(ObjectSearchService.Database, "Database", "PostgreSQL 14", $tags="")
    ContainerDb(ObjectSearchService.Redis, "Кеширование данных портала", "Redis", $tags="")

    Rel(ObjectSearchService.APIbackend, ObjectSearchService.Database, "", "TCP, port 5432")
    Rel(ObjectSearchService.APIbackend, ObjectSearchService.Redis, "", "TCP, port 6379")
}

@endum
