@startuml amoCRM

!include <C4/C4>
!include <C4/C4_Context>

!include https://gitlab.com/soprun/arch/-/raw/main/containers/actors/employeeManager.puml

Boundary(CRM, "Система управления взаимоотношениями с клиентами") {
    System_Ext(amoCRM, "amoCRM", "")
}

Rel(employeeManager, amoCRM, "Использует web интерфейс ", "")

@endum