@startuml Datareon

!include <C4/C4>
!include <C4/C4_Context>

System_Boundary("infrastructure", "infrastructure System", $tags="") {
    System_Ext(Datareon, "Datareon 1С:Предприятие", "Enterprise Service Bus system.")
}

@endum