@startuml Архитектура сервисов клиентского сервиса (context)

!include <C4/C4>
!include <C4/C4_Context>

Boundary(customer_services, "Архитектура сервисов клиентского сервиса (context)", "") {
    !include https://gitlab.com/soprun/arch/-/raw/main/services/04_domen_client_servis/DCO/DCO.puml
    !include https://gitlab.com/soprun/arch/-/raw/main/services/04_domen_client_servis/portal/portal.puml
    !include https://gitlab.com/soprun/arch/-/raw/main/services/04_domen_client_servis/LK-broker/LK-broker.puml
    !include https://gitlab.com/soprun/arch/-/raw/main/services/04_domen_client_servis/LK-client/LK-client.puml
    !include https://gitlab.com/soprun/arch/-/raw/main/services/04_domen_client_servis/LK-manager-panel/LK-manager-panel.puml
}

@endum