%YAML 1.1
%TAG !u! tag:unity3d.com,2011:
--- !u!114 &11400000
MonoBehaviour:
  m_ObjectHideFlags: 0
  m_CorrespondingSourceObject: {fileID: 0}
  m_PrefabInstance: {fileID: 0}
  m_PrefabAsset: {fileID: 0}
  m_GameObject: {fileID: 0}
  m_Enabled: 1
  m_EditorHideFlags: 0
  m_Script: {fileID: 11500000, guid: cd686e042194c428194a97b9aa5328e6, type: 3}
  m_Name: Pistol
  m_EditorClassIdentifier: 
  itemName: Handgun
  icon: {fileID: 21300000, guid: 66548b0725add4e7793d431c8a2f6f56, type: 3}
  prefab: {fileID: 7813796524808699480, guid: ef1cfd22f5b4a4d62a55c770065d4e7a, type: 3}
  muzzleFlashParticles: {fileID: 1782395880954752, guid: 3dd9cf2e209c504448f1c4c6835675cf, type: 3}
  fireFX: {fileID: 8300000, guid: e0311473955f540418a6ba9baf75f839, type: 3}
  magazineSize: 12
  storedAmmo: 72
  damage: 5
  fireRate: 0.3
  range: 75
  weaponType: 0
  weaponStyle: 0
