%YAML 1.1
%TAG !u! tag:unity3d.com,2011:
--- !u!114 &11400000
MonoBehaviour:
  m_ObjectHideFlags: 0
  m_CorrespondingSourceObject: {fileID: 0}
  m_PrefabInstance: {fileID: 0}
  m_PrefabAsset: {fileID: 0}
  m_GameObject: {fileID: 0}
  m_Enabled: 1
  m_EditorHideFlags: 0
  m_Script: {fileID: 11500000, guid: cd686e042194c428194a97b9aa5328e6, type: 3}
  m_Name: Ak_47
  m_EditorClassIdentifier: 
  itemName: Machinegun
  icon: {fileID: 21300000, guid: bdcfadec600cb492eabcd52221b97c16, type: 3}
  prefab: {fileID: 5937738872262277032, guid: dd9217a5fb5f343b88704d395ad78abc, type: 3}
  muzzleFlashParticles: {fileID: 1743301284569550, guid: b4e1852b905344f468ff53d2bed1b296, type: 3}
  fireFX: {fileID: 8300000, guid: 811c1834c301e4d1288edd3524303608, type: 3}
  magazineSize: 31
  storedAmmo: 186
  damage: 15
  fireRate: 0.1
  range: 150
  weaponType: 1
  weaponStyle: 1
