%YAML 1.1
%TAG !u! tag:unity3d.com,2011:
--- !u!29 &1
OcclusionCullingSettings:
  m_ObjectHideFlags: 0
  serializedVersion: 2
  m_OcclusionBakeSettings:
    smallestOccluder: 5
    smallestHole: 0.25
    backfaceThreshold: 100
  m_SceneGUID: 00000000000000000000000000000000
  m_OcclusionCullingData: {fileID: 0}
--- !u!104 &2
RenderSettings:
  m_ObjectHideFlags: 0
  serializedVersion: 9
  m_Fog: 1
  m_FogColor: {r: 0.0142733585, g: 0.036206905, b: 0.08823532, a: 1}
  m_FogMode: 3
  m_FogDensity: 0.03
  m_LinearFogStart: 49.7
  m_LinearFogEnd: 454.78
  m_AmbientSkyColor: {r: 1, g: 0.65984035, b: 0.051470578, a: 1}
  m_AmbientEquatorColor: {r: 0.114, g: 0.125, b: 0.133, a: 1}
  m_AmbientGroundColor: {r: 0.047, g: 0.043, b: 0.035, a: 1}
  m_AmbientIntensity: 1
  m_AmbientMode: 0
  m_SubtractiveShadowColor: {r: 0.42, g: 0.478, b: 0.627, a: 1}
  m_SkyboxMaterial: {fileID: 10304, guid: 0000000000000000f000000000000000, type: 0}
  m_HaloStrength: 0.5
  m_FlareStrength: 1
  m_FlareFadeSpeed: 3
  m_HaloTexture: {fileID: 0}
  m_SpotCookie: {fileID: 10001, guid: 0000000000000000e000000000000000, type: 0}
  m_DefaultReflectionMode: 0
  m_DefaultReflectionResolution: 128
  m_ReflectionBounces: 1
  m_ReflectionIntensity: 1
  m_CustomReflection: {fileID: 0}
  m_Sun: {fileID: 1477758826}
  m_IndirectSpecularColor: {r: 0, g: 0, b: 0, a: 1}
  m_UseRadianceAmbientProbe: 0
--- !u!157 &3
LightmapSettings:
  m_ObjectHideFlags: 0
  serializedVersion: 12
  m_GIWorkflowMode: 0
  m_GISettings:
    serializedVersion: 2
    m_BounceScale: 1
    m_IndirectOutputScale: 1
    m_AlbedoBoost: 1
    m_EnvironmentLightingMode: 0
    m_EnableBakedLightmaps: 0
    m_EnableRealtimeLightmaps: 1
  m_LightmapEditorSettings:
    serializedVersion: 12
    m_Resolution: 2
    m_BakeResolution: 50
    m_AtlasSize: 2048
    m_AO: 1
    m_AOMaxDistance: 1
    m_CompAOExponent: 1
    m_CompAOExponentDirect: 0
    m_ExtractAmbientOcclusion: 0
    m_Padding: 2
    m_LightmapParameters: {fileID: 0}
    m_LightmapsBakeMode: 1
    m_TextureCompression: 1
    m_FinalGather: 0
    m_FinalGatherFiltering: 1
    m_FinalGatherRayCount: 256
    m_ReflectionCompression: 2
    m_MixedBakeMode: 1
    m_BakeBackend: 0
    m_PVRSampling: 1
    m_PVRDirectSampleCount: 32
    m_PVRSampleCount: 512
    m_PVRBounces: 2
    m_PVREnvironmentSampleCount: 512
    m_PVREnvironmentReferencePointCount: 2048
    m_PVRFilteringMode: 0
    m_PVRDenoiserTypeDirect: 0
    m_PVRDenoiserTypeIndirect: 0
    m_PVRDenoiserTypeAO: 0
    m_PVRFilterTypeDirect: 0
    m_PVRFilterTypeIndirect: 0
    m_PVRFilterTypeAO: 0
    m_PVREnvironmentMIS: 0
    m_PVRCulling: 1
    m_PVRFilteringGaussRadiusDirect: 1
    m_PVRFilteringGaussRadiusIndirect: 5
    m_PVRFilteringGaussRadiusAO: 2
    m_PVRFilteringAtrousPositionSigmaDirect: 0.5
    m_PVRFilteringAtrousPositionSigmaIndirect: 2
    m_PVRFilteringAtrousPositionSigmaAO: 1
    m_ExportTrainingData: 0
    m_TrainingDataDestination: TrainingData
    m_LightProbeSampleCountMultiplier: 4
  m_LightingDataAsset: {fileID: 0}
  m_LightingSettings: {fileID: 4890085278179872738, guid: 6931aca0002af468cb26d3eb8a5aa6cf, type: 2}
--- !u!196 &4
NavMeshSettings:
  serializedVersion: 2
  m_ObjectHideFlags: 0
  m_BuildSettings:
    serializedVersion: 2
    agentTypeID: 0
    agentRadius: 0.5
    agentHeight: 2
    agentSlope: 45
    agentClimb: 0.4
    ledgeDropHeight: 0
    maxJumpAcrossDistance: 0
    minRegionArea: 2
    manualCellSize: 0
    cellSize: 0.16666667
    manualTileSize: 0
    tileSize: 256
    accuratePlacement: 0
    maxJobWorkers: 0
    preserveTilesOutsideBounds: 0
    debug:
      m_Flags: 0
  m_NavMeshData: {fileID: 0}
--- !u!1001 &16650405
PrefabInstance:
  m_ObjectHideFlags: 0
  serializedVersion: 2
  m_Modification:
    m_TransformParent: {fileID: 0}
    m_Modifications:
    - target: {fileID: 492470, guid: 5f1bb2cacf6d4ca4c878049b803fd391, type: 3}
      propertyPath: m_RootOrder
      value: 18
      objectReference: {fileID: 0}
    - target: {fileID: 492470, guid: 5f1bb2cacf6d4ca4c878049b803fd391, type: 3}
      propertyPath: m_LocalPosition.x
      value: 2.5480001
      objectReference: {fileID: 0}
    - target: {fileID: 492470, guid: 5f1bb2cacf6d4ca4c878049b803fd391, type: 3}
      propertyPath: m_LocalPosition.y
      value: 0
      objectReference: {fileID: 0}
    - target: {fileID: 492470, guid: 5f1bb2cacf6d4ca4c878049b803fd391, type: 3}
      propertyPath: m_LocalPosition.z
      value: 2.73099995
      objectReference: {fileID: 0}
    - target: {fileID: 492470, guid: 5f1bb2cacf6d4ca4c878049b803fd391, type: 3}
      propertyPath: m_LocalRotation.w
      value: .707106709
      objectReference: {fileID: 0}
    - target: {fileID: 492470, guid: 5f1bb2cacf6d4ca4c878049b803fd391, type: 3}
      propertyPath: m_LocalRotation.x
      value: 0
      objectReference: {fileID: 0}
    - target: {fileID: 492470, guid: 5f1bb2cacf6d4ca4c878049b803fd391, type: 3}
      propertyPath: m_LocalRotation.y
      value: .707106829
      objectReference: {fileID: 0}
    - target: {fileID: 492470, guid: 5f1bb2cacf6d4ca4c878049b803fd391, type: 3}
      propertyPath: m_LocalRotation.z
      value: 0
      objectReference: {fileID: 0}
    m_RemovedComponents: []
  m_SourcePrefab: {fileID: 100100000, guid: 5f1bb2cacf6d4ca4c878049b803fd391, type: 3}
--- !u!1001 &279822643
PrefabInstance:
  m_ObjectHideFlags: 0
  serializedVersion: 2
  m_Modification:
    m_TransformParent: {fileID: 0}
    m_Modifications:
    - target: {fileID: 486570, guid: b8c83c417104d75459226dd80248bfe2, type: 3}
      propertyPath: m_RootOrder
      value: 6
      objectReference: {fileID: 0}
    - target: {fileID: 486570, guid: b8c83c417104d75459226dd80248bfe2, type: 3}
      propertyPath: m_LocalPosition.x
      value: 1.23000002
      objectReference: {fileID: 0}
    - target: {fileID: 486570, guid: b8c83c417104d75459226dd80248bfe2, type: 3}
      propertyPath: m_LocalPosition.y
      value: 0
      objectReference: {fileID: 0}
    - target: {fileID: 486570, guid: b8c83c417104d75459226dd80248bfe2, type: 3}
      propertyPath: m_LocalPosition.z
      value: 5.19999981
      objectReference: {fileID: 0}
    - target: {fileID: 486570, guid: b8c83c417104d75459226dd80248bfe2, type: 3}
      propertyPath: m_LocalRotation.w
      value: .707106709
      objectReference: {fileID: 0}
    - target: {fileID: 486570, guid: b8c83c417104d75459226dd80248bfe2, type: 3}
      propertyPath: m_LocalRotation.x
      value: 0
      objectReference: {fileID: 0}
    - target: {fileID: 486570, guid: b8c83c417104d75459226dd80248bfe2, type: 3}
      propertyPath: m_LocalRotation.y
      value: .707106829
      objectReference: {fileID: 0}
    - target: {fileID: 486570, guid: b8c83c417104d75459226dd80248bfe2, type: 3}
      propertyPath: m_LocalRotation.z
      value: 0
      objectReference: {fileID: 0}
    m_RemovedComponents: []
  m_SourcePrefab: {fileID: 100100000, guid: b8c83c417104d75459226dd80248bfe2, type: 3}
--- !u!1001 &290472260
PrefabInstance:
  m_ObjectHideFlags: 0
  serializedVersion: 2
  m_Modification:
    m_TransformParent: {fileID: 0}
    m_Modifications:
    - target: {fileID: 493056, guid: 2adcca9864477ec46adbaa925a5d51fa, type: 3}
      propertyPath: m_RootOrder
      value: 4
      objectReference: {fileID: 0}
    - target: {fileID: 493056, guid: 2adcca9864477ec46adbaa925a5d51fa, type: 3}
      propertyPath: m_LocalPosition.x
      value: -.365716338
      objectReference: {fileID: 0}
    - target: {fileID: 493056, guid: 2adcca9864477ec46adbaa925a5d51fa, type: 3}
      propertyPath: m_LocalPosition.y
      value: .842000008
      objectReference: {fileID: 0}
    - target: {fileID: 493056, guid: 2adcca9864477ec46adbaa925a5d51fa, type: 3}
      propertyPath: m_LocalPosition.z
      value: -.520760179
      objectReference: {fileID: 0}
    - target: {fileID: 493056, guid: 2adcca9864477ec46adbaa925a5d51fa, type: 3}
      propertyPath: m_LocalRotation.w
      value: -.264714897
      objectReference: {fileID: 0}
    - target: {fileID: 493056, guid: 2adcca9864477ec46adbaa925a5d51fa, type: 3}
      propertyPath: m_LocalRotation.x
      value: 0
      objectReference: {fileID: 0}
    - target: {fileID: 493056, guid: 2adcca9864477ec46adbaa925a5d51fa, type: 3}
      propertyPath: m_LocalRotation.y
      value: .964326739
      objectReference: {fileID: 0}
    - target: {fileID: 493056, guid: 2adcca9864477ec46adbaa925a5d51fa, type: 3}
      propertyPath: m_LocalRotation.z
      value: 0
      objectReference: {fileID: 0}
    m_RemovedComponents: []
  m_SourcePrefab: {fileID: 100100000, guid: 2adcca9864477ec46adbaa925a5d51fa, type: 3}
--- !u!1 &336351498
GameObject:
  m_ObjectHideFlags: 0
  m_CorrespondingSourceObject: {fileID: 0}
  m_PrefabInstance: {fileID: 0}
  m_PrefabAsset: {fileID: 0}
  serializedVersion: 6
  m_Component:
  - component: {fileID: 336351502}
  - component: {fileID: 336351501}
  - component: {fileID: 336351500}
  - component: {fileID: 336351499}
  m_Layer: 0
  m_Name: plane
  m_TagString: Untagged
  m_Icon: {fileID: 0}
  m_NavMeshLayer: 0
  m_StaticEditorFlags: 4294967295
  m_IsActive: 1
--- !u!23 &336351499
MeshRenderer:
  m_ObjectHideFlags: 0
  m_CorrespondingSourceObject: {fileID: 0}
  m_PrefabInstance: {fileID: 0}
  m_PrefabAsset: {fileID: 0}
  m_GameObject: {fileID: 336351498}
  m_Enabled: 1
  m_CastShadows: 1
  m_ReceiveShadows: 1
  m_DynamicOccludee: 1
  m_MotionVectors: 1
  m_LightProbeUsage: 1
  m_ReflectionProbeUsage: 1
  m_RayTracingMode: 2
  m_RayTraceProcedural: 0
  m_RenderingLayerMask: 1
  m_RendererPriority: 0
  m_Materials:
  - {fileID: 2100000, guid: bb25d86e1b51a3e46aec21cd4158ced9, type: 2}
  m_StaticBatchInfo:
    firstSubMesh: 0
    subMeshCount: 0
  m_StaticBatchRoot: {fileID: 0}
  m_ProbeAnchor: {fileID: 0}
  m_LightProbeVolumeOverride: {fileID: 0}
  m_ScaleInLightmap: 1
  m_ReceiveGI: 1
  m_PreserveUVs: 1
  m_IgnoreNormalsForChartDetection: 0
  m_ImportantGI: 0
  m_StitchLightmapSeams: 1
  m_SelectedEditorRenderState: 3
  m_MinimumChartSize: 4
  m_AutoUVMaxDistance: 0.5
  m_AutoUVMaxAngle: 89
  m_LightmapParameters: {fileID: 0}
  m_SortingLayerID: 0
  m_SortingLayer: 0
  m_SortingOrder: 0
  m_AdditionalVertexStreams: {fileID: 0}
--- !u!64 &336351500
MeshCollider:
  m_ObjectHideFlags: 0
  m_CorrespondingSourceObject: {fileID: 0}
  m_PrefabInstance: {fileID: 0}
  m_PrefabAsset: {fileID: 0}
  m_GameObject: {fileID: 336351498}
  m_Material: {fileID: 0}
  m_IsTrigger: 0
  m_Enabled: 1
  serializedVersion: 4
  m_Convex: 0
  m_CookingOptions: 30
  m_Mesh: {fileID: 10209, guid: 0000000000000000e000000000000000, type: 0}
--- !u!33 &336351501
MeshFilter:
  m_ObjectHideFlags: 0
  m_CorrespondingSourceObject: {fileID: 0}
  m_PrefabInstance: {fileID: 0}
  m_PrefabAsset: {fileID: 0}
  m_GameObject: {fileID: 336351498}
  m_Mesh: {fileID: 10209, guid: 0000000000000000e000000000000000, type: 0}
--- !u!4 &336351502
Transform:
  m_ObjectHideFlags: 0
  m_CorrespondingSourceObject: {fileID: 0}
  m_PrefabInstance: {fileID: 0}
  m_PrefabAsset: {fileID: 0}
  m_GameObject: {fileID: 336351498}
  m_LocalRotation: {x: 0, y: 0, z: 0, w: 1}
  m_LocalPosition: {x: 0, y: 0, z: 2.05}
  m_LocalScale: {x: 3, y: 1, z: 3}
  m_Children:
  - {fileID: 1238103831}
  - {fileID: 1514540407}
  m_Father: {fileID: 0}
  m_RootOrder: 26
  m_LocalEulerAnglesHint: {x: 0, y: 0, z: 0}
--- !u!1001 &582784993
PrefabInstance:
  m_ObjectHideFlags: 0
  serializedVersion: 2
  m_Modification:
    m_TransformParent: {fileID: 0}
    m_Modifications:
    - target: {fileID: 415136, guid: ce21b1068f316a949b41898d6b5d1d6b, type: 3}
      propertyPath: m_RootOrder
      value: 10
      objectReference: {fileID: 0}
    - target: {fileID: 415136, guid: ce21b1068f316a949b41898d6b5d1d6b, type: 3}
      propertyPath: m_LocalPosition.x
      value: -3.33999991
      objectReference: {fileID: 0}
    - target: {fileID: 415136, guid: ce21b1068f316a949b41898d6b5d1d6b, type: 3}
      propertyPath: m_LocalPosition.y
      value: 0
      objectReference: {fileID: 0}
    - target: {fileID: 415136, guid: ce21b1068f316a949b41898d6b5d1d6b, type: 3}
      propertyPath: m_LocalPosition.z
      value: 2.47000003
      objectReference: {fileID: 0}
    - target: {fileID: 415136, guid: ce21b1068f316a949b41898d6b5d1d6b, type: 3}
      propertyPath: m_LocalRotation.w
      value: .970401227
      objectReference: {fileID: 0}
    - target: {fileID: 415136, guid: ce21b1068f316a949b41898d6b5d1d6b, type: 3}
      propertyPath: m_LocalRotation.x
      value: 0
      objectReference: {fileID: 0}
    - target: {fileID: 415136, guid: ce21b1068f316a949b41898d6b5d1d6b, type: 3}
      propertyPath: m_LocalRotation.y
      value: .241498545
      objectReference: {fileID: 0}
    - target: {fileID: 415136, guid: ce21b1068f316a949b41898d6b5d1d6b, type: 3}
      propertyPath: m_LocalRotation.z
      value: 0
      objectReference: {fileID: 0}
    m_RemovedComponents: []
  m_SourcePrefab: {fileID: 100100000, guid: ce21b1068f316a949b41898d6b5d1d6b, type: 3}
--- !u!1001 &654597562
PrefabInstance:
  m_ObjectHideFlags: 0
  serializedVersion: 2
  m_Modification:
    m_TransformParent: {fileID: 0}
    m_Modifications:
    - target: {fileID: 488920, guid: 56ae742cef70a134b819fe5b677450d0, type: 3}
      propertyPath: m_RootOrder
      value: 24
      objectReference: {fileID: 0}
    - target: {fileID: 488920, guid: 56ae742cef70a134b819fe5b677450d0, type: 3}
      propertyPath: m_LocalPosition.x
      value: 1.25899994
      objectReference: {fileID: 0}
    - target: {fileID: 488920, guid: 56ae742cef70a134b819fe5b677450d0, type: 3}
      propertyPath: m_LocalPosition.y
      value: 0
      objectReference: {fileID: 0}
    - target: {fileID: 488920, guid: 56ae742cef70a134b819fe5b677450d0, type: 3}
      propertyPath: m_LocalPosition.z
      value: -.144999996
      objectReference: {fileID: 0}
    - target: {fileID: 488920, guid: 56ae742cef70a134b819fe5b677450d0, type: 3}
      propertyPath: m_LocalRotation.w
      value: 1
      objectReference: {fileID: 0}
    - target: {fileID: 488920, guid: 56ae742cef70a134b819fe5b677450d0, type: 3}
      propertyPath: m_LocalRotation.x
      value: 0
      objectReference: {fileID: 0}
    - target: {fileID: 488920, guid: 56ae742cef70a134b819fe5b677450d0, type: 3}
      propertyPath: m_LocalRotation.y
      value: 0
      objectReference: {fileID: 0}
    - target: {fileID: 488920, guid: 56ae742cef70a134b819fe5b677450d0, type: 3}
      propertyPath: m_LocalRotation.z
      value: 0
      objectReference: {fileID: 0}
    m_RemovedComponents: []
  m_SourcePrefab: {fileID: 100100000, guid: 56ae742cef70a134b819fe5b677450d0, type: 3}
--- !u!1001 &659105034
PrefabInstance:
  m_ObjectHideFlags: 0
  serializedVersion: 2
  m_Modification:
    m_TransformParent: {fileID: 0}
    m_Modifications:
    - target: {fileID: 485434, guid: 47c41f41ac39a074c9af5b0155530cd9, type: 3}
      propertyPath: m_RootOrder
      value: 3
      objectReference: {fileID: 0}
    - target: {fileID: 485434, guid: 47c41f41ac39a074c9af5b0155530cd9, type: 3}
      propertyPath: m_LocalPosition.x
      value: -1.89128518
      objectReference: {fileID: 0}
    - target: {fileID: 485434, guid: 47c41f41ac39a074c9af5b0155530cd9, type: 3}
      propertyPath: m_LocalPosition.y
      value: .842999995
      objectReference: {fileID: 0}
    - target: {fileID: 485434, guid: 47c41f41ac39a074c9af5b0155530cd9, type: 3}
      propertyPath: m_LocalPosition.z
      value: -3.17732096
      objectReference: {fileID: 0}
    - target: {fileID: 485434, guid: 47c41f41ac39a074c9af5b0155530cd9, type: 3}
      propertyPath: m_LocalRotation.w
      value: .260504365
      objectReference: {fileID: 0}
    - target: {fileID: 485434, guid: 47c41f41ac39a074c9af5b0155530cd9, type: 3}
      propertyPath: m_LocalRotation.x
      value: 0
      objectReference: {fileID: 0}
    - target: {fileID: 485434, guid: 47c41f41ac39a074c9af5b0155530cd9, type: 3}
      propertyPath: m_LocalRotation.y
      value: -.965472698
      objectReference: {fileID: 0}
    - target: {fileID: 485434, guid: 47c41f41ac39a074c9af5b0155530cd9, type: 3}
      propertyPath: m_LocalRotation.z
      value: 0
      objectReference: {fileID: 0}
    m_RemovedComponents: []
  m_SourcePrefab: {fileID: 100100000, guid: 47c41f41ac39a074c9af5b0155530cd9, type: 3}
--- !u!1 &852931841
GameObject:
  m_ObjectHideFlags: 0
  m_CorrespondingSourceObject: {fileID: 173228, guid: 012e8cd5d38f8fa4fbb41fc57a5ce69c, type: 3}
  m_PrefabInstance: {fileID: 0}
  m_PrefabAsset: {fileID: 0}
  serializedVersion: 6
  m_Component:
  - component: {fileID: 852931842}
  m_Layer: 0
  m_Name: crash_barrier
  m_TagString: Untagged
  m_Icon: {fileID: 0}
  m_NavMeshLayer: 0
  m_StaticEditorFlags: 4294967295
  m_IsActive: 1
--- !u!4 &852931842
Transform:
  m_ObjectHideFlags: 0
  m_CorrespondingSourceObject: {fileID: 444996, guid: 012e8cd5d38f8fa4fbb41fc57a5ce69c, type: 3}
  m_PrefabInstance: {fileID: 0}
  m_PrefabAsset: {fileID: 0}
  m_GameObject: {fileID: 852931841}
  m_LocalRotation: {x: 0, y: -0.9659259, z: 0, w: 0.25881895}
  m_LocalPosition: {x: -0.849, y: 0, z: -2.94}
  m_LocalScale: {x: 1, y: 1, z: 1}
  m_Children:
  - {fileID: 1988408103}
  m_Father: {fileID: 0}
  m_RootOrder: 8
  m_LocalEulerAnglesHint: {x: 0, y: 0, z: 0}
--- !u!1001 &883219280
PrefabInstance:
  m_ObjectHideFlags: 0
  serializedVersion: 2
  m_Modification:
    m_TransformParent: {fileID: 0}
    m_Modifications:
    - target: {fileID: 461710, guid: 4adbbae4831a7774ea0645c19218c458, type: 3}
      propertyPath: m_RootOrder
      value: 16
      objectReference: {fileID: 0}
    - target: {fileID: 461710, guid: 4adbbae4831a7774ea0645c19218c458, type: 3}
      propertyPath: m_LocalPosition.x
      value: .419
      objectReference: {fileID: 0}
    - target: {fileID: 461710, guid: 4adbbae4831a7774ea0645c19218c458, type: 3}
      propertyPath: m_LocalPosition.y
      value: 0
      objectReference: {fileID: 0}
    - target: {fileID: 461710, guid: 4adbbae4831a7774ea0645c19218c458, type: 3}
      propertyPath: m_LocalPosition.z
      value: -.185000002
      objectReference: {fileID: 0}
    - target: {fileID: 461710, guid: 4adbbae4831a7774ea0645c19218c458, type: 3}
      propertyPath: m_LocalRotation.w
      value: 1
      objectReference: {fileID: 0}
    - target: {fileID: 461710, guid: 4adbbae4831a7774ea0645c19218c458, type: 3}
      propertyPath: m_LocalRotation.x
      value: 0
      objectReference: {fileID: 0}
    - target: {fileID: 461710, guid: 4adbbae4831a7774ea0645c19218c458, type: 3}
      propertyPath: m_LocalRotation.y
      value: 0
      objectReference: {fileID: 0}
    - target: {fileID: 461710, guid: 4adbbae4831a7774ea0645c19218c458, type: 3}
      propertyPath: m_LocalRotation.z
      value: 0
      objectReference: {fileID: 0}
    m_RemovedComponents: []
  m_SourcePrefab: {fileID: 100100000, guid: 4adbbae4831a7774ea0645c19218c458, type: 3}
--- !u!1 &942164824
GameObject:
  m_ObjectHideFlags: 0
  m_CorrespondingSourceObject: {fileID: 147040, guid: a2bef607e5bbd014d8d69755562c0d35, type: 3}
  m_PrefabInstance: {fileID: 0}
  m_PrefabAsset: {fileID: 0}
  serializedVersion: 6
  m_Component:
  - component: {fileID: 942164825}
  m_Layer: 0
  m_Name: warning_sign
  m_TagString: Untagged
  m_Icon: {fileID: 0}
  m_NavMeshLayer: 0
  m_StaticEditorFlags: 4294967295
  m_IsActive: 1
--- !u!4 &942164825
Transform:
  m_ObjectHideFlags: 0
  m_CorrespondingSourceObject: {fileID: 472518, guid: a2bef607e5bbd014d8d69755562c0d35, type: 3}
  m_PrefabInstance: {fileID: 0}
  m_PrefabAsset: {fileID: 0}
  m_GameObject: {fileID: 942164824}
  m_LocalRotation: {x: 0, y: -0.3953051, z: 0, w: 0.9185499}
  m_LocalPosition: {x: 5.147, y: 0, z: 0.512}
  m_LocalScale: {x: 1, y: 1, z: 1}
  m_Children:
  - {fileID: 1985743191}
  m_Father: {fileID: 0}
  m_RootOrder: 14
  m_LocalEulerAnglesHint: {x: 0, y: 0, z: 0}
--- !u!1001 &1008863096
PrefabInstance:
  m_ObjectHideFlags: 0
  serializedVersion: 2
  m_Modification:
    m_TransformParent: {fileID: 0}
    m_Modifications:
    - target: {fileID: 449972, guid: 8a553ddeee5519c42beedf0a1b69da88, type: 3}
      propertyPath: m_RootOrder
      value: 13
      objectReference: {fileID: 0}
    - target: {fileID: 449972, guid: 8a553ddeee5519c42beedf0a1b69da88, type: 3}
      propertyPath: m_LocalPosition.x
      value: -2.61999989
      objectReference: {fileID: 0}
    - target: {fileID: 449972, guid: 8a553ddeee5519c42beedf0a1b69da88, type: 3}
      propertyPath: m_LocalPosition.y
      value: 0
      objectReference: {fileID: 0}
    - target: {fileID: 449972, guid: 8a553ddeee5519c42beedf0a1b69da88, type: 3}
      propertyPath: m_LocalPosition.z
      value: 1
      objectReference: {fileID: 0}
    - target: {fileID: 449972, guid: 8a553ddeee5519c42beedf0a1b69da88, type: 3}
      propertyPath: m_LocalRotation.w
      value: .966218829
      objectReference: {fileID: 0}
    - target: {fileID: 449972, guid: 8a553ddeee5519c42beedf0a1b69da88, type: 3}
      propertyPath: m_LocalRotation.x
      value: 0
      objectReference: {fileID: 0}
    - target: {fileID: 449972, guid: 8a553ddeee5519c42beedf0a1b69da88, type: 3}
      propertyPath: m_LocalRotation.y
      value: .257723123
      objectReference: {fileID: 0}
    - target: {fileID: 449972, guid: 8a553ddeee5519c42beedf0a1b69da88, type: 3}
      propertyPath: m_LocalRotation.z
      value: 0
      objectReference: {fileID: 0}
    m_RemovedComponents: []
  m_SourcePrefab: {fileID: 100100000, guid: 8a553ddeee5519c42beedf0a1b69da88, type: 3}
--- !u!1001 &1146363102
PrefabInstance:
  m_ObjectHideFlags: 0
  serializedVersion: 2
  m_Modification:
    m_TransformParent: {fileID: 0}
    m_Modifications:
    - target: {fileID: 420576, guid: a2bef607e5bbd014d8d69755562c0d35, type: 3}
      propertyPath: m_RootOrder
      value: 15
      objectReference: {fileID: 0}
    - target: {fileID: 420576, guid: a2bef607e5bbd014d8d69755562c0d35, type: 3}
      propertyPath: m_LocalPosition.x
      value: 3.74699998
      objectReference: {fileID: 0}
    - target: {fileID: 420576, guid: a2bef607e5bbd014d8d69755562c0d35, type: 3}
      propertyPath: m_LocalPosition.y
      value: 0
      objectReference: {fileID: 0}
    - target: {fileID: 420576, guid: a2bef607e5bbd014d8d69755562c0d35, type: 3}
      propertyPath: m_LocalPosition.z
      value: .851999998
      objectReference: {fileID: 0}
    - target: {fileID: 420576, guid: a2bef607e5bbd014d8d69755562c0d35, type: 3}
      propertyPath: m_LocalRotation.w
      value: -.392337263
      objectReference: {fileID: 0}
    - target: {fileID: 420576, guid: a2bef607e5bbd014d8d69755562c0d35, type: 3}
      propertyPath: m_LocalRotation.x
      value: 0
      objectReference: {fileID: 0}
    - target: {fileID: 420576, guid: a2bef607e5bbd014d8d69755562c0d35, type: 3}
      propertyPath: m_LocalRotation.y
      value: -.919821441
      objectReference: {fileID: 0}
    - target: {fileID: 420576, guid: a2bef607e5bbd014d8d69755562c0d35, type: 3}
      propertyPath: m_LocalRotation.z
      value: 0
      objectReference: {fileID: 0}
    m_RemovedComponents: []
  m_SourcePrefab: {fileID: 100100000, guid: a2bef607e5bbd014d8d69755562c0d35, type: 3}
--- !u!1 &1238103827
GameObject:
  m_ObjectHideFlags: 0
  m_CorrespondingSourceObject: {fileID: 0}
  m_PrefabInstance: {fileID: 0}
  m_PrefabAsset: {fileID: 0}
  serializedVersion: 6
  m_Component:
  - component: {fileID: 1238103831}
  - component: {fileID: 1238103830}
  - component: {fileID: 1238103829}
  - component: {fileID: 1238103828}
  m_Layer: 0
  m_Name: plane
  m_TagString: Untagged
  m_Icon: {fileID: 0}
  m_NavMeshLayer: 0
  m_StaticEditorFlags: 4294967295
  m_IsActive: 1
--- !u!23 &1238103828
MeshRenderer:
  m_ObjectHideFlags: 0
  m_CorrespondingSourceObject: {fileID: 0}
  m_PrefabInstance: {fileID: 0}
  m_PrefabAsset: {fileID: 0}
  m_GameObject: {fileID: 1238103827}
  m_Enabled: 1
  m_CastShadows: 1
  m_ReceiveShadows: 1
  m_DynamicOccludee: 1
  m_MotionVectors: 1
  m_LightProbeUsage: 1
  m_ReflectionProbeUsage: 1
  m_RayTracingMode: 2
  m_RayTraceProcedural: 0
  m_RenderingLayerMask: 1
  m_RendererPriority: 0
  m_Materials:
  - {fileID: 2100000, guid: bb25d86e1b51a3e46aec21cd4158ced9, type: 2}
  m_StaticBatchInfo:
    firstSubMesh: 0
    subMeshCount: 0
  m_StaticBatchRoot: {fileID: 0}
  m_ProbeAnchor: {fileID: 0}
  m_LightProbeVolumeOverride: {fileID: 0}
  m_ScaleInLightmap: 1
  m_ReceiveGI: 1
  m_PreserveUVs: 1
  m_IgnoreNormalsForChartDetection: 0
  m_ImportantGI: 0
  m_StitchLightmapSeams: 1
  m_SelectedEditorRenderState: 3
  m_MinimumChartSize: 4
  m_AutoUVMaxDistance: 0.5
  m_AutoUVMaxAngle: 89
  m_LightmapParameters: {fileID: 0}
  m_SortingLayerID: 0
  m_SortingLayer: 0
  m_SortingOrder: 0
  m_AdditionalVertexStreams: {fileID: 0}
--- !u!64 &1238103829
MeshCollider:
  m_ObjectHideFlags: 0
  m_CorrespondingSourceObject: {fileID: 0}
  m_PrefabInstance: {fileID: 0}
  m_PrefabAsset: {fileID: 0}
  m_GameObject: {fileID: 1238103827}
  m_Material: {fileID: 0}
  m_IsTrigger: 0
  m_Enabled: 1
  serializedVersion: 4
  m_Convex: 0
  m_CookingOptions: 30
  m_Mesh: {fileID: 10209, guid: 0000000000000000e000000000000000, type: 0}
--- !u!33 &1238103830
MeshFilter:
  m_ObjectHideFlags: 0
  m_CorrespondingSourceObject: {fileID: 0}
  m_PrefabInstance: {fileID: 0}
  m_PrefabAsset: {fileID: 0}
  m_GameObject: {fileID: 1238103827}
  m_Mesh: {fileID: 10209, guid: 0000000000000000e000000000000000, type: 0}
--- !u!4 &1238103831
Transform:
  m_ObjectHideFlags: 0
  m_CorrespondingSourceObject: {fileID: 0}
  m_PrefabInstance: {fileID: 0}
  m_PrefabAsset: {fileID: 0}
  m_GameObject: {fileID: 1238103827}
  m_LocalRotation: {x: 0, y: 0, z: -0.7071068, w: 0.7071067}
  m_LocalPosition: {x: -4.9700003, y: 14.98, z: 0}
  m_LocalScale: {x: 3, y: 0.33333334, z: 1}
  m_Children: []
  m_Father: {fileID: 336351502}
  m_RootOrder: 0
  m_LocalEulerAnglesHint: {x: 0, y: 0, z: 0}
--- !u!1001 &1350240643
PrefabInstance:
  m_ObjectHideFlags: 0
  serializedVersion: 2
  m_Modification:
    m_TransformParent: {fileID: 0}
    m_Modifications:
    - target: {fileID: 439104, guid: 012e8cd5d38f8fa4fbb41fc57a5ce69c, type: 3}
      propertyPath: m_RootOrder
      value: 5
      objectReference: {fileID: 0}
    - target: {fileID: 439104, guid: 012e8cd5d38f8fa4fbb41fc57a5ce69c, type: 3}
      propertyPath: m_LocalPosition.x
      value: -1.58599997
      objectReference: {fileID: 0}
    - target: {fileID: 439104, guid: 012e8cd5d38f8fa4fbb41fc57a5ce69c, type: 3}
      propertyPath: m_LocalPosition.y
      value: 0
      objectReference: {fileID: 0}
    - target: {fileID: 439104, guid: 012e8cd5d38f8fa4fbb41fc57a5ce69c, type: 3}
      propertyPath: m_LocalPosition.z
      value: -2.50099993
      objectReference: {fileID: 0}
    - target: {fileID: 439104, guid: 012e8cd5d38f8fa4fbb41fc57a5ce69c, type: 3}
      propertyPath: m_LocalRotation.w
      value: .256204963
      objectReference: {fileID: 0}
    - target: {fileID: 439104, guid: 012e8cd5d38f8fa4fbb41fc57a5ce69c, type: 3}
      propertyPath: m_LocalRotation.x
      value: 0
      objectReference: {fileID: 0}
    - target: {fileID: 439104, guid: 012e8cd5d38f8fa4fbb41fc57a5ce69c, type: 3}
      propertyPath: m_LocalRotation.y
      value: -.966622472
      objectReference: {fileID: 0}
    - target: {fileID: 439104, guid: 012e8cd5d38f8fa4fbb41fc57a5ce69c, type: 3}
      propertyPath: m_LocalRotation.z
      value: 0
      objectReference: {fileID: 0}
    m_RemovedComponents: []
  m_SourcePrefab: {fileID: 100100000, guid: 012e8cd5d38f8fa4fbb41fc57a5ce69c, type: 3}
--- !u!1 &1477758825
GameObject:
  m_ObjectHideFlags: 0
  m_CorrespondingSourceObject: {fileID: 0}
  m_PrefabInstance: {fileID: 0}
  m_PrefabAsset: {fileID: 0}
  serializedVersion: 6
  m_Component:
  - component: {fileID: 1477758827}
  - component: {fileID: 1477758826}
  m_Layer: 0
  m_Name: light
  m_TagString: Untagged
  m_Icon: {fileID: 0}
  m_NavMeshLayer: 0
  m_StaticEditorFlags: 0
  m_IsActive: 1
--- !u!108 &1477758826
Light:
  m_ObjectHideFlags: 0
  m_CorrespondingSourceObject: {fileID: 0}
  m_PrefabInstance: {fileID: 0}
  m_PrefabAsset: {fileID: 0}
  m_GameObject: {fileID: 1477758825}
  m_Enabled: 1
  serializedVersion: 10
  m_Type: 1
  m_Shape: 0
  m_Color: {r: 1, g: 1, b: 1, a: 1}
  m_Intensity: 1
  m_Range: 10
  m_SpotAngle: 30
  m_InnerSpotAngle: 21.802082
  m_CookieSize: 10
  m_Shadows:
    m_Type: 2
    m_Resolution: 2
    m_CustomResolution: -1
    m_Strength: 0.534
    m_Bias: 0
    m_NormalBias: 0.5
    m_NearPlane: 0.2
    m_CullingMatrixOverride:
      e00: 1
      e01: 0
      e02: 0
      e03: 0
      e10: 0
      e11: 1
      e12: 0
      e13: 0
      e20: 0
      e21: 0
      e22: 1
      e23: 0
      e30: 0
      e31: 0
      e32: 0
      e33: 1
    m_UseCullingMatrixOverride: 0
  m_Cookie: {fileID: 0}
  m_DrawHalo: 0
  m_Flare: {fileID: 0}
  m_RenderMode: 0
  m_CullingMask:
    serializedVersion: 2
    m_Bits: 4294967295
  m_RenderingLayerMask: 1
  m_Lightmapping: 4
  m_LightShadowCasterMode: 0
  m_AreaSize: {x: 1, y: 1}
  m_BounceIntensity: 1
  m_ColorTemperature: 6570
  m_UseColorTemperature: 0
  m_BoundingSphereOverride: {x: 0, y: 0, z: 0, w: 0}
  m_UseBoundingSphereOverride: 0
  m_UseViewFrustumForShadowCasterCull: 1
  m_ShadowRadius: 0
  m_ShadowAngle: 0
--- !u!4 &1477758827
Transform:
  m_ObjectHideFlags: 0
  m_CorrespondingSourceObject: {fileID: 0}
  m_PrefabInstance: {fileID: 0}
  m_PrefabAsset: {fileID: 0}
  m_GameObject: {fileID: 1477758825}
  m_LocalRotation: {x: -0.36977687, y: 0.049182072, z: -0.019605631, w: -0.9276109}
  m_LocalPosition: {x: 0, y: 3, z: 0}
  m_LocalScale: {x: 1, y: 1, z: 1}
  m_Children: []
  m_Father: {fileID: 0}
  m_RootOrder: 25
  m_LocalEulerAnglesHint: {x: 0, y: 0, z: 0}
--- !u!1001 &1504923144
PrefabInstance:
  m_ObjectHideFlags: 0
  serializedVersion: 2
  m_Modification:
    m_TransformParent: {fileID: 0}
    m_Modifications:
    - target: {fileID: 461292, guid: d91011873a48699488e1c1b9b86925e5, type: 3}
      propertyPath: m_RootOrder
      value: 12
      objectReference: {fileID: 0}
    - target: {fileID: 461292, guid: d91011873a48699488e1c1b9b86925e5, type: 3}
      propertyPath: m_LocalPosition.x
      value: .91900003
      objectReference: {fileID: 0}
    - target: {fileID: 461292, guid: d91011873a48699488e1c1b9b86925e5, type: 3}
      propertyPath: m_LocalPosition.y
      value: 0
      objectReference: {fileID: 0}
    - target: {fileID: 461292, guid: d91011873a48699488e1c1b9b86925e5, type: 3}
      propertyPath: m_LocalPosition.z
      value: -.764999986
      objectReference: {fileID: 0}
    - target: {fileID: 461292, guid: d91011873a48699488e1c1b9b86925e5, type: 3}
      propertyPath: m_LocalRotation.w
      value: 1
      objectReference: {fileID: 0}
    - target: {fileID: 461292, guid: d91011873a48699488e1c1b9b86925e5, type: 3}
      propertyPath: m_LocalRotation.x
      value: 0
      objectReference: {fileID: 0}
    - target: {fileID: 461292, guid: d91011873a48699488e1c1b9b86925e5, type: 3}
      propertyPath: m_LocalRotation.y
      value: 0
      objectReference: {fileID: 0}
    - target: {fileID: 461292, guid: d91011873a48699488e1c1b9b86925e5, type: 3}
      propertyPath: m_LocalRotation.z
      value: 0
      objectReference: {fileID: 0}
    m_RemovedComponents: []
  m_SourcePrefab: {fileID: 100100000, guid: d91011873a48699488e1c1b9b86925e5, type: 3}
--- !u!1 &1514540403
GameObject:
  m_ObjectHideFlags: 0
  m_CorrespondingSourceObject: {fileID: 0}
  m_PrefabInstance: {fileID: 0}
  m_PrefabAsset: {fileID: 0}
  serializedVersion: 6
  m_Component:
  - component: {fileID: 1514540407}
  - component: {fileID: 1514540406}
  - component: {fileID: 1514540405}
  - component: {fileID: 1514540404}
  m_Layer: 0
  m_Name: plane
  m_TagString: Untagged
  m_Icon: {fileID: 0}
  m_NavMeshLayer: 0
  m_StaticEditorFlags: 4294967295
  m_IsActive: 1
--- !u!23 &1514540404
MeshRenderer:
  m_ObjectHideFlags: 0
  m_CorrespondingSourceObject: {fileID: 0}
  m_PrefabInstance: {fileID: 0}
  m_PrefabAsset: {fileID: 0}
  m_GameObject: {fileID: 1514540403}
  m_Enabled: 1
  m_CastShadows: 1
  m_ReceiveShadows: 1
  m_DynamicOccludee: 1
  m_MotionVectors: 1
  m_LightProbeUsage: 1
  m_ReflectionProbeUsage: 1
  m_RayTracingMode: 2
  m_RayTraceProcedural: 0
  m_RenderingLayerMask: 1
  m_RendererPriority: 0
  m_Materials:
  - {fileID: 2100000, guid: bb25d86e1b51a3e46aec21cd4158ced9, type: 2}
  m_StaticBatchInfo:
    firstSubMesh: 0
    subMeshCount: 0
  m_StaticBatchRoot: {fileID: 0}
  m_ProbeAnchor: {fileID: 0}
  m_LightProbeVolumeOverride: {fileID: 0}
  m_ScaleInLightmap: 1
  m_ReceiveGI: 1
  m_PreserveUVs: 1
  m_IgnoreNormalsForChartDetection: 0
  m_ImportantGI: 0
  m_StitchLightmapSeams: 1
  m_SelectedEditorRenderState: 3
  m_MinimumChartSize: 4
  m_AutoUVMaxDistance: 0.5
  m_AutoUVMaxAngle: 89
  m_LightmapParameters: {fileID: 0}
  m_SortingLayerID: 0
  m_SortingLayer: 0
  m_SortingOrder: 0
  m_AdditionalVertexStreams: {fileID: 0}
--- !u!64 &1514540405
MeshCollider:
  m_ObjectHideFlags: 0
  m_CorrespondingSourceObject: {fileID: 0}
  m_PrefabInstance: {fileID: 0}
  m_PrefabAsset: {fileID: 0}
  m_GameObject: {fileID: 1514540403}
  m_Material: {fileID: 0}
  m_IsTrigger: 0
  m_Enabled: 1
  serializedVersion: 4
  m_Convex: 0
  m_CookingOptions: 30
  m_Mesh: {fileID: 10209, guid: 0000000000000000e000000000000000, type: 0}
--- !u!33 &1514540406
MeshFilter:
  m_ObjectHideFlags: 0
  m_CorrespondingSourceObject: {fileID: 0}
  m_PrefabInstance: {fileID: 0}
  m_PrefabAsset: {fileID: 0}
  m_GameObject: {fileID: 1514540403}
  m_Mesh: {fileID: 10209, guid: 0000000000000000e000000000000000, type: 0}
--- !u!4 &1514540407
Transform:
  m_ObjectHideFlags: 0
  m_CorrespondingSourceObject: {fileID: 0}
  m_PrefabInstance: {fileID: 0}
  m_PrefabAsset: {fileID: 0}
  m_GameObject: {fileID: 1514540403}
  m_LocalRotation: {x: -0.7071068, y: 0, z: 0, w: 0.7071067}
  m_LocalPosition: {x: 0, y: 14.76, z: 5.0200005}
  m_LocalScale: {x: 1, y: 0.33333334, z: 3}
  m_Children: []
  m_Father: {fileID: 336351502}
  m_RootOrder: 1
  m_LocalEulerAnglesHint: {x: 0, y: 0, z: 0}
--- !u!1001 &1529584083
PrefabInstance:
  m_ObjectHideFlags: 0
  serializedVersion: 2
  m_Modification:
    m_TransformParent: {fileID: 0}
    m_Modifications:
    - target: {fileID: 416204, guid: e0c9e7b86067ab64dacba4d674191ebb, type: 3}
      propertyPath: m_RootOrder
      value: 9
      objectReference: {fileID: 0}
    - target: {fileID: 416204, guid: e0c9e7b86067ab64dacba4d674191ebb, type: 3}
      propertyPath: m_LocalPosition.x
      value: 5.26599979
      objectReference: {fileID: 0}
    - target: {fileID: 416204, guid: e0c9e7b86067ab64dacba4d674191ebb, type: 3}
      propertyPath: m_LocalPosition.y
      value: 0
      objectReference: {fileID: 0}
    - target: {fileID: 416204, guid: e0c9e7b86067ab64dacba4d674191ebb, type: 3}
      propertyPath: m_LocalPosition.z
      value: 2.7750001
      objectReference: {fileID: 0}
    - target: {fileID: 416204, guid: e0c9e7b86067ab64dacba4d674191ebb, type: 3}
      propertyPath: m_LocalRotation.w
      value: .544858515
      objectReference: {fileID: 0}
    - target: {fileID: 416204, guid: e0c9e7b86067ab64dacba4d674191ebb, type: 3}
      propertyPath: m_LocalRotation.x
      value: 0
      objectReference: {fileID: 0}
    - target: {fileID: 416204, guid: e0c9e7b86067ab64dacba4d674191ebb, type: 3}
      propertyPath: m_LocalRotation.y
      value: .838528037
      objectReference: {fileID: 0}
    - target: {fileID: 416204, guid: e0c9e7b86067ab64dacba4d674191ebb, type: 3}
      propertyPath: m_LocalRotation.z
      value: 0
      objectReference: {fileID: 0}
    m_RemovedComponents: []
  m_SourcePrefab: {fileID: 100100000, guid: e0c9e7b86067ab64dacba4d674191ebb, type: 3}
--- !u!1001 &1567726784
PrefabInstance:
  m_ObjectHideFlags: 0
  serializedVersion: 2
  m_Modification:
    m_TransformParent: {fileID: 0}
    m_Modifications:
    - target: {fileID: 451412, guid: fb934be14696278408574211c4a828bf, type: 3}
      propertyPath: m_RootOrder
      value: 1
      objectReference: {fileID: 0}
    - target: {fileID: 451412, guid: fb934be14696278408574211c4a828bf, type: 3}
      propertyPath: m_LocalPosition.x
      value: 4.18499994
      objectReference: {fileID: 0}
    - target: {fileID: 451412, guid: fb934be14696278408574211c4a828bf, type: 3}
      propertyPath: m_LocalPosition.y
      value: 0
      objectReference: {fileID: 0}
    - target: {fileID: 451412, guid: fb934be14696278408574211c4a828bf, type: 3}
      propertyPath: m_LocalPosition.z
      value: 4.17399979
      objectReference: {fileID: 0}
    - target: {fileID: 451412, guid: fb934be14696278408574211c4a828bf, type: 3}
      propertyPath: m_LocalRotation.w
      value: .544858515
      objectReference: {fileID: 0}
    - target: {fileID: 451412, guid: fb934be14696278408574211c4a828bf, type: 3}
      propertyPath: m_LocalRotation.x
      value: 0
      objectReference: {fileID: 0}
    - target: {fileID: 451412, guid: fb934be14696278408574211c4a828bf, type: 3}
      propertyPath: m_LocalRotation.y
      value: .838528037
      objectReference: {fileID: 0}
    - target: {fileID: 451412, guid: fb934be14696278408574211c4a828bf, type: 3}
      propertyPath: m_LocalRotation.z
      value: 0
      objectReference: {fileID: 0}
    m_RemovedComponents: []
  m_SourcePrefab: {fileID: 100100000, guid: fb934be14696278408574211c4a828bf, type: 3}
--- !u!1001 &1673880854
PrefabInstance:
  m_ObjectHideFlags: 0
  serializedVersion: 2
  m_Modification:
    m_TransformParent: {fileID: 0}
    m_Modifications:
    - target: {fileID: 437368, guid: b8433bdc340959d4b92f2fa9fc42d091, type: 3}
      propertyPath: m_RootOrder
      value: 0
      objectReference: {fileID: 0}
    - target: {fileID: 437368, guid: b8433bdc340959d4b92f2fa9fc42d091, type: 3}
      propertyPath: m_LocalPosition.x
      value: 2.33400011
      objectReference: {fileID: 0}
    - target: {fileID: 437368, guid: b8433bdc340959d4b92f2fa9fc42d091, type: 3}
      propertyPath: m_LocalPosition.y
      value: -0
      objectReference: {fileID: 0}
    - target: {fileID: 437368, guid: b8433bdc340959d4b92f2fa9fc42d091, type: 3}
      propertyPath: m_LocalPosition.z
      value: -1.88
      objectReference: {fileID: 0}
    - target: {fileID: 437368, guid: b8433bdc340959d4b92f2fa9fc42d091, type: 3}
      propertyPath: m_LocalRotation.w
      value: -.372444302
      objectReference: {fileID: 0}
    - target: {fileID: 437368, guid: b8433bdc340959d4b92f2fa9fc42d091, type: 3}
      propertyPath: m_LocalRotation.x
      value: 0
      objectReference: {fileID: 0}
    - target: {fileID: 437368, guid: b8433bdc340959d4b92f2fa9fc42d091, type: 3}
      propertyPath: m_LocalRotation.y
      value: .928054571
      objectReference: {fileID: 0}
    - target: {fileID: 437368, guid: b8433bdc340959d4b92f2fa9fc42d091, type: 3}
      propertyPath: m_LocalRotation.z
      value: 0
      objectReference: {fileID: 0}
    m_RemovedComponents: []
  m_SourcePrefab: {fileID: 100100000, guid: b8433bdc340959d4b92f2fa9fc42d091, type: 3}
--- !u!1 &1680665240
GameObject:
  m_ObjectHideFlags: 0
  m_CorrespondingSourceObject: {fileID: 0}
  m_PrefabInstance: {fileID: 0}
  m_PrefabAsset: {fileID: 0}
  serializedVersion: 6
  m_Component:
  - component: {fileID: 1680665245}
  - component: {fileID: 1680665244}
  - component: {fileID: 1680665242}
  - component: {fileID: 1680665241}
  - component: {fileID: 1680665247}
  - component: {fileID: 1680665246}
  m_Layer: 0
  m_Name: camera
  m_TagString: MainCamera
  m_Icon: {fileID: 0}
  m_NavMeshLayer: 0
  m_StaticEditorFlags: 0
  m_IsActive: 1
--- !u!81 &1680665241
AudioListener:
  m_ObjectHideFlags: 0
  m_CorrespondingSourceObject: {fileID: 0}
  m_PrefabInstance: {fileID: 0}
  m_PrefabAsset: {fileID: 0}
  m_GameObject: {fileID: 1680665240}
  m_Enabled: 1
--- !u!124 &1680665242
Behaviour:
  m_ObjectHideFlags: 0
  m_CorrespondingSourceObject: {fileID: 0}
  m_PrefabInstance: {fileID: 0}
  m_PrefabAsset: {fileID: 0}
  m_GameObject: {fileID: 1680665240}
  m_Enabled: 1
--- !u!20 &1680665244
Camera:
  m_ObjectHideFlags: 0
  m_CorrespondingSourceObject: {fileID: 0}
  m_PrefabInstance: {fileID: 0}
  m_PrefabAsset: {fileID: 0}
  m_GameObject: {fileID: 1680665240}
  m_Enabled: 1
  serializedVersion: 2
  m_ClearFlags: 1
  m_BackGroundColor: {r: 0.19215687, g: 0.3019608, b: 0.4745098, a: 0.019607844}
  m_projectionMatrixMode: 1
  m_GateFitMode: 2
  m_FOVAxisMode: 0
  m_SensorSize: {x: 36, y: 24}
  m_LensShift: {x: 0, y: 0}
  m_FocalLength: 50
  m_NormalizedViewPortRect:
    serializedVersion: 2
    x: 0
    y: 0
    width: 1
    height: 1
  near clip plane: 0.3
  far clip plane: 1000
  field of view: 60
  orthographic: 0
  orthographic size: 5
  m_Depth: -1
  m_CullingMask:
    serializedVersion: 2
    m_Bits: 4294967295
  m_RenderingPath: -1
  m_TargetTexture: {fileID: 0}
  m_TargetDisplay: 0
  m_TargetEye: 3
  m_HDR: 0
  m_AllowMSAA: 1
  m_AllowDynamicResolution: 0
  m_ForceIntoRT: 0
  m_OcclusionCulling: 1
  m_StereoConvergence: 10
  m_StereoSeparation: 0.022
--- !u!4 &1680665245
Transform:
  m_ObjectHideFlags: 0
  m_CorrespondingSourceObject: {fileID: 0}
  m_PrefabInstance: {fileID: 0}
  m_PrefabAsset: {fileID: 0}
  m_GameObject: {fileID: 1680665240}
  m_LocalRotation: {x: -0.3437375, y: 0.3227948, z: -0.12715228, w: -0.8726284}
  m_LocalPosition: {x: 5.9, y: 8.093, z: -4.662}
  m_LocalScale: {x: 1, y: 1, z: 1}
  m_Children: []
  m_Father: {fileID: 0}
  m_RootOrder: 23
  m_LocalEulerAnglesHint: {x: 0, y: 0, z: 0}
--- !u!114 &1680665246
MonoBehaviour:
  m_ObjectHideFlags: 0
  m_CorrespondingSourceObject: {fileID: 0}
  m_PrefabInstance: {fileID: 0}
  m_PrefabAsset: {fileID: 0}
  m_GameObject: {fileID: 1680665240}
  m_Enabled: 1
  m_EditorHideFlags: 0
  m_Script: {fileID: 11500000, guid: ec92b071d2d424aecb3e46f28eb63174, type: 3}
  m_Name: 
  m_EditorClassIdentifier: 
  adaptationSpeed: 0.35
  limitMinimum: 0.025
  limitMaximum: 0
  shaderLum: {fileID: 4800000, guid: befbb4b9c320b4b18a08ef7afb93b6c9, type: 3}
  shaderReduce: {fileID: 4800000, guid: 57b33a14b6d5347c5a85c36f6cb3b280, type: 3}
  shaderAdapt: {fileID: 4800000, guid: 257bc83cbeb544540bd0e558aa9b1383, type: 3}
  shaderApply: {fileID: 4800000, guid: f4901f25d4e1542589348bbb89563d8e, type: 3}
--- !u!114 &1680665247
MonoBehaviour:
  m_ObjectHideFlags: 0
  m_CorrespondingSourceObject: {fileID: 0}
  m_PrefabInstance: {fileID: 0}
  m_PrefabAsset: {fileID: 0}
  m_GameObject: {fileID: 1680665240}
  m_Enabled: 1
  m_EditorHideFlags: 0
  m_Script: {fileID: 11500000, guid: 76b5ec6153a1d55438228df10fe66844, type: 3}
  m_Name: 
  m_EditorClassIdentifier: 
  distanceFog: 1
  useRadialDistance: 1
  heightFog: 1
  height: 1
  heightDensity: 3.44
  startDistance: 0
  fogShader: {fileID: 4800000, guid: 70d8568987ac0499f952b54c7c13e265, type: 3}
--- !u!1001 &1746585972
PrefabInstance:
  m_ObjectHideFlags: 0
  serializedVersion: 2
  m_Modification:
    m_TransformParent: {fileID: 0}
    m_Modifications:
    - target: {fileID: 414714, guid: 1afece281bd761d4a9b16adee2b788e3, type: 3}
      propertyPath: m_RootOrder
      value: 11
      objectReference: {fileID: 0}
    - target: {fileID: 414714, guid: 1afece281bd761d4a9b16adee2b788e3, type: 3}
      propertyPath: m_LocalPosition.x
      value: 2.90300012
      objectReference: {fileID: 0}
    - target: {fileID: 414714, guid: 1afece281bd761d4a9b16adee2b788e3, type: 3}
      propertyPath: m_LocalPosition.y
      value: 0
      objectReference: {fileID: 0}
    - target: {fileID: 414714, guid: 1afece281bd761d4a9b16adee2b788e3, type: 3}
      propertyPath: m_LocalPosition.z
      value: -1.97399998
      objectReference: {fileID: 0}
    - target: {fileID: 414714, guid: 1afece281bd761d4a9b16adee2b788e3, type: 3}
      propertyPath: m_LocalRotation.w
      value: .931119502
      objectReference: {fileID: 0}
    - target: {fileID: 414714, guid: 1afece281bd761d4a9b16adee2b788e3, type: 3}
      propertyPath: m_LocalRotation.x
      value: 0
      objectReference: {fileID: 0}
    - target: {fileID: 414714, guid: 1afece281bd761d4a9b16adee2b788e3, type: 3}
      propertyPath: m_LocalRotation.y
      value: .364714295
      objectReference: {fileID: 0}
    - target: {fileID: 414714, guid: 1afece281bd761d4a9b16adee2b788e3, type: 3}
      propertyPath: m_LocalRotation.z
      value: 0
      objectReference: {fileID: 0}
    m_RemovedComponents: []
  m_SourcePrefab: {fileID: 100100000, guid: 1afece281bd761d4a9b16adee2b788e3, type: 3}
--- !u!1001 &1750948901
PrefabInstance:
  m_ObjectHideFlags: 0
  serializedVersion: 2
  m_Modification:
    m_TransformParent: {fileID: 0}
    m_Modifications:
    - target: {fileID: 423680, guid: 347cc843bf8f9c74f9bf2401fb207832, type: 3}
      propertyPath: m_RootOrder
      value: 7
      objectReference: {fileID: 0}
    - target: {fileID: 423680, guid: 347cc843bf8f9c74f9bf2401fb207832, type: 3}
      propertyPath: m_LocalPosition.x
      value: 1.40400004
      objectReference: {fileID: 0}
    - target: {fileID: 423680, guid: 347cc843bf8f9c74f9bf2401fb207832, type: 3}
      propertyPath: m_LocalPosition.y
      value: 6.96592352e-17
      objectReference: {fileID: 0}
    - target: {fileID: 423680, guid: 347cc843bf8f9c74f9bf2401fb207832, type: 3}
      propertyPath: m_LocalPosition.z
      value: -1.64400005
      objectReference: {fileID: 0}
    - target: {fileID: 423680, guid: 347cc843bf8f9c74f9bf2401fb207832, type: 3}
      propertyPath: m_LocalRotation.w
      value: .349389672
      objectReference: {fileID: 0}
    - target: {fileID: 423680, guid: 347cc843bf8f9c74f9bf2401fb207832, type: 3}
      propertyPath: m_LocalRotation.x
      value: 0
      objectReference: {fileID: 0}
    - target: {fileID: 423680, guid: 347cc843bf8f9c74f9bf2401fb207832, type: 3}
      propertyPath: m_LocalRotation.y
      value: -.936977565
      objectReference: {fileID: 0}
    - target: {fileID: 423680, guid: 347cc843bf8f9c74f9bf2401fb207832, type: 3}
      propertyPath: m_LocalRotation.z
      value: 0
      objectReference: {fileID: 0}
    m_RemovedComponents: []
  m_SourcePrefab: {fileID: 100100000, guid: 347cc843bf8f9c74f9bf2401fb207832, type: 3}
--- !u!1 &1985743188
GameObject:
  m_ObjectHideFlags: 0
  m_CorrespondingSourceObject: {fileID: 110386, guid: a2bef607e5bbd014d8d69755562c0d35, type: 3}
  m_PrefabInstance: {fileID: 0}
  m_PrefabAsset: {fileID: 0}
  serializedVersion: 6
  m_Component:
  - component: {fileID: 1985743191}
  - component: {fileID: 1985743190}
  - component: {fileID: 1985743189}
  m_Layer: 0
  m_Name: model
  m_TagString: Untagged
  m_Icon: {fileID: 0}
  m_NavMeshLayer: 0
  m_StaticEditorFlags: 4294967295
  m_IsActive: 1
--- !u!23 &1985743189
MeshRenderer:
  m_ObjectHideFlags: 0
  m_CorrespondingSourceObject: {fileID: 2329432, guid: a2bef607e5bbd014d8d69755562c0d35, type: 3}
  m_PrefabInstance: {fileID: 0}
  m_PrefabAsset: {fileID: 0}
  m_GameObject: {fileID: 1985743188}
  m_Enabled: 1
  m_CastShadows: 1
  m_ReceiveShadows: 1
  m_DynamicOccludee: 1
  m_MotionVectors: 1
  m_LightProbeUsage: 1
  m_ReflectionProbeUsage: 1
  m_RayTracingMode: 2
  m_RayTraceProcedural: 0
  m_RenderingLayerMask: 1
  m_RendererPriority: 0
  m_Materials:
  - {fileID: 2100000, guid: 100e6d389eaef0c4cae4686fe3a52d92, type: 2}
  m_StaticBatchInfo:
    firstSubMesh: 0
    subMeshCount: 0
  m_StaticBatchRoot: {fileID: 0}
  m_ProbeAnchor: {fileID: 0}
  m_LightProbeVolumeOverride: {fileID: 0}
  m_ScaleInLightmap: 1
  m_ReceiveGI: 1
  m_PreserveUVs: 0
  m_IgnoreNormalsForChartDetection: 0
  m_ImportantGI: 0
  m_StitchLightmapSeams: 1
  m_SelectedEditorRenderState: 3
  m_MinimumChartSize: 4
  m_AutoUVMaxDistance: 0.5
  m_AutoUVMaxAngle: 89
  m_LightmapParameters: {fileID: 0}
  m_SortingLayerID: 0
  m_SortingLayer: 0
  m_SortingOrder: 0
  m_AdditionalVertexStreams: {fileID: 0}
--- !u!33 &1985743190
MeshFilter:
  m_ObjectHideFlags: 0
  m_CorrespondingSourceObject: {fileID: 3368230, guid: a2bef607e5bbd014d8d69755562c0d35, type: 3}
  m_PrefabInstance: {fileID: 0}
  m_PrefabAsset: {fileID: 0}
  m_GameObject: {fileID: 1985743188}
  m_Mesh: {fileID: 4300000, guid: 741e69099a8d6ee458f469d9ef424765, type: 3}
--- !u!4 &1985743191
Transform:
  m_ObjectHideFlags: 0
  m_CorrespondingSourceObject: {fileID: 452610, guid: a2bef607e5bbd014d8d69755562c0d35, type: 3}
  m_PrefabInstance: {fileID: 0}
  m_PrefabAsset: {fileID: 0}
  m_GameObject: {fileID: 1985743188}
  m_LocalRotation: {x: 0, y: 0, z: 0, w: 1}
  m_LocalPosition: {x: 0, y: 0, z: 0}
  m_LocalScale: {x: 1, y: 1, z: 1}
  m_Children: []
  m_Father: {fileID: 942164825}
  m_RootOrder: 0
  m_LocalEulerAnglesHint: {x: 0, y: 0, z: 0}
--- !u!1 &1988408100
GameObject:
  m_ObjectHideFlags: 0
  m_CorrespondingSourceObject: {fileID: 181370, guid: 012e8cd5d38f8fa4fbb41fc57a5ce69c, type: 3}
  m_PrefabInstance: {fileID: 0}
  m_PrefabAsset: {fileID: 0}
  serializedVersion: 6
  m_Component:
  - component: {fileID: 1988408103}
  - component: {fileID: 1988408102}
  - component: {fileID: 1988408101}
  m_Layer: 0
  m_Name: model
  m_TagString: Untagged
  m_Icon: {fileID: 0}
  m_NavMeshLayer: 0
  m_StaticEditorFlags: 4294967295
  m_IsActive: 1
--- !u!23 &1988408101
MeshRenderer:
  m_ObjectHideFlags: 0
  m_CorrespondingSourceObject: {fileID: 2301608, guid: 012e8cd5d38f8fa4fbb41fc57a5ce69c, type: 3}
  m_PrefabInstance: {fileID: 0}
  m_PrefabAsset: {fileID: 0}
  m_GameObject: {fileID: 1988408100}
  m_Enabled: 1
  m_CastShadows: 1
  m_ReceiveShadows: 1
  m_DynamicOccludee: 1
  m_MotionVectors: 1
  m_LightProbeUsage: 1
  m_ReflectionProbeUsage: 1
  m_RayTracingMode: 2
  m_RayTraceProcedural: 0
  m_RenderingLayerMask: 1
  m_RendererPriority: 0
  m_Materials:
  - {fileID: 2100000, guid: f271c841bfee91e46a915da5d513bd81, type: 2}
  m_StaticBatchInfo:
    firstSubMesh: 0
    subMeshCount: 0
  m_StaticBatchRoot: {fileID: 0}
  m_ProbeAnchor: {fileID: 0}
  m_LightProbeVolumeOverride: {fileID: 0}
  m_ScaleInLightmap: 1
  m_ReceiveGI: 1
  m_PreserveUVs: 0
  m_IgnoreNormalsForChartDetection: 0
  m_ImportantGI: 0
  m_StitchLightmapSeams: 1
  m_SelectedEditorRenderState: 3
  m_MinimumChartSize: 4
  m_AutoUVMaxDistance: 0.5
  m_AutoUVMaxAngle: 89
  m_LightmapParameters: {fileID: 0}
  m_SortingLayerID: 0
  m_SortingLayer: 0
  m_SortingOrder: 0
  m_AdditionalVertexStreams: {fileID: 0}
--- !u!33 &1988408102
MeshFilter:
  m_ObjectHideFlags: 0
  m_CorrespondingSourceObject: {fileID: 3324032, guid: 012e8cd5d38f8fa4fbb41fc57a5ce69c, type: 3}
  m_PrefabInstance: {fileID: 0}
  m_PrefabAsset: {fileID: 0}
  m_GameObject: {fileID: 1988408100}
  m_Mesh: {fileID: 4300000, guid: c85c69add93128c4fab9bc56e56ef63b, type: 3}
--- !u!4 &1988408103
Transform:
  m_ObjectHideFlags: 0
  m_CorrespondingSourceObject: {fileID: 485264, guid: 012e8cd5d38f8fa4fbb41fc57a5ce69c, type: 3}
  m_PrefabInstance: {fileID: 0}
  m_PrefabAsset: {fileID: 0}
  m_GameObject: {fileID: 1988408100}
  m_LocalRotation: {x: 0, y: 0, z: 0, w: 1}
  m_LocalPosition: {x: 0, y: 0, z: 0}
  m_LocalScale: {x: 1, y: 1, z: 1}
  m_Children: []
  m_Father: {fileID: 852931842}
  m_RootOrder: 0
  m_LocalEulerAnglesHint: {x: 0, y: 0, z: 0}
--- !u!1001 &2059102337
PrefabInstance:
  m_ObjectHideFlags: 0
  serializedVersion: 2
  m_Modification:
    m_TransformParent: {fileID: 0}
    m_Modifications:
    - target: {fileID: 452234, guid: 1cc2ed13481fc3446ac381dd171654b2, type: 3}
      propertyPath: m_RootOrder
      value: 22
      objectReference: {fileID: 0}
    - target: {fileID: 452234, guid: 1cc2ed13481fc3446ac381dd171654b2, type: 3}
      propertyPath: m_LocalPosition.x
      value: .268999994
      objectReference: {fileID: 0}
    - target: {fileID: 452234, guid: 1cc2ed13481fc3446ac381dd171654b2, type: 3}
      propertyPath: m_LocalPosition.y
      value: 0
      objectReference: {fileID: 0}
    - target: {fileID: 452234, guid: 1cc2ed13481fc3446ac381dd171654b2, type: 3}
      propertyPath: m_LocalPosition.z
      value: .915000021
      objectReference: {fileID: 0}
    - target: {fileID: 452234, guid: 1cc2ed13481fc3446ac381dd171654b2, type: 3}
      propertyPath: m_LocalRotation.w
      value: 1
      objectReference: {fileID: 0}
    - target: {fileID: 452234, guid: 1cc2ed13481fc3446ac381dd171654b2, type: 3}
      propertyPath: m_LocalRotation.x
      value: 0
      objectReference: {fileID: 0}
    - target: {fileID: 452234, guid: 1cc2ed13481fc3446ac381dd171654b2, type: 3}
      propertyPath: m_LocalRotation.y
      value: 0
      objectReference: {fileID: 0}
    - target: {fileID: 452234, guid: 1cc2ed13481fc3446ac381dd171654b2, type: 3}
      propertyPath: m_LocalRotation.z
      value: 0
      objectReference: {fileID: 0}
    m_RemovedComponents: []
  m_SourcePrefab: {fileID: 100100000, guid: 1cc2ed13481fc3446ac381dd171654b2, type: 3}
--- !u!1001 &2110081313
PrefabInstance:
  m_ObjectHideFlags: 0
  serializedVersion: 2
  m_Modification:
    m_TransformParent: {fileID: 0}
    m_Modifications:
    - target: {fileID: 442014, guid: 73d18ed494f69ad41b44fe6d2c7c54d4, type: 3}
      propertyPath: m_RootOrder
      value: 19
      objectReference: {fileID: 0}
    - target: {fileID: 442014, guid: 73d18ed494f69ad41b44fe6d2c7c54d4, type: 3}
      propertyPath: m_LocalPosition.x
      value: -1.94000006
      objectReference: {fileID: 0}
    - target: {fileID: 442014, guid: 73d18ed494f69ad41b44fe6d2c7c54d4, type: 3}
      propertyPath: m_LocalPosition.y
      value: 0
      objectReference: {fileID: 0}
    - target: {fileID: 442014, guid: 73d18ed494f69ad41b44fe6d2c7c54d4, type: 3}
      propertyPath: m_LocalPosition.z
      value: -.379999995
      objectReference: {fileID: 0}
    - target: {fileID: 442014, guid: 73d18ed494f69ad41b44fe6d2c7c54d4, type: 3}
      propertyPath: m_LocalRotation.w
      value: .967267752
      objectReference: {fileID: 0}
    - target: {fileID: 442014, guid: 73d18ed494f69ad41b44fe6d2c7c54d4, type: 3}
      propertyPath: m_LocalRotation.x
      value: 0
      objectReference: {fileID: 0}
    - target: {fileID: 442014, guid: 73d18ed494f69ad41b44fe6d2c7c54d4, type: 3}
      propertyPath: m_LocalRotation.y
      value: .253757983
      objectReference: {fileID: 0}
    - target: {fileID: 442014, guid: 73d18ed494f69ad41b44fe6d2c7c54d4, type: 3}
      propertyPath: m_LocalRotation.z
      value: 0
      objectReference: {fileID: 0}
    m_RemovedComponents: []
  m_SourcePrefab: {fileID: 100100000, guid: 73d18ed494f69ad41b44fe6d2c7c54d4, type: 3}
--- !u!1001 &2124823936
PrefabInstance:
  m_ObjectHideFlags: 0
  serializedVersion: 2
  m_Modification:
    m_TransformParent: {fileID: 0}
    m_Modifications:
    - target: {fileID: 490876, guid: f803fe526d65cae43ae20517514374c0, type: 3}
      propertyPath: m_RootOrder
      value: 17
      objectReference: {fileID: 0}
    - target: {fileID: 490876, guid: f803fe526d65cae43ae20517514374c0, type: 3}
      propertyPath: m_LocalPosition.x
      value: 2.51799989
      objectReference: {fileID: 0}
    - target: {fileID: 490876, guid: f803fe526d65cae43ae20517514374c0, type: 3}
      propertyPath: m_LocalPosition.y
      value: 0
      objectReference: {fileID: 0}
    - target: {fileID: 490876, guid: f803fe526d65cae43ae20517514374c0, type: 3}
      propertyPath: m_LocalPosition.z
      value: -.458999991
      objectReference: {fileID: 0}
    - target: {fileID: 490876, guid: f803fe526d65cae43ae20517514374c0, type: 3}
      propertyPath: m_LocalRotation.w
      value: -1.62920685e-07
      objectReference: {fileID: 0}
    - target: {fileID: 490876, guid: f803fe526d65cae43ae20517514374c0, type: 3}
      propertyPath: m_LocalRotation.x
      value: 0
      objectReference: {fileID: 0}
    - target: {fileID: 490876, guid: f803fe526d65cae43ae20517514374c0, type: 3}
      propertyPath: m_LocalRotation.y
      value: 1
      objectReference: {fileID: 0}
    - target: {fileID: 490876, guid: f803fe526d65cae43ae20517514374c0, type: 3}
      propertyPath: m_LocalRotation.z
      value: 0
      objectReference: {fileID: 0}
    m_RemovedComponents: []
  m_SourcePrefab: {fileID: 100100000, guid: f803fe526d65cae43ae20517514374c0, type: 3}
--- !u!1001 &2126584372
PrefabInstance:
  m_ObjectHideFlags: 0
  serializedVersion: 2
  m_Modification:
    m_TransformParent: {fileID: 0}
    m_Modifications:
    - target: {fileID: 430228, guid: dd203fb8553110b4eaa7c231259b8660, type: 3}
      propertyPath: m_RootOrder
      value: 2
      objectReference: {fileID: 0}
    - target: {fileID: 430228, guid: dd203fb8553110b4eaa7c231259b8660, type: 3}
      propertyPath: m_LocalPosition.x
      value: 2.04299998
      objectReference: {fileID: 0}
    - target: {fileID: 430228, guid: dd203fb8553110b4eaa7c231259b8660, type: 3}
      propertyPath: m_LocalPosition.y
      value: 0
      objectReference: {fileID: 0}
    - target: {fileID: 430228, guid: dd203fb8553110b4eaa7c231259b8660, type: 3}
      propertyPath: m_LocalPosition.z
      value: -2.22900009
      objectReference: {fileID: 0}
    - target: {fileID: 430228, guid: dd203fb8553110b4eaa7c231259b8660, type: 3}
      propertyPath: m_LocalRotation.w
      value: .368879318
      objectReference: {fileID: 0}
    - target: {fileID: 430228, guid: dd203fb8553110b4eaa7c231259b8660, type: 3}
      propertyPath: m_LocalRotation.x
      value: 0
      objectReference: {fileID: 0}
    - target: {fileID: 430228, guid: dd203fb8553110b4eaa7c231259b8660, type: 3}
      propertyPath: m_LocalRotation.y
      value: -.929477274
      objectReference: {fileID: 0}
    - target: {fileID: 430228, guid: dd203fb8553110b4eaa7c231259b8660, type: 3}
      propertyPath: m_LocalRotation.z
      value: 0
      objectReference: {fileID: 0}
    m_RemovedComponents: []
  m_SourcePrefab: {fileID: 100100000, guid: dd203fb8553110b4eaa7c231259b8660, type: 3}
--- !u!1001 &2127659163
PrefabInstance:
  m_ObjectHideFlags: 0
  serializedVersion: 2
  m_Modification:
    m_TransformParent: {fileID: 0}
    m_Modifications:
    - target: {fileID: 411752, guid: fbc74bc83918fc94182a214fc2db1395, type: 3}
      propertyPath: m_RootOrder
      value: 21
      objectReference: {fileID: 0}
    - target: {fileID: 411752, guid: fbc74bc83918fc94182a214fc2db1395, type: 3}
      propertyPath: m_LocalPosition.x
      value: 1.52900004
      objectReference: {fileID: 0}
    - target: {fileID: 411752, guid: fbc74bc83918fc94182a214fc2db1395, type: 3}
      propertyPath: m_LocalPosition.y
      value: 0
      objectReference: {fileID: 0}
    - target: {fileID: 411752, guid: fbc74bc83918fc94182a214fc2db1395, type: 3}
      propertyPath: m_LocalPosition.z
      value: 1.44500005
      objectReference: {fileID: 0}
    - target: {fileID: 411752, guid: fbc74bc83918fc94182a214fc2db1395, type: 3}
      propertyPath: m_LocalRotation.w
      value: 1
      objectReference: {fileID: 0}
    - target: {fileID: 411752, guid: fbc74bc83918fc94182a214fc2db1395, type: 3}
      propertyPath: m_LocalRotation.x
      value: 0
      objectReference: {fileID: 0}
    - target: {fileID: 411752, guid: fbc74bc83918fc94182a214fc2db1395, type: 3}
      propertyPath: m_LocalRotation.y
      value: 0
      objectReference: {fileID: 0}
    - target: {fileID: 411752, guid: fbc74bc83918fc94182a214fc2db1395, type: 3}
      propertyPath: m_LocalRotation.z
      value: 0
      objectReference: {fileID: 0}
    m_RemovedComponents: []
  m_SourcePrefab: {fileID: 100100000, guid: fbc74bc83918fc94182a214fc2db1395, type: 3}
--- !u!1001 &2143821029
PrefabInstance:
  m_ObjectHideFlags: 0
  serializedVersion: 2
  m_Modification:
    m_TransformParent: {fileID: 0}
    m_Modifications:
    - target: {fileID: 416294, guid: 9fa4100b047a1684aa8e98446ca97e12, type: 3}
      propertyPath: m_RootOrder
      value: 20
      objectReference: {fileID: 0}
    - target: {fileID: 416294, guid: 9fa4100b047a1684aa8e98446ca97e12, type: 3}
      propertyPath: m_LocalPosition.x
      value: .800000012
      objectReference: {fileID: 0}
    - target: {fileID: 416294, guid: 9fa4100b047a1684aa8e98446ca97e12, type: 3}
      propertyPath: m_LocalPosition.y
      value: 0
      objectReference: {fileID: 0}
    - target: {fileID: 416294, guid: 9fa4100b047a1684aa8e98446ca97e12, type: 3}
      propertyPath: m_LocalPosition.z
      value: 3.77999997
      objectReference: {fileID: 0}
    - target: {fileID: 416294, guid: 9fa4100b047a1684aa8e98446ca97e12, type: 3}
      propertyPath: m_LocalRotation.w
      value: .707106709
      objectReference: {fileID: 0}
    - target: {fileID: 416294, guid: 9fa4100b047a1684aa8e98446ca97e12, type: 3}
      propertyPath: m_LocalRotation.x
      value: 0
      objectReference: {fileID: 0}
    - target: {fileID: 416294, guid: 9fa4100b047a1684aa8e98446ca97e12, type: 3}
      propertyPath: m_LocalRotation.y
      value: .707106829
      objectReference: {fileID: 0}
    - target: {fileID: 416294, guid: 9fa4100b047a1684aa8e98446ca97e12, type: 3}
      propertyPath: m_LocalRotation.z
      value: 0
      objectReference: {fileID: 0}
    m_RemovedComponents: []
  m_SourcePrefab: {fileID: 100100000, guid: 9fa4100b047a1684aa8e98446ca97e12, type: 3}
