Desired=Unknown/Install/Remove/Purge/Hold
| Status=Not/Inst/Conf-files/Unpacked/halF-conf/Half-inst/trig-aWait/Trig-pend
|/ Err?=(none)/Reinst-required (Status,Err: uppercase=bad)
||/ Name                                 Version                        Architecture Description
+++-====================================-==============================-============-==========================================================================
ii  acpi                                 1.6-1                          i386         displays information on ACPI devices
ii  acpid                                1:2.0.16-1+deb7u1              i386         Advanced Configuration and Power Interface event daemon
ii  analog                               2:6.0-19.1                     i386         web server log analyzer
iU  apache2                              2.2.22-13+deb7u6               amd64        Apache HTTP Server metapackage
ii  apache2-mpm-prefork                  2.2.22-13+deb7u6               amd64        Apache HTTP Server - traditional non-threaded model
ii  apache2-utils                        2.2.22-13+deb7u6               amd64        utility programs for webservers
ii  apache2.2-bin                        2.2.22-13+deb7u6               amd64        Apache HTTP Server common binary files
ii  apache2.2-common                     2.2.22-13+deb7u6               amd64        Apache HTTP Server common files
ii  apt                                  0.9.7.9+deb7u7                 amd64        commandline package manager
ii  apt-utils                            0.9.7.9+deb7u7                 i386         package managment related utility programs
ii  aptitude                             0.6.8.2-1                      i386         terminal-based package manager
ii  at                                   3.1.13-2+deb7u1                i386         Delayed job execution and batch processing
ii  base-files                           7.1wheezy11                    amd64        Debian base system miscellaneous files
ii  base-passwd                          3.5.26                         i386         Debian base system master password and group files
ii  bash                                 4.2+dfsg-0.1+deb7u3            i386         GNU Bourne Again SHell
ii  bc                                   1.06.95-2                      i386         The GNU bc arbitrary precision calculator language
ii  bind9                                1:9.8.4.dfsg.P1-6+nmu2+deb7u10 i386         Internet Domain Name Server
ii  bind9-host                           1:9.8.4.dfsg.P1-6+nmu2+deb7u10 i386         Version of 'host' bundled with BIND 9.X
ii  bind9utils                           1:9.8.4.dfsg.P1-6+nmu2+deb7u10 i386         Utilities for BIND
ii  binutils                             2.22-8+deb7u2                  i386         GNU assembler, linker and binary utilities
ii  bsd-mailx                            8.1.2-0.20111106cvs-1+deb7u1   i386         simple mail user agent
ii  bsdmainutils                         9.0.3                          i386         collection of more utilities from FreeBSD
ii  bsdutils                             1:2.20.1-5.3                   i386         Basic utilities from 4.4BSD-Lite
ii  busybox                              1:1.20.0-7                     i386         Tiny utilities for small and embedded systems
ii  bzip2                                1.0.6-4                        i386         high-quality block-sorting file compressor - utilities
ii  console-tools                        1:0.2.3dbs-70                  i386         Linux console and font utilities
ii  coreutils                            8.13-3.5                       i386         GNU core utilities
ii  courier-authdaemon                   0.63.0-6+b1                    i386         Courier authentication daemon
ii  courier-authlib                      0.63.0-6+b1                    i386         Courier authentication library
ii  courier-authlib-mysql                0.63.0-6+b1                    i386         MySQL support for the Courier authentication library
ii  courier-authlib-userdb               0.63.0-6+b1                    i386         userdb support for the Courier authentication library
ii  courier-base                         0.68.2-1                       i386         Courier mail server - base system
ii  courier-imap                         4.10.0-20120615-1              i386         Courier mail server - IMAP server
ii  courier-imap-ssl                     4.10.0-20120615-1              i386         Courier mail server - IMAP over SSL
ii  courier-maildrop                     0.68.2-1                       i386         Courier mail server - mail delivery agent
ii  courier-mta                          0.68.2-1                       i386         Courier mail server - ESMTP daemon
ii  courier-pop                          0.68.2-1                       i386         Courier mail server - POP3 server
ii  courier-pop-ssl                      0.68.2-1                       i386         Courier mail server - POP3 over SSL
ii  courier-ssl                          0.68.2-1                       i386         Courier mail server - SSL/TLS Support
ii  cpio                                 2.11+dfsg-0.1+deb7u2           i386         GNU cpio -- a program to manage archives of files
ii  cpp                                  4:4.7.2-1                      i386         GNU C preprocessor (cpp)
ii  cpp-4.7                              4.7.2-5                        i386         GNU C preprocessor
ii  cron                                 3.0pl1-124                     i386         process scheduling daemon
ii  dash                                 0.5.7-3                        amd64        POSIX-compliant shell
ii  dbus                                 1.6.8-1+deb7u6                 i386         simple interprocess messaging system (daemon and utilities)
ii  dc                                   1.06.95-2                      i386         The GNU dc arbitrary precision reverse-polish calculator
ii  debianutils                          4.3.2                          i386         Miscellaneous utilities specific to Debian
ii  diffutils                            1:3.2-6                        i386         File comparison utilities
ii  dmidecode                            2.11-9                         i386         SMBIOS/DMI table decoder
ii  dmsetup                              2:1.02.74-8                    i386         Linux Kernel Device Mapper userspace library
ii  dnsutils                             1:9.8.4.dfsg.P1-6+nmu2+deb7u10 i386         Clients provided with BIND
ii  dpkg                                 1.16.18                        amd64        Debian package management system
ii  e2fslibs:i386                        1.42.5-1.1+deb7u1              i386         ext2/ext3/ext4 file system libraries
ii  e2fsprogs                            1.42.5-1.1+deb7u1              i386         ext2/ext3/ext4 file system utilities
ii  ed                                   1.6-2                          i386         classic UNIX line editor
ii  eject                                2.1.5+deb1+cvs20081104-13      i386         ejects CDs and operates CD-Changers under Linux
rc  exim4-daemon-light                   4.69-9+lenny4                  i386         lightweight Exim MTA (v4) daemon
ii  expect                               5.45-2                         i386         Automates interactive applications
rc  fam                                  2.7.0-17                       i386         File Alteration Monitor
ii  file                                 5.11-2+deb7u8                  i386         Determines file type using "magic" numbers
ii  findutils                            4.4.2-4                        amd64        utilities for finding files--find, xargs
ii  fontconfig                           2.9.0-7.1                      i386         generic font configuration library - support binaries
ii  ftp                                  0.17-27                        i386         classical file transfer client
ii  gamin                                0.1.10-4.1                     amd64        File and directory monitoring system
ii  gcc                                  4:4.7.2-1                      i386         GNU C compiler
ii  gcc-4.2-base                         4.2.4-6                        i386         The GNU Compiler Collection (base package)
ii  gcc-4.3-base                         4.3.5-4                        i386         The GNU Compiler Collection (base package)
ii  gcc-4.7                              4.7.2-5                        i386         GNU C compiler
ii  gcc-4.7-base:amd64                   4.7.2-5                        amd64        GCC, the GNU Compiler Collection (base package)
ii  gcc-4.7-base:i386                    4.7.2-5                        i386         GCC, the GNU Compiler Collection (base package)
ii  gettext-base                         0.18.1.1-9                     i386         GNU Internationalization utilities for the base system
ii  ghostscript                          9.05~dfsg-6.3+deb7u2           i386         interpreter for the PostScript language and for PDF
ii  gnupg                                1.4.12-7+deb7u7                i386         GNU privacy guard - a free PGP replacement
ii  gnupg-curl                           1.4.12-7+deb7u7                i386         GNU privacy guard - a free PGP replacement (cURL)
ii  gnuplot-nox                          4.6.0-8                        i386         Command-line driven interactive plotting program. No-X package
ii  gpgv                                 1.4.12-7+deb7u7                i386         GNU privacy guard - signature verification tool
ii  grep                                 2.12-2                         i386         GNU grep, egrep and fgrep
ii  groff                                1.21-9                         i386         GNU troff text-formatting system
ii  groff-base                           1.21-9                         i386         GNU troff text-formatting system (base system components)
ii  grub                                 0.97-64                        i386         GRand Unified Bootloader (dummy package)
ii  grub-common                          1.99-27+deb7u3                 i386         GRand Unified Bootloader (common files)
ii  grub-pc                              1.99-27+deb7u3                 i386         GRand Unified Bootloader, version 2 (PC/BIOS version)
ii  grub-pc-bin                          1.99-27+deb7u3                 i386         GRand Unified Bootloader, version 2 (PC/BIOS binaries)
ii  grub2-common                         1.99-27+deb7u3                 i386         GRand Unified Bootloader (common files for version 2)
ii  gzip                                 1.5-1.1                        i386         GNU compression utilities
ii  hostname                             3.11                           i386         utility to set/show the host name or domain name
ii  ifupdown                             0.7.8                          i386         high level tools to configure network interfaces
ii  imagemagick                          8:6.7.7.10-5+deb7u4            i386         image manipulation programs
ii  info                                 4.13a.dfsg.1-10                i386         Standalone GNU Info documentation browser
ii  initscripts                          2.88dsf-41+deb7u1              i386         scripts for initializing and shutting down the system
ii  insserv                              1.14.0-5                       i386         boot sequence organizer using LSB init.d script dependency information
ii  install-info                         4.13a.dfsg.1-10                i386         Manage installed documentation in info format
ii  iproute                              20120521-3+b3                  i386         networking and traffic control tools
ii  iptables                             1.4.14-3.1                     i386         administration tools for packet filtering and NAT
ii  iputils-ping                         3:20101006-1+b1                i386         Tools to test the reachability of network hosts
ii  isc-dhcp-client                      4.2.2.dfsg.1-5+deb70u8         i386         ISC DHCP client
ii  ispell                               3.3.02-6                       i386         International Ispell (an interactive spelling corrector)
ii  klibc-utils                          2.0.1-3.1                      i386         small utilities built with klibc for early boot
ii  kmod                                 9-3                            i386         tools for managing Linux kernel modules
ii  laptop-detect                        0.13.7                         i386         attempt to detect a laptop
ii  less                                 444-4                          i386         pager program similar to more
ii  libacl1:amd64                        2.2.51-8                       amd64        Access control list shared library
ii  libacl1:i386                         2.2.51-8                       i386         Access control list shared library
ii  libaio1:amd64                        0.3.109-3                      amd64        Linux kernel AIO access library - shared library
ii  libaio1:i386                         0.3.109-3                      i386         Linux kernel AIO access library - shared library
ii  libapache2-mod-fcgid                 1:2.3.6-1.2+deb7u1             amd64        an alternative module compat with mod_fastcgi
ii  libapache2-mod-perl2                 2.0.7-3                        amd64        Integration of perl with the Apache2 web server
ii  libapache2-mod-php5                  5.4.45-0+deb7u2                amd64        server-side, HTML-embedded scripting language (Apache 2 module)
ii  libapache2-mod-python                3.3.1-9+b3                     amd64        Python-embedding module for Apache 2
ii  libapache2-mod-suphp                 0.7.1-3                        amd64        Apache2 module to run PHP scripts with the owner permissions
ii  libapr1                              1.4.6-3+deb7u1                 amd64        Apache Portable Runtime Library
ii  libaprutil1                          1.4.1-3                        amd64        Apache Portable Runtime Utility Library
ii  libaprutil1-dbd-sqlite3              1.4.1-3                        amd64        Apache Portable Runtime Utility Library - SQLite3 Driver
ii  libaprutil1-ldap                     1.4.1-3                        amd64        Apache Portable Runtime Utility Library - LDAP Driver
ii  libapt-inst1.5:amd64                 0.9.7.9+deb7u7                 amd64        deb package format runtime library
ii  libapt-inst1.5:i386                  0.9.7.9+deb7u7                 i386         deb package format runtime library
ii  libapt-pkg-perl                      0.1.26+b1                      amd64        Perl interface to libapt-pkg
ii  libapt-pkg4.12:amd64                 0.9.7.9+deb7u7                 amd64        package managment runtime library
ii  libapt-pkg4.12:i386                  0.9.7.9+deb7u7                 i386         package managment runtime library
ii  libasprintf0c2:amd64                 0.18.1.1-9                     amd64        GNU library to use fprintf and friends in C++
ii  libasprintf0c2:i386                  0.18.1.1-9                     i386         GNU library to use fprintf and friends in C++
ii  libattr1:amd64                       1:2.4.46-8                     amd64        Extended attribute shared library
ii  libattr1:i386                        1:2.4.46-8                     i386         Extended attribute shared library
ii  libauthen-pam-perl                   0.16-2+b2                      amd64        Perl interface to PAM library
ii  libavahi-client3:amd64               0.6.31-2                       amd64        Avahi client library
ii  libavahi-client3:i386                0.6.31-2                       i386         Avahi client library
ii  libavahi-common-data:amd64           0.6.31-2                       amd64        Avahi common data files
ii  libavahi-common-data:i386            0.6.31-2                       i386         Avahi common data files
ii  libavahi-common3:amd64               0.6.31-2                       amd64        Avahi common library
ii  libavahi-common3:i386                0.6.31-2                       i386         Avahi common library
rc  libbind9-50                          1:9.6.ESV.R4+dfsg-0+lenny4     i386         BIND9 Shared Library used by BIND
rc  libbind9-60                          1:9.7.3.dfsg-1~squeeze11       i386         BIND9 Shared Library used by BIND
ii  libbind9-80                          1:9.8.4.dfsg.P1-6+nmu2+deb7u10 amd64        BIND9 Shared Library used by BIND
ii  libblas3                             1.2.20110419-5                 amd64        Basic Linear Algebra Reference implementations, shared library
ii  libblkid1:amd64                      2.20.1-5.3                     amd64        block device id library
ii  libblkid1:i386                       2.20.1-5.3                     i386         block device id library
rc  libboost-iostreams1.42.0             1.42.0-4                       i386         Boost.Iostreams Library
ii  libboost-iostreams1.49.0             1.49.0-3.2                     amd64        Boost.Iostreams Library
ii  libbsd0:amd64                        0.4.2-1                        amd64        utility functions from BSD systems - shared library
ii  libbsd0:i386                         0.4.2-1                        i386         utility functions from BSD systems - shared library
ii  libbz2-1.0:amd64                     1.0.6-4                        amd64        high-quality block-sorting file compressor library - runtime
ii  libbz2-1.0:i386                      1.0.6-4                        i386         high-quality block-sorting file compressor library - runtime
ii  libc-bin                             2.13-38+deb7u10                amd64        Embedded GNU C Library: Binaries
rc  libc-client2007b                     7:2007b~dfsg-4+lenny3          i386         c-client library for mail protocols - library files
ii  libc-client2007e                     8:2007f~dfsg-2                 amd64        c-client library for mail protocols - library files
ii  libc-dev-bin                         2.13-38+deb7u10                amd64        Embedded GNU C Library: Development binaries
ii  libc6:amd64                          2.13-38+deb7u10                amd64        Embedded GNU C Library: Shared libraries
ii  libc6:i386                           2.13-38+deb7u10                i386         Embedded GNU C Library: Shared libraries
ii  libc6-dev:amd64                      2.13-38+deb7u10                amd64        Embedded GNU C Library: Development Libraries and Header Files
ii  libc6-dev:i386                       2.13-38+deb7u10                i386         Embedded GNU C Library: Development Libraries and Header Files
ii  libc6-i686:i386                      2.13-38+deb7u10                i386         Embedded GNU C Library: Shared libraries [i686 optimized]
ii  libcairo2:amd64                      1.12.2-3                       amd64        The Cairo 2D vector graphics library
ii  libcairo2:i386                       1.12.2-3                       i386         The Cairo 2D vector graphics library
ii  libcap2:amd64                        1:2.22-1.2                     amd64        support for getting/setting POSIX.1e capabilities
ii  libcap2:i386                         1:2.22-1.2                     i386         support for getting/setting POSIX.1e capabilities
ii  libcomerr2:amd64                     1.42.5-1.1+deb7u1              amd64        common error description library
ii  libcomerr2:i386                      1.42.5-1.1+deb7u1              i386         common error description library
ii  libconsole                           1:0.2.3dbs-70                  amd64        Shared libraries for Linux console and font manipulation
ii  libcroco3:amd64                      0.6.6-2                        amd64        Cascading Style Sheet (CSS) parsing and manipulation toolkit
ii  libcroco3:i386                       0.6.6-2                        i386         Cascading Style Sheet (CSS) parsing and manipulation toolkit
ii  libcups2:amd64                       1.5.3-5+deb7u6                 amd64        Common UNIX Printing System(tm) - Core library
ii  libcups2:i386                        1.5.3-5+deb7u6                 i386         Common UNIX Printing System(tm) - Core library
ii  libcupsimage2:amd64                  1.5.3-5+deb7u6                 amd64        Common UNIX Printing System(tm) - Raster image library
ii  libcupsimage2:i386                   1.5.3-5+deb7u6                 i386         Common UNIX Printing System(tm) - Raster image library
ii  libcurl3-gnutls:amd64                7.26.0-1+wheezy13              amd64        easy-to-use client-side URL transfer library (GnuTLS flavour)
ii  libcurl3-gnutls:i386                 7.26.0-1+wheezy13              i386         easy-to-use client-side URL transfer library (GnuTLS flavour)
ii  libcwidget3                          0.5.16-3.4                     amd64        high-level terminal interface library for C++ (runtime files)
ii  libdatrie1:amd64                     0.2.5-3                        amd64        Double-array trie library
ii  libdatrie1:i386                      0.2.5-3                        i386         Double-array trie library
ii  libdb4.5                             4.5.20-13                      i386         Berkeley v4.5 Database Libraries [runtime]
ii  libdb4.6                             4.6.21-16                      i386         Berkeley v4.6 Database Libraries [runtime]
ii  libdb4.8                             4.8.30-2                       i386         Berkeley v4.8 Database Libraries [runtime]
ii  libdb5.1:amd64                       5.1.29-5                       amd64        Berkeley v5.1 Database Libraries [runtime]
ii  libdb5.1:i386                        5.1.29-5                       i386         Berkeley v5.1 Database Libraries [runtime]
ii  libdbd-mysql-perl                    4.021-1+b1                     amd64        Perl5 database interface to the MySQL database
ii  libdbi-perl                          1.622-1+deb7u1                 amd64        Perl Database Interface (DBI)
ii  libdbus-1-3:amd64                    1.6.8-1+deb7u6                 amd64        simple interprocess messaging system (library)
ii  libdbus-1-3:i386                     1.6.8-1+deb7u6                 i386         simple interprocess messaging system (library)
ii  libdevmapper1.02.1:amd64             2:1.02.74-8                    amd64        Linux Kernel Device Mapper userspace library
ii  libdevmapper1.02.1:i386              2:1.02.74-8                    i386         Linux Kernel Device Mapper userspace library
ii  libdjvulibre21                       3.5.25.3-1                     amd64        Runtime support for the DjVu image format
rc  libdns58                             1:9.6.ESV.R4+dfsg-0+lenny4     i386         DNS Shared Library used by BIND
rc  libdns69                             1:9.7.3.dfsg-1~squeeze11       i386         DNS Shared Library used by BIND
ii  libdns88                             1:9.8.4.dfsg.P1-6+nmu2+deb7u10 amd64        DNS Shared Library used by BIND
ii  libedit2:amd64                       2.11-20080614-5                amd64        BSD editline and history libraries
ii  libedit2:i386                        2.11-20080614-5                i386         BSD editline and history libraries
rc  libept0                              0.5.22                         i386         High-level library for managing Debian package information
rc  libept1                              1.0.4                          i386         High-level library for managing Debian package information
ii  libept1.4.12                         1.0.9                          amd64        High-level library for managing Debian package information
rc  libevent-1.4-2                       1.4.13-stable-1                i386         An asynchronous event notification library
ii  libevent-2.0-5:amd64                 2.0.19-stable-3+deb7u1         amd64        Asynchronous event notification library
ii  libevent-2.0-5:i386                  2.0.19-stable-3+deb7u1         i386         Asynchronous event notification library
ii  libevent1                            1.3e-3                         i386         An asynchronous event notification library
ii  libexiv2-12                          0.23-1                         amd64        EXIF/IPTC metadata manipulation library
ii  libexpat1:amd64                      2.1.0-1+deb7u2                 amd64        XML parsing C library - runtime library
ii  libexpat1:i386                       2.1.0-1+deb7u2                 i386         XML parsing C library - runtime library
ic  libfam0                              2.7.0-17                       amd64        Client library to control the FAM daemon
ii  libffi5:amd64                        3.0.10-3                       amd64        Foreign Function Interface library runtime
ii  libffi5:i386                         3.0.10-3                       i386         Foreign Function Interface library runtime
ii  libfontconfig1:amd64                 2.9.0-7.1                      amd64        generic font configuration library - runtime
ii  libfontconfig1:i386                  2.9.0-7.1                      i386         generic font configuration library - runtime
ii  libfreetype6:amd64                   2.4.9-1.1+deb7u3               amd64        FreeType 2 font engine, shared library files
ii  libfreetype6:i386                    2.4.9-1.1+deb7u3               i386         FreeType 2 font engine, shared library files
ii  libfuse2:amd64                       2.9.0-2+deb7u2                 amd64        Filesystem in Userspace (library)
ii  libfuse2:i386                        2.9.0-2+deb7u2                 i386         Filesystem in Userspace (library)
ii  libgamin0                            0.1.10-4.1                     amd64        Client library for the gamin file and directory monitoring system
ii  libgc1c2                             1:7.1-9.1                      amd64        conservative garbage collector for C and C++
ii  libgcc1:amd64                        1:4.7.2-5                      amd64        GCC support library
ii  libgcc1:i386                         1:4.7.2-5                      i386         GCC support library
ii  libgcrypt11:amd64                    1.5.0-5+deb7u4                 amd64        LGPL Crypto library - runtime library
ii  libgcrypt11:i386                     1.5.0-5+deb7u4                 i386         LGPL Crypto library - runtime library
ic  libgd2-noxpm                         2.0.36~rc1~dfsg-5              i386         GD Graphics Library version 2 (without XPM support)
ii  libgd2-xpm:amd64                     2.0.36~rc1~dfsg-6.1+deb7u2     amd64        GD Graphics Library version 2
ii  libgd2-xpm:i386                      2.0.36~rc1~dfsg-6.1+deb7u2     i386         GD Graphics Library version 2
ii  libgdbm3:amd64                       1.8.3-11                       amd64        GNU dbm database routines (runtime version)
ii  libgdbm3:i386                        1.8.3-11                       i386         GNU dbm database routines (runtime version)
ii  libgdk-pixbuf2.0-0:amd64             2.26.1-1+deb7u3                amd64        GDK Pixbuf library
ii  libgdk-pixbuf2.0-0:i386              2.26.1-1+deb7u3                i386         GDK Pixbuf library
ii  libgeoip1                            1.4.8+dfsg-3                   amd64        non-DNS IP-to-country resolver library
ii  libgfortran3:amd64                   4.7.2-5                        amd64        Runtime library for GNU Fortran applications
ii  libgfortran3:i386                    4.7.2-5                        i386         Runtime library for GNU Fortran applications
ii  libglib2.0-0:amd64                   2.33.12+really2.32.4-5         amd64        GLib library of C routines
ii  libglib2.0-0:i386                    2.33.12+really2.32.4-5         i386         GLib library of C routines
ii  libgmp10:amd64                       2:5.0.5+dfsg-2                 amd64        Multiprecision arithmetic library
ii  libgmp10:i386                        2:5.0.5+dfsg-2                 i386         Multiprecision arithmetic library
ii  libgnutls26:amd64                    2.12.20-8+deb7u5               amd64        GNU TLS library - runtime library
ii  libgnutls26:i386                     2.12.20-8+deb7u5               i386         GNU TLS library - runtime library
ii  libgomp1:amd64                       4.7.2-5                        amd64        GCC OpenMP (GOMP) support library
ii  libgomp1:i386                        4.7.2-5                        i386         GCC OpenMP (GOMP) support library
ii  libgpg-error0:amd64                  1.10-3.1                       amd64        library for common error values and messages in GnuPG components
ii  libgpg-error0:i386                   1.10-3.1                       i386         library for common error values and messages in GnuPG components
ii  libgpgme11                           1.2.0-1.4+deb7u1               amd64        GPGME - GnuPG Made Easy
ii  libgpm2:amd64                        1.20.4-6                       amd64        General Purpose Mouse - shared library
ii  libgpm2:i386                         1.20.4-6                       i386         General Purpose Mouse - shared library
rc  libgs8                               8.71~dfsg2-9+squeeze1          i386         The Ghostscript PostScript/PDF interpreter Library
ii  libgs9                               9.05~dfsg-6.3+deb7u2           amd64        interpreter for the PostScript language and for PDF - Library
ii  libgssapi-krb5-2:amd64               1.10.1+dfsg-5+deb7u7           amd64        MIT Kerberos runtime libraries - krb5 GSS-API Mechanism
ii  libgssapi-krb5-2:i386                1.10.1+dfsg-5+deb7u7           i386         MIT Kerberos runtime libraries - krb5 GSS-API Mechanism
ii  libgssglue1:amd64                    0.4-2                          amd64        mechanism-switch gssapi library
ii  libgssglue1:i386                     0.4-2                          i386         mechanism-switch gssapi library
ii  libhtml-parser-perl                  3.69-2                         amd64        collection of modules that parse HTML text documents
ii  libice6:amd64                        2:1.0.8-2                      amd64        X11 Inter-Client Exchange library
ii  libice6:i386                         2:1.0.8-2                      i386         X11 Inter-Client Exchange library
ii  libidn11:amd64                       1.25-2                         amd64        GNU Libidn library, implementation of IETF IDN specifications
ii  libidn11:i386                        1.25-2                         i386         GNU Libidn library, implementation of IETF IDN specifications
ii  libijs-0.35                          0.35-8                         amd64        IJS raster image transport protocol: shared library
ii  libilmbase6                          1.0.1-4                        amd64        several utility libraries from ILM used by OpenEXR
ii  libio-pty-perl                       1:1.08-1+b2                    amd64        Perl module for pseudo tty IO
rc  libisc50                             1:9.6.ESV.R4+dfsg-0+lenny4     i386         ISC Shared Library used by BIND
rc  libisc62                             1:9.7.3.dfsg-1~squeeze11       i386         ISC Shared Library used by BIND
ii  libisc84                             1:9.8.4.dfsg.P1-6+nmu2+deb7u10 amd64        ISC Shared Library used by BIND
rc  libisccc50                           1:9.6.ESV.R4+dfsg-0+lenny4     i386         Command Channel Library used by BIND
rc  libisccc60                           1:9.7.3.dfsg-1~squeeze11       i386         Command Channel Library used by BIND
ii  libisccc80                           1:9.8.4.dfsg.P1-6+nmu2+deb7u10 amd64        Command Channel Library used by BIND
rc  libisccfg50                          1:9.6.ESV.R4+dfsg-0+lenny4     i386         Config File Handling Library used by BIND
rc  libisccfg62                          1:9.7.3.dfsg-1~squeeze11       i386         Config File Handling Library used by BIND
ii  libisccfg82                          1:9.8.4.dfsg.P1-6+nmu2+deb7u10 amd64        Config File Handling Library used by BIND
ii  libitm1:amd64                        4.7.2-5                        amd64        GNU Transactional Memory Library
ii  libitm1:i386                         4.7.2-5                        i386         GNU Transactional Memory Library
ii  libjasper1:amd64                     1.900.1-13+deb7u4              amd64        JasPer JPEG-2000 runtime library
ii  libjasper1:i386                      1.900.1-13+deb7u4              i386         JasPer JPEG-2000 runtime library
ii  libjbig0:amd64                       2.0-2+deb7u1                   amd64        JBIGkit libraries
ii  libjbig0:i386                        2.0-2+deb7u1                   i386         JBIGkit libraries
ii  libjbig2dec0                         0.11+20120125-1                amd64        JBIG2 decoder library - shared libraries
ii  libjpeg8:amd64                       8d-1+deb7u1                    amd64        Independent JPEG Group's JPEG runtime library
ii  libjpeg8:i386                        8d-1+deb7u1                    i386         Independent JPEG Group's JPEG runtime library
ii  libk5crypto3:amd64                   1.10.1+dfsg-5+deb7u7           amd64        MIT Kerberos runtime libraries - Crypto Library
ii  libk5crypto3:i386                    1.10.1+dfsg-5+deb7u7           i386         MIT Kerberos runtime libraries - Crypto Library
ii  libkeyutils1:amd64                   1.5.5-3+deb7u1                 amd64        Linux Key Management Utilities (library)
ii  libkeyutils1:i386                    1.5.5-3+deb7u1                 i386         Linux Key Management Utilities (library)
ii  libklibc                             2.0.1-3.1                      amd64        minimal libc subset for use with initramfs
ii  libkmod2:amd64                       9-3                            amd64        libkmod shared library
ii  libkmod2:i386                        9-3                            i386         libkmod shared library
ii  libkrb5-3:amd64                      1.10.1+dfsg-5+deb7u7           amd64        MIT Kerberos runtime libraries
ii  libkrb5-3:i386                       1.10.1+dfsg-5+deb7u7           i386         MIT Kerberos runtime libraries
ii  libkrb5support0:amd64                1.10.1+dfsg-5+deb7u7           amd64        MIT Kerberos runtime libraries - Support library
ii  libkrb5support0:i386                 1.10.1+dfsg-5+deb7u7           i386         MIT Kerberos runtime libraries - Support library
ii  liblcms1:amd64                       1.19.dfsg2-1.2+deb7u1          amd64        Little CMS color management library
ii  liblcms1:i386                        1.19.dfsg2-1.2+deb7u1          i386         Little CMS color management library
ii  liblcms2-2:amd64                     2.2+git20110628-2.2+deb7u1     amd64        Little CMS 2 color management library
ii  liblcms2-2:i386                      2.2+git20110628-2.2+deb7u1     i386         Little CMS 2 color management library
ii  libldap-2.4-2:amd64                  2.4.31-2+deb7u2                amd64        OpenLDAP libraries
ii  libldap-2.4-2:i386                   2.4.31-2+deb7u2                i386         OpenLDAP libraries
ii  liblensfun0                          0.2.5-2                        amd64        Lens Correction library - Runtime files
ii  liblinear-tools                      1.8+dfsg-1                     amd64        Standalone applications for LIBLINEAR
ii  liblinear1                           1.8+dfsg-1                     amd64        Library for Large Linear Classification
ii  liblocale-gettext-perl               1.05-7+b1                      amd64        module using libc functions for internationalization in Perl
ii  liblockfile-bin                      1.09-5                         amd64        support binaries for and cli utilities based on liblockfile
ii  liblockfile1:amd64                   1.09-5                         amd64        NFS-safe locking library
ii  liblockfile1:i386                    1.09-5                         i386         NFS-safe locking library
ii  liblqr-1-0:amd64                     0.4.1-2                        amd64        converts plain array images into multi-size representation
ii  liblqr-1-0:i386                      0.4.1-2                        i386         converts plain array images into multi-size representation
rc  libltdl3                             1.5.26-4+lenny1                i386         A system independent dlopen wrapper for GNU libtool
ii  libltdl7:amd64                       2.4.2-1.1                      amd64        A system independent dlopen wrapper for GNU libtool
ii  libltdl7:i386                        2.4.2-1.1                      i386         A system independent dlopen wrapper for GNU libtool
ii  liblua5.1-0:amd64                    5.1.5-4+deb7u1                 amd64        Shared library for the Lua interpreter version 5.1
ii  liblua5.1-0:i386                     5.1.5-4+deb7u1                 i386         Shared library for the Lua interpreter version 5.1
rc  liblwres50                           1:9.6.ESV.R4+dfsg-0+lenny4     i386         Lightweight Resolver Library used by BIND
rc  liblwres60                           1:9.7.3.dfsg-1~squeeze11       i386         Lightweight Resolver Library used by BIND
ii  liblwres80                           1:9.8.4.dfsg.P1-6+nmu2+deb7u10 amd64        Lightweight Resolver Library used by BIND
ii  liblzma2                             5.0.0-2                        i386         XZ-format compression library
ii  liblzma5:amd64                       5.1.1alpha+20120614-2          amd64        XZ-format compression library
ii  liblzma5:i386                        5.1.1alpha+20120614-2          i386         XZ-format compression library
ii  libmagic1:amd64                      5.11-2+deb7u8                  amd64        File type determination library using "magic" numbers
ii  libmagic1:i386                       5.11-2+deb7u8                  i386         File type determination library using "magic" numbers
rc  libmagickcore3                       8:6.6.0.4-3+squeeze4           i386         low-level image manipulation library
ii  libmagickcore5:amd64                 8:6.7.7.10-5+deb7u4            amd64        low-level image manipulation library
ii  libmagickcore5:i386                  8:6.7.7.10-5+deb7u4            i386         low-level image manipulation library
ii  libmagickcore5-extra:amd64           8:6.7.7.10-5+deb7u4            amd64        low-level image manipulation library - extra codecs
ii  libmagickcore5-extra:i386            8:6.7.7.10-5+deb7u4            i386         low-level image manipulation library - extra codecs
rc  libmagickwand3                       8:6.6.0.4-3+squeeze4           i386         image manipulation library
ii  libmagickwand5:amd64                 8:6.7.7.10-5+deb7u4            amd64        image manipulation library
ii  libmagickwand5:i386                  8:6.7.7.10-5+deb7u4            i386         image manipulation library
ii  libmcrypt4                           2.5.8-3.1                      amd64        De-/Encryption Library
ii  libmhash2                            0.9.9.9-1.1                    amd64        Library for cryptographic hashing and message authentication
ii  libmount1                            2.20.1-5.3                     amd64        block device id library
ii  libmpc2:amd64                        0.9-4                          amd64        multiple precision complex floating-point library
ii  libmpc2:i386                         0.9-4                          i386         multiple precision complex floating-point library
ii  libmpfr4:amd64                       3.1.0-5                        amd64        multiple precision floating-point computation
ii  libmpfr4:i386                        3.1.0-5                        i386         multiple precision floating-point computation
rc  libmysqlclient15off                  5.0.51a-24+lenny5              i386         MySQL database client library
rc  libmysqlclient16                     5.1.73-1                       i386         MySQL database client library
ii  libmysqlclient18:amd64               5.5.47-0+deb7u1                amd64        MySQL database client library
ii  libmysqlclient18:i386                5.5.47-0+deb7u1                i386         MySQL database client library
ii  libncurses5:amd64                    5.9-10                         amd64        shared libraries for terminal handling
ii  libncurses5:i386                     5.9-10                         i386         shared libraries for terminal handling
ii  libncursesw5:amd64                   5.9-10                         amd64        shared libraries for terminal handling (wide character support)
ii  libncursesw5:i386                    5.9-10                         i386         shared libraries for terminal handling (wide character support)
ii  libnet-dns-perl                      0.66-2+b2                      amd64        Perform DNS queries from a Perl script
ii  libnet-ssleay-perl                   1.48-1+b1                      amd64        Perl module for Secure Sockets Layer (SSL)
ii  libnetaddr-ip-perl                   4.062+dfsg-1                   amd64        IP address manipulation module
ii  libnetpbm10                          2:10.0-15+b1                   amd64        Graphics conversion tools shared libraries
ii  libnewt0.52                          0.52.14-11.1                   amd64        Not Erik's Windowing Toolkit - text mode windowing with slang
ii  libnfnetlink0                        1.0.0-1.1                      amd64        Netfilter netlink library
ii  libnfsidmap2:amd64                   0.25-4                         amd64        NFS idmapping library
ii  libnfsidmap2:i386                    0.25-4                         i386         NFS idmapping library
ii  libonig2                             5.9.1-1                        amd64        Oniguruma regular expressions library
ii  libopenexr6                          1.6.1-6                        amd64        runtime files for the OpenEXR image library
ii  libopts25                            1:5.12-0.1                     amd64        automated option processing library based on autogen
ii  libp11-kit0:amd64                    0.12-3                         amd64        Library for loading and coordinating access to PKCS#11 modules - runtime
ii  libp11-kit0:i386                     0.12-3                         i386         Library for loading and coordinating access to PKCS#11 modules - runtime
ii  libpam-modules:amd64                 1.1.3-7.1                      amd64        Pluggable Authentication Modules for PAM
ii  libpam-modules:i386                  1.1.3-7.1                      i386         Pluggable Authentication Modules for PAM
ii  libpam-modules-bin                   1.1.3-7.1                      amd64        Pluggable Authentication Modules for PAM - helper binaries
ii  libpam-mysql                         0.7~RC1-4+b3                   amd64        PAM module allowing authentication from a MySQL server
ii  libpam0g:amd64                       1.1.3-7.1                      amd64        Pluggable Authentication Modules library
ii  libpam0g:i386                        1.1.3-7.1                      i386         Pluggable Authentication Modules library
ii  libpango1.0-0:amd64                  1.30.0-1                       amd64        Layout and rendering of internationalized text
ii  libpango1.0-0:i386                   1.30.0-1                       i386         Layout and rendering of internationalized text
ii  libpaper-utils                       1.1.24+nmu2                    amd64        library for handling paper characteristics (utilities)
ii  libpaper1:amd64                      1.1.24+nmu2                    amd64        library for handling paper characteristics
ii  libpaper1:i386                       1.1.24+nmu2                    i386         library for handling paper characteristics
ii  libpcap0.8:amd64                     1.3.0-1                        amd64        system interface for user-level packet capture
ii  libpcap0.8:i386                      1.3.0-1                        i386         system interface for user-level packet capture
ii  libpci3:amd64                        1:3.1.9-6                      amd64        Linux PCI Utilities (shared library)
ii  libpci3:i386                         1:3.1.9-6                      i386         Linux PCI Utilities (shared library)
ii  libpcre3:amd64                       1:8.30-5                       amd64        Perl 5 Compatible Regular Expression Library - runtime files
ii  libpcre3:i386                        1:8.30-5                       i386         Perl 5 Compatible Regular Expression Library - runtime files
ii  libperl5.14                          5.14.2-21+deb7u3               amd64        shared Perl library
ii  libpipeline1:amd64                   1.2.1-1                        amd64        pipeline manipulation library
ii  libpipeline1:i386                    1.2.1-1                        i386         pipeline manipulation library
ii  libpixman-1-0:amd64                  0.26.0-4+deb7u2                amd64        pixel-manipulation library for X and cairo
ii  libpixman-1-0:i386                   0.26.0-4+deb7u2                i386         pixel-manipulation library for X and cairo
ii  libpng12-0:amd64                     1.2.49-1+deb7u2                amd64        PNG library - runtime
ii  libpng12-0:i386                      1.2.49-1+deb7u2                i386         PNG library - runtime
ii  libpopt0:amd64                       1.16-7                         amd64        lib for parsing cmdline parameters
ii  libpopt0:i386                        1.16-7                         i386         lib for parsing cmdline parameters
ii  libpq5                               9.1.21-0+deb7u1                amd64        PostgreSQL C client library
ii  libprocps0:amd64                     1:3.3.3-3                      amd64        library for accessing process information from /proc
ii  libprocps0:i386                      1:3.3.3-3                      i386         library for accessing process information from /proc
ii  libpth20                             2.0.7-16                       amd64        The GNU Portable Threads
ii  libpython2.6                         2.6.8-1.1                      amd64        Shared Python runtime library (version 2.6)
ii  libpython2.7                         2.7.3-6+deb7u2                 amd64        Shared Python runtime library (version 2.7)
ii  libqdbm14                            1.8.78-2                       amd64        QDBM Database Libraries without GDBM wrapper[runtime]
ii  libquadmath0:amd64                   4.7.2-5                        amd64        GCC Quad-Precision Math Library
ii  libquadmath0:i386                    4.7.2-5                        i386         GCC Quad-Precision Math Library
ii  libreadline5:amd64                   5.2+dfsg-2~deb7u1              amd64        GNU readline and history libraries, run-time libraries
ii  libreadline5:i386                    5.2+dfsg-2~deb7u1              i386         GNU readline and history libraries, run-time libraries
ii  libreadline6:amd64                   6.2+dfsg-0.1                   amd64        GNU readline and history libraries, run-time libraries
ii  libreadline6:i386                    6.2+dfsg-0.1                   i386         GNU readline and history libraries, run-time libraries
ii  librpcsecgss3:amd64                  0.19-5                         amd64        allows secure rpc communication using the rpcsec_gss protocol
ii  librpcsecgss3:i386                   0.19-5                         i386         allows secure rpc communication using the rpcsec_gss protocol
ii  librsvg2-2:amd64                     2.36.1-2+deb7u1                amd64        SAX-based renderer library for SVG files (runtime)
ii  librsvg2-2:i386                      2.36.1-2+deb7u1                i386         SAX-based renderer library for SVG files (runtime)
ii  librsvg2-common:amd64                2.36.1-2+deb7u1                amd64        SAX-based renderer library for SVG files (extra runtime)
ii  librsvg2-common:i386                 2.36.1-2+deb7u1                i386         SAX-based renderer library for SVG files (extra runtime)
ii  librtmp0:amd64                       2.4+20111222.git4e06e21-1      amd64        toolkit for RTMP streams (shared library)
ii  librtmp0:i386                        2.4+20111222.git4e06e21-1      i386         toolkit for RTMP streams (shared library)
ii  libruby1.8                           1.8.7.358-7.1+deb7u3           amd64        Libraries necessary to run Ruby 1.8
ii  libruby1.9.1                         1.9.3.194-8.1+deb7u5           amd64        Libraries necessary to run Ruby 1.9.1
ii  libsasl2-2:amd64                     2.1.25.dfsg1-6+deb7u1          amd64        Cyrus SASL - authentication abstraction library
ii  libsasl2-2:i386                      2.1.25.dfsg1-6+deb7u1          i386         Cyrus SASL - authentication abstraction library
ii  libsasl2-modules:amd64               2.1.25.dfsg1-6+deb7u1          amd64        Cyrus SASL - pluggable authentication modules
ii  libsasl2-modules:i386                2.1.25.dfsg1-6+deb7u1          i386         Cyrus SASL - pluggable authentication modules
ii  libselinux1:amd64                    2.1.9-5                        amd64        SELinux runtime shared libraries
ii  libselinux1:i386                     2.1.9-5                        i386         SELinux runtime shared libraries
ii  libsemanage1:amd64                   2.1.6-6                        amd64        SELinux policy management library
ii  libsemanage1:i386                    2.1.6-6                        i386         SELinux policy management library
ii  libsepol1:amd64                      2.1.4-3                        amd64        SELinux library for manipulating binary security policies
ii  libsepol1:i386                       2.1.4-3                        i386         SELinux library for manipulating binary security policies
ii  libsigc++-2.0-0c2a:amd64             2.2.10-0.2                     amd64        type-safe Signal Framework for C++ - runtime
ii  libsigc++-2.0-0c2a:i386              2.2.10-0.2                     i386         type-safe Signal Framework for C++ - runtime
ii  libslang2:amd64                      2.2.4-15                       amd64        S-Lang programming library - runtime version
ii  libslang2:i386                       2.2.4-15                       i386         S-Lang programming library - runtime version
ii  libsm6:amd64                         2:1.2.1-2                      amd64        X11 Session Management library
ii  libsm6:i386                          2:1.2.1-2                      i386         X11 Session Management library
ii  libsocket-perl                       2.002-1                        amd64        networking constants and support functions
ii  libsocket6-perl                      0.23-1+b2                      amd64        Perl extensions for IPv6
ii  libsqlite3-0:amd64                   3.7.13-1+deb7u2                amd64        SQLite 3 shared library
ii  libsqlite3-0:i386                    3.7.13-1+deb7u2                i386         SQLite 3 shared library
ii  libss2:amd64                         1.42.5-1.1+deb7u1              amd64        command-line interface parsing library
ii  libss2:i386                          1.42.5-1.1+deb7u1              i386         command-line interface parsing library
ii  libssh2-1:amd64                      1.4.2-1.1+deb7u2               amd64        SSH2 client-side library
ii  libssh2-1:i386                       1.4.2-1.1+deb7u2               i386         SSH2 client-side library
ii  libssl0.9.8                          0.9.8o-4squeeze14              i386         SSL shared libraries
ii  libssl1.0.0:amd64                    1.0.1e-2+deb7u20               amd64        SSL shared libraries
ii  libssl1.0.0:i386                     1.0.1e-2+deb7u20               i386         SSL shared libraries
ii  libstdc++6:amd64                     4.7.2-5                        amd64        GNU Standard C++ Library v3
ii  libstdc++6:i386                      4.7.2-5                        i386         GNU Standard C++ Library v3
ii  libsvm-tools                         3.12-1                         amd64        LIBSVM binary tools
ii  libsystemd-login0:amd64              44-11+deb7u4                   amd64        systemd login utility library
ii  libsystemd-login0:i386               44-11+deb7u4                   i386         systemd login utility library
ii  libt1-5                              5.1.2-3.6                      amd64        Type 1 font rasterizer library - runtime
ii  libtasn1-3:amd64                     2.13-2+deb7u2                  amd64        Manage ASN.1 structures (runtime)
ii  libtasn1-3:i386                      2.13-2+deb7u2                  i386         Manage ASN.1 structures (runtime)
ii  libterm-readkey-perl                 2.30-4+b2                      amd64        A perl module for simple terminal control
ii  libtext-charwidth-perl               0.04-7+b1                      amd64        get display widths of characters on the terminal
ii  libtext-iconv-perl                   1.7-5                          amd64        converts between character sets in Perl
ii  libthai0:amd64                       0.1.18-2                       amd64        Thai language support library
ii  libthai0:i386                        0.1.18-2                       i386         Thai language support library
ii  libtiff4:amd64                       3.9.6-11                       amd64        Tag Image File Format (TIFF) library (old version)
ii  libtiff4:i386                        3.9.6-11                       i386         Tag Image File Format (TIFF) library (old version)
ii  libtinfo5:amd64                      5.9-10                         amd64        shared low-level terminfo library for terminal handling
ii  libtinfo5:i386                       5.9-10                         i386         shared low-level terminfo library for terminal handling
ii  libtirpc1:amd64                      0.2.2-5                        amd64        transport-independent RPC library
ii  libtirpc1:i386                       0.2.2-5                        i386         transport-independent RPC library
rc  libtokyocabinet8                     1.4.37-6                       i386         Tokyo Cabinet Database Libraries [runtime]
ii  libtokyocabinet9:amd64               1.4.47-2                       amd64        Tokyo Cabinet Database Libraries [runtime]
ii  libtokyocabinet9:i386                1.4.47-2                       i386         Tokyo Cabinet Database Libraries [runtime]
ii  libudev0:amd64                       175-7.2                        amd64        libudev shared library
ii  libudev0:i386                        175-7.2                        i386         libudev shared library
ii  libusb-0.1-4:amd64                   2:0.1.12-20+nmu1               amd64        userspace USB programming library
ii  libusb-0.1-4:i386                    2:0.1.12-20+nmu1               i386         userspace USB programming library
ii  libusb-1.0-0:amd64                   2:1.0.11-1                     amd64        userspace USB programming library
ii  libusb-1.0-0:i386                    2:1.0.11-1                     i386         userspace USB programming library
ii  libustr-1.0-1:amd64                  1.0.4-3                        amd64        Micro string library: shared library
ii  libustr-1.0-1:i386                   1.0.4-3                        i386         Micro string library: shared library
ii  libuuid-perl                         0.02-5                         amd64        Perl extension for using UUID interfaces as defined in e2fsprogs
ii  libuuid1:amd64                       2.20.1-5.3                     amd64        Universally Unique ID library
ii  libuuid1:i386                        2.20.1-5.3                     i386         Universally Unique ID library
rc  libvolume-id0                        0.125-7+lenny3                 i386         libvolume_id shared library
ii  libwmf0.2-7:amd64                    0.2.8.4-10.3+deb7u1            amd64        Windows metafile conversion library
ii  libwmf0.2-7:i386                     0.2.8.4-10.3+deb7u1            i386         Windows metafile conversion library
ii  libwrap0:amd64                       7.6.q-24                       amd64        Wietse Venema's TCP wrappers library
ii  libwrap0:i386                        7.6.q-24                       i386         Wietse Venema's TCP wrappers library
ii  libx11-6:amd64                       2:1.5.0-1+deb7u2               amd64        X11 client-side library
ii  libx11-6:i386                        2:1.5.0-1+deb7u2               i386         X11 client-side library
ii  libxapian15                          1.0.7-4                        i386         Search engine library
ii  libxapian22                          1.2.12-2+deb7u1                amd64        Search engine library
ii  libxau6:amd64                        1:1.0.7-1                      amd64        X11 authorisation library
ii  libxau6:i386                         1:1.0.7-1                      i386         X11 authorisation library
ii  libxaw7:amd64                        2:1.0.10-2                     amd64        X11 Athena Widget library
ii  libxaw7:i386                         2:1.0.10-2                     i386         X11 Athena Widget library
ii  libxcb-render0:amd64                 1.8.1-2+deb7u1                 amd64        X C Binding, render extension
ii  libxcb-render0:i386                  1.8.1-2+deb7u1                 i386         X C Binding, render extension
ii  libxcb-shm0:amd64                    1.8.1-2+deb7u1                 amd64        X C Binding, shm extension
ii  libxcb-shm0:i386                     1.8.1-2+deb7u1                 i386         X C Binding, shm extension
rc  libxcb-xlib0                         1.1-1.2                        i386         X C Binding, Xlib/XCB interface library
ii  libxcb1:amd64                        1.8.1-2+deb7u1                 amd64        X C Binding
ii  libxcb1:i386                         1.8.1-2+deb7u1                 i386         X C Binding
ii  libxdmcp6:amd64                      1:1.1.1-1                      amd64        X11 Display Manager Control Protocol library
ii  libxdmcp6:i386                       1:1.1.1-1                      i386         X11 Display Manager Control Protocol library
ii  libxext6:amd64                       2:1.3.1-2+deb7u1               amd64        X11 miscellaneous extension library
ii  libxext6:i386                        2:1.3.1-2+deb7u1               i386         X11 miscellaneous extension library
ii  libxft2:amd64                        2.3.1-1                        amd64        FreeType-based font drawing library for X
ii  libxft2:i386                         2.3.1-1                        i386         FreeType-based font drawing library for X
ii  libxml2:amd64                        2.8.0+dfsg1-7+wheezy5          amd64        GNOME XML library
ii  libxml2:i386                         2.8.0+dfsg1-7+wheezy5          i386         GNOME XML library
ii  libxmu6:amd64                        2:1.1.1-1                      amd64        X11 miscellaneous utility library
ii  libxmu6:i386                         2:1.1.1-1                      i386         X11 miscellaneous utility library
ii  libxmuu1:amd64                       2:1.1.1-1                      amd64        X11 miscellaneous micro-utility library
ii  libxmuu1:i386                        2:1.1.1-1                      i386         X11 miscellaneous micro-utility library
ii  libxpm4:amd64                        1:3.5.10-1                     amd64        X11 pixmap library
ii  libxpm4:i386                         1:3.5.10-1                     i386         X11 pixmap library
ii  libxrender1:amd64                    1:0.9.7-1+deb7u2               amd64        X Rendering Extension client library
ii  libxrender1:i386                     1:0.9.7-1+deb7u2               i386         X Rendering Extension client library
ii  libxt6:amd64                         1:1.1.3-1+deb7u1               amd64        X11 toolkit intrinsics library
ii  libxt6:i386                          1:1.1.3-1+deb7u1               i386         X11 toolkit intrinsics library
ii  libyaml-0-2:amd64                    0.1.4-2+deb7u5                 amd64        Fast YAML 1.1 parser and emitter library
ii  libyaml-0-2:i386                     0.1.4-2+deb7u5                 i386         Fast YAML 1.1 parser and emitter library
ii  linux-image-2.6-686                  3.2+46                         i386         Linux for modern PCs (dummy package)
ii  linux-image-2.6.26-2-686             2.6.26-29                      i386         Linux 2.6.26 image on PPro/Celeron/PII/PIII/P4
ii  linux-image-2.6.32-5-686             2.6.32-48squeeze6              i386         Linux 2.6.32 for modern PCs
ii  linux-image-3.2.0-4-486              3.2.78-1                       i386         Linux 3.2 for older PCs
ii  linux-image-3.2.0-4-686-pae          3.2.78-1                       i386         Linux 3.2 for modern PCs
ii  linux-image-3.2.0-4-amd64            3.2.78-1                       i386         Linux 3.2 for 64-bit PCs
ii  linux-image-686-pae                  3.2+46                         i386         Linux for modern PCs (meta-package)
ii  linux-image-amd64                    3.2+46                         i386         Linux for 64-bit PCs (meta-package)
ii  linux-libc-dev:amd64                 3.2.78-1                       amd64        Linux support headers for userspace development
ii  linux-libc-dev:i386                  3.2.78-1                       i386         Linux support headers for userspace development
ii  lockfile-progs                       0.1.17                         i386         Programs for locking and unlocking files and mailboxes
ii  login                                1:4.1.5.1-1                    i386         system login tools
ii  logrotate                            3.8.1-4                        i386         Log rotation utility
ii  lsof                                 4.86+dfsg-1                    amd64        Utility to list open files
ii  lwresd                               1:9.8.4.dfsg.P1-6+nmu2+deb7u10 i386         Lightweight Resolver Daemon
ii  lzma                                 9.22-2                         i386         Compression and decompression in the LZMA format - command line utility
ii  m4                                   1.4.16-3                       i386         a macro processing language
ii  mailagent                            1:3.1-74-0.2                   i386         An automatic mail-processing tool and filter.
ii  mailman                              1:2.1.15-1+deb7u1              i386         Powerful, web-based mailing list manager
ii  man-db                               2.6.2-1                        i386         on-line manual pager
ii  mawk                                 1.3.3-17                       i386         a pattern scanning and text processing language
ii  mcrypt                               2.6.8-1.3                      i386         Replacement for old unix crypt(1)
ii  mlocate                              0.23.1-1                       i386         quickly find files on the filesystem based on their name
ii  mlock                                8:2007f~dfsg-2                 amd64        mailbox locking program
ii  mount                                2.20.1-5.3                     i386         Tools for mounting and manipulating filesystems
ii  multiarch-support                    2.13-38+deb7u10                i386         Transitional package to ensure multiarch compatibility
ii  mutt                                 1.5.21-6.2+deb7u3              i386         text-based mailreader supporting MIME, GPG, PGP and threading
ii  mysql-client-5.5                     5.5.47-0+deb7u1                i386         MySQL database client binaries
rc  mysql-server-5.0                     5.0.51a-24+lenny5              i386         MySQL database server binaries
rc  mysql-server-5.1                     5.1.73-1                       i386         MySQL database server binaries and system database setup
ii  mysql-server-5.5                     5.5.47-0+deb7u1                i386         MySQL database server binaries and system database setup
ii  mysql-server-core-5.5                5.5.47-0+deb7u1                i386         MySQL database server binaries
ii  nano                                 2.2.6-1+b1                     i386         small, friendly text editor inspired by Pico
ii  ncurses-bin                          5.9-10                         i386         terminal-related programs and man pages
ii  net-tools                            1.60-24.2                      i386         The NET-3 networking toolkit
ii  netcat-traditional                   1.10-40                        i386         TCP/IP swiss army knife
ii  netpbm                               2:10.0-15+b1                   i386         Graphics conversion tools between image formats
ii  nfs-common                           1:1.2.6-4                      i386         NFS support files common to client and server
ii  nmap                                 6.00-0.3+deb7u1                i386         The Network Mapper
ii  ntp                                  1:4.2.6.p5+dfsg-2+deb7u6       i386         Network Time Protocol daemon and utility programs
ii  ntpdate                              1:4.2.6.p5+dfsg-2+deb7u6       i386         client for setting system time from NTP servers
ii  openbsd-inetd                        0.20091229-2                   i386         OpenBSD Internet Superserver
ii  openssh-client                       1:6.0p1-4+deb7u4               i386         secure shell (SSH) client, for secure access to remote machines
ii  openssh-server                       1:6.0p1-4+deb7u4               i386         secure shell (SSH) server, for secure access from remote machines
ii  openssl                              1.0.1e-2+deb7u20               i386         Secure Socket Layer (SSL) binary and related cryptographic tools
ii  os-prober                            1.58                           i386         utility to detect other OSes on a set of drives
ii  passwd                               1:4.1.5.1-1                    i386         change and administer password and group data
ii  patch                                2.6.1-3                        i386         Apply a diff file to an original
ii  pciutils                             1:3.1.9-6                      i386         Linux PCI Utilities
ii  perl                                 5.14.2-21+deb7u3               amd64        Larry Wall's Practical Extraction and Report Language
ii  perl-base                            5.14.2-21+deb7u3               amd64        minimal Perl system
ii  php5-cgi                             5.4.45-0+deb7u2                amd64        server-side, HTML-embedded scripting language (CGI binary)
ii  php5-cli                             5.4.45-0+deb7u2                i386         command-line interpreter for the php5 scripting language
ii  php5-common                          5.4.45-0+deb7u2                amd64        Common files for packages built from the php5 source
ii  php5-gd                              5.4.45-0+deb7u2                i386         GD module for php5
ii  php5-imagick                         3.1.0~rc1-1+b2                 i386         ImageMagick module for php5
ii  php5-imap                            5.4.45-0+deb7u2                i386         IMAP module for php5
ii  php5-mcrypt                          5.4.45-0+deb7u2                i386         MCrypt module for php5
ii  php5-mysql                           5.4.45-0+deb7u2                i386         MySQL module for php5
rc  php5-suhosin                         0.9.32.1-1                     i386         advanced protection module for php5
rc  portmap                              6.0.0-2                        i386         RPC port mapper
rc  postfix                              2.5.5-1.1+lenny1               i386         High-performance mail transport agent
ii  procmail                             3.22-20+deb7u1                 i386         Versatile e-mail processor
ii  procps                               1:3.3.3-3                      i386         /proc file system utilities
ii  psmisc                               22.19-1+deb7u1                 amd64        utilities that use the proc file system
ii  psutils                              1.17.dfsg-1                    i386         PostScript document handling utilities
ii  pwgen                                2.06-1+b2                      i386         Automatic Password generation
ii  python-apt                           0.8.8.2                        i386         Python interface to libapt-pkg
ii  python-xapian                        1.2.12-2                       i386         Xapian search engine interface for Python
ii  python2.5                            2.5.5-11                       i386         An interactive high-level object-oriented language (version 2.5)
ii  python2.5-minimal                    2.5.5-11                       i386         A minimal subset of the Python language (version 2.5)
ii  python2.6                            2.6.8-1.1                      amd64        Interactive high-level object-oriented language (version 2.6)
ii  python2.6-minimal                    2.6.8-1.1                      amd64        Minimal subset of the Python language (version 2.6)
ii  python2.7                            2.7.3-6+deb7u2                 amd64        Interactive high-level object-oriented language (version 2.7)
ii  python2.7-minimal                    2.7.3-6+deb7u2                 amd64        Minimal subset of the Python language (version 2.7)
rc  qpopper                              4.0.9.dfsg-1.2                 i386         Enhanced Post Office Protocol server (POP3)
ii  rpcbind                              0.2.0-8+deb7u1                 i386         converts RPC program numbers into universal addresses
ii  rsyslog                              5.8.11-3+deb7u2                i386         reliable system and kernel logging daemon
rc  sa-exim                              4.2.1-11                       i386         Use spamAssassin at SMTP time with the Exim v4 MTA
ii  sed                                  4.2.1-10                       amd64        The GNU sed stream editor
ii  shared-mime-info                     1.0-1+b1                       i386         FreeDesktop.org shared MIME database and spec
ii  spamc                                3.3.2-5+deb7u3                 i386         Client for SpamAssassin spam filtering daemon
ii  sudo                                 1.8.5p2-1+nmu3+deb7u1          i386         Provide limited super user privileges to specific users
ii  suphp-common                         0.7.1-3                        amd64        Common files for mod suphp
ii  sysvinit                             2.88dsf-41+deb7u1              i386         System-V-like init utilities
ii  sysvinit-utils                       2.88dsf-41+deb7u1              i386         System-V-like utilities
ii  tar                                  1.26+dfsg-0.1                  amd64        GNU version of the tar archiving utility
rc  tcl8.4                               8.4.19-5                       i386         Tcl (the Tool Command Language) v8.4 - run-time files
ii  tcl8.5                               8.5.11-2                       i386         Tcl (the Tool Command Language) v8.5 - run-time files
ii  tcpd                                 7.6.q-24                       i386         Wietse Venema's TCP wrapper utilities
ii  telnet                               0.17-36                        i386         The telnet client
ii  texinfo                              4.13a.dfsg.1-10                i386         Documentation system for on-line information and printed output
ii  time                                 1.7-24                         i386         GNU time program for measuring CPU resource usage
ii  traceroute                           1:2.0.18-3                     i386         Traces the route taken by packets over an IPv4/IPv6 network
ii  tree                                 1.6.0-1                        i386         displays directory tree, in color
ii  udev                                 175-7.2                        i386         /dev/ and hotplug management daemon
ii  ufraw-batch                          0.18-2                         i386         batch importer for raw camera images
ii  unhide                               20110113-4                     i386         Forensic tool to find hidden processes and ports
ii  usbutils                             1:005-3                        i386         Linux USB utilities
ii  util-linux                           2.20.1-5.3                     i386         Miscellaneous system utilities
rc  uw-imapd                             7:2007b~dfsg-4+lenny3          i386         remote mail folder access server using IMAP4rev1
ii  vim-common                           2:7.3.547-7                    i386         Vi IMproved - Common files
ii  vim-nox                              2:7.3.547-7                    i386         Vi IMproved - enhanced vi editor - with scripting languages support
ii  vim-tiny                             2:7.3.547-7                    i386         Vi IMproved - enhanced vi editor - compact version
ii  w3m                                  0.5.3-8                        i386         WWW browsable pager with excellent tables/frames support
ii  wget                                 1.13.4-3+deb7u2                i386         retrieves files from the web
ii  whiptail                             0.52.14-11.1                   i386         Displays user-friendly dialog boxes from shell scripts
ii  whois                                5.1.1~deb7u1                   i386         intelligent WHOIS client
ii  xauth                                1:1.0.7-1                      i386         X authentication utility
ii  xz-utils                             5.1.1alpha+20120614-2          i386         XZ-format compression utilities
ii  zlib1g:amd64                         1:1.2.7.dfsg-13                amd64        compression library - runtime
ii  zlib1g:i386                          1:1.2.7.dfsg-13                i386         compression library - runtime
