 ______                      __
/\__  _\                    /\ \
\/_/\ \/     __       ____  \ \ \/'\                 ___ ___       __       ___       __        __        __    _ __
   \ \ \   /'__`\    /',__\  \ \ , <               /' __` __`\   /'__`\   /' _ `\   /'__`\    /'_ `\    /'__`\ /\`'__\
    \ \ \ /\ \L\.\_ /\__, `\  \ \ \\`\             /\ \/\ \/\ \ /\ \L\.\_ /\ \/\ \ /\ \L\.\_ /\ \L\ \  /\  __/ \ \ \/
     \ \_\\ \__/.\_\\/\____/   \ \_\ \_\           \ \_\ \_\ \_\\ \__/.\_\\ \_\ \_\\ \__/.\_\\ \____ \ \ \____\ \ \_\
      \/_/ \/__/\/_/ \/___/     \/_/\/_/            \/_/\/_/\/_/ \/__/\/_/ \/_/\/_/ \/__/\/_/ \/___L\ \ \/____/  \/_/
                                                                                                /\____/
                                                                                                \_/__/
