{
  "project_info": {
    "project_number": "114714691845",
    "firebase_url": "https://fir-diabetespartner.firebaseio.com",
    "project_id": "firebase-diabetespartner",
    "storage_bucket": "firebase-diabetespartner.appspot.com"
  },
  "client": [
    {
      "client_info": {
        "mobilesdk_app_id": "1:114714691845:android:f515e39676b6dbf2",
        "android_client_info": {
          "package_name": "com.diabetespartner.application"
        }
      },
      "oauth_client": [
        {
          "client_id": "114714691845-icccht2aojftflb4g842of2mnasj245f.apps.googleusercontent.com",
          "client_type": 3
        },
        {
          "client_id": "114714691845-l1kn1epuoc018hqfrhh7tv7emrln8l23.apps.googleusercontent.com",
          "client_type": 1,
          "android_info": {
            "package_name": "com.diabetespartner.application",
            "certificate_hash": "2157acb6857e3067c124cbf23db60b2c7df4d57c"
          }
        },
        {
          "client_id": "114714691845-2d635kg93sdo8t0hn09l6q63851c3kp8.apps.googleusercontent.com",
          "client_type": 3
        }
      ],
      "api_key": [
        {
          "current_key": "AIzaSyCpjyWE_ZbyaB_KQIdwf5XNivmyD3I8-d0"
        }
      ],
      "services": {
        "analytics_service": {
          "status": 2,
          "analytics_property": {
            "tracking_id": "UA-108447224-1"
          }
        },
        "appinvite_service": {
          "status": 2,
          "other_platform_oauth_client": [
            {
              "client_id": "114714691845-icccht2aojftflb4g842of2mnasj245f.apps.googleusercontent.com",
              "client_type": 3
            }
          ]
        },
        "ads_service": {
          "status": 2
        }
      }
    }
  ],
  "configuration_version": "1"
}