21:624  14:146  Found UEFI Acpi 2.0 RSDP at 9FFFD014
21:624  0:000  Saving ACPI tables from RSDP 9FFFD014 to EFI\CLOVER\ACPI\origin ...
21:624  0:000   9FFFD014: 'RSD PTR ', Rev: 2 (Acpi 2.0 or newer), Len: 36 -> RSDP.aml
24:122  2:498    (Xsdt: 9FFC0188, Rsdt: 9FFC00C4)
24:122  0:000    9FFC0188: 'XSDT', 'TP-R0P', Rev: 1, Len: 260 -> XSDT.aml
25:810  1:687    9FFC00C4: 'RSDT', 'TP-R0P', Rev: 1, Len: 148 -> RSDT.aml
26:717  0:907    Tables in Xsdt: 28
26:717  0:000    0. 9FFF3000: 'FACP', 'TP-R0P', Rev: 5, Len: 244 -> FACP.aml
28:427  1:709        (Dsdt: 9FFCD000, Facs: 9FF3C000, XDsdt: 9FFCD000, XFacs: 0)
28:427  0:000        9FFCD000: 'DSDT', 'SKL', Rev: 2, Len: 137613 -> DSDT.aml
29:329  0:901        9FF3C000: 'FACS', Ver: 2, Len: 64 -> FACS.aml
30:201  0:871    1. 9FFFB000: 'SSDT', 'Tpm2Tabl', Rev: 2, Len: 1219 -> SSDT-0-Tpm2Tabl.aml
31:087  0:886    2. 9FFFA000: 'SSDT', 'MeSsdt', Rev: 2, Len: 70 -> SSDT-1-MeSsdt.aml
32:779  1:692    3. 9FFF9000: 'TPM2', 'TP-R0P', Rev: 4, Len: 52 -> TPM2.aml
34:490  1:711    4. 9FF52000: 'UEFI', 'TP-R0P', Rev: 1, Len: 66 -> UEFI.aml
35:345  0:855    5. 9FFF5000: 'SSDT', 'SaSsdt', Rev: 2, Len: 12868 -> SSDT-2-SaSsdt.aml
37:042  1:696    6. 9FFF4000: 'SSDT', 'PerfTune', Rev: 2, Len: 1478 -> SSDT-3-PerfTune.aml
37:888  0:845    7. 9FFF2000: 'HPET', 'TP-R0P', Rev: 1, Len: 56 -> HPET.aml
38:769  0:880    8. 9FFF1000: 'APIC', 'TP-R0P', Rev: 3, Len: 300 -> APIC.aml
40:432  1:663    9. 9FFF0000: 'MCFG', 'TP-R0P', Rev: 1, Len: 60 -> MCFG.aml
42:095  1:662    10. 9FFEF000: 'ECDT', 'TP-R0P', Rev: 1, Len: 83 -> ECDT.aml
42:962  0:866    11. 9FFCB000: 'SSDT', 'ProjSsdt', Rev: 2, Len: 5804 -> SSDT-4-ProjSsdt.aml
44:650  1:688    12. 9FFCA000: 'BOOT', 'TP-R0P', Rev: 1, Len: 40 -> BOOT.aml
45:543  0:893    13. 9FFC9000: 'BATB', 'TP-R0P', Rev: 2, Len: 74 -> BATB.aml
46:394  0:851    14. 9FFC8000: 'SLIC', 'TP-R0P', Rev: 1, Len: 374 -> SLIC.aml
48:083  1:688    15. 9FFC6000: 'SSDT', 'CpuSsdt', Rev: 2, Len: 6062 -> SSDT-5-CpuSsdt.aml (Found hidden SSDT 7 pcs)
48:962  0:878        * 9FF17098: 'SSDT', 'Cpu0Ist', Rev: 2, Len: 1615  53 53 44 54 4F 06 00 00 02 7B 50 6D 52 65 66 00 Internal length = 1615 -> SSDT-x5_0-Cpu0Ist.aml
49:846  0:884        * 9FEAE018: 'SSDT', 'ApIst', Rev: 2, Len: 3348  53 53 44 54 14 0D 00 00 02 2A 50 6D 52 65 66 00 Internal length = 3348 -> SSDT-x5_1-ApIst.aml
51:513  1:666        * 9FEAD018: 'SSDT', 'Cpu0Cst', Rev: 2, Len: 1023  53 53 44 54 FF 03 00 00 02 11 50 6D 52 65 66 00 Internal length = 1023 -> SSDT-x5_2-Cpu0Cst.aml
54:009  2:496        * 9FF17718: 'SSDT', 'ApCst', Rev: 2, Len: 778  53 53 44 54 0A 03 00 00 02 93 50 6D 52 65 66 00 Internal length = 778 -> SSDT-x5_3-ApCst.aml
55:689  1:679        * 99D39F18: 'SSDT', 'Cpu0Hwp', Rev: 2, Len: 186  53 53 44 54 BA 00 00 00 02 7D 50 6D 52 65 66 00 Internal length = 186 -> SSDT-x5_4-Cpu0Hwp.aml
57:407  1:718        * 99D64418: 'SSDT', 'ApHwp', Rev: 2, Len: 791  53 53 44 54 17 03 00 00 02 80 50 6D 52 65 66 00 Internal length = 791 -> SSDT-x5_5-ApHwp.aml
58:267  0:860        * 99D34018: 'SSDT', 'HwpLvt', Rev: 2, Len: 1576  53 53 44 54 28 06 00 00 02 85 50 6D 52 65 66 00 Internal length = 1576 -> SSDT-x5_6-HwpLvt.aml
59:953  1:685  
59:953  0:000    16. 9FFC5000: 'SSDT', 'CtdpB', Rev: 2, Len: 1389 -> SSDT-6-CtdpB.aml
60:812  0:858    17. 9FFC4000: 'SSDT', 'UsbCTabl', Rev: 2, Len: 1608 -> SSDT-7-UsbCTabl.aml
61:685  0:872    18. 9FFC3000: 'DBGP', 'TP-R0P', Rev: 1, Len: 52 -> DBGP.aml
63:366  1:681    19. 9FFC2000: 'DBG2', 'TP-R0P', Rev: 0, Len: 84 -> DBG2.aml
65:019  1:652    20. 9FFC1000: 'MSDM', 'TP-R0P', Rev: 3, Len: 85 -> MSDM.aml
65:916  0:897    21. 9FFFC000: 'SSDT', 'AmdTabl', Rev: 1, Len: 1476 -> SSDT-8-AmdTabl.aml
67:598  1:682    22. 9FFBF000: 'SSDT', 'SgPch', Rev: 2, Len: 1453 -> SSDT-9-SgPch.aml
69:290  1:691    23. 9FFBE000: 'SSDT', 'SgUlx', Rev: 2, Len: 849 -> SSDT-10-SgUlx.aml
70:142  0:852    24. 9FFBD000: 'ASF!', 'TP-R0P', Rev: 32, Len: 160 -> ASF!.aml
71:833  1:691    25. 9FFBC000: 'FPDT', 'TP-R0P', Rev: 1, Len: 68 -> FPDT.aml
72:694  0:861    26. 9FF28000: 'UEFI', 'TP-R0P', Rev: 1, Len: 318 -> UEFI.aml
75:239  2:544    27. 9FFBB000: 'BGRT', 'TP-R0P', Rev: 1, Len: 56 -> BGRT.aml
76:101  0:861    Tables in Rsdt: 28
76:101  0:000    0. 9FFF3000: 'FACP', 'TP-R0P', Rev: 5, Len: 244
76:101  0:000        (Dsdt: 9FFCD000, Facs: 9FF3C000, XDsdt: 9FFCD000, XFacs: 0)
76:101  0:000        9FFCD000: 'DSDT', 'SKL', Rev: 2, Len: 137613
76:105  0:004        9FF3C000: 'FACS', Ver: 2, Len: 64
76:105  0:000    1. 9FFFB000: 'SSDT', 'Tpm2Tabl', Rev: 2, Len: 1219
76:105  0:000    2. 9FFFA000: 'SSDT', 'MeSsdt', Rev: 2, Len: 70
76:105  0:000    3. 9FFF9000: 'TPM2', 'TP-R0P', Rev: 4, Len: 52
76:105  0:000    4. 9FF52000: 'UEFI', 'TP-R0P', Rev: 1, Len: 66
76:105  0:000    5. 9FFF5000: 'SSDT', 'SaSsdt', Rev: 2, Len: 12868
76:105  0:000    6. 9FFF4000: 'SSDT', 'PerfTune', Rev: 2, Len: 1478
76:105  0:000    7. 9FFF2000: 'HPET', 'TP-R0P', Rev: 1, Len: 56
76:105  0:000    8. 9FFF1000: 'APIC', 'TP-R0P', Rev: 3, Len: 300
76:105  0:000    9. 9FFF0000: 'MCFG', 'TP-R0P', Rev: 1, Len: 60
76:105  0:000    10. 9FFEF000: 'ECDT', 'TP-R0P', Rev: 1, Len: 83
76:105  0:000    11. 9FFCB000: 'SSDT', 'ProjSsdt', Rev: 2, Len: 5804
76:105  0:000    12. 9FFCA000: 'BOOT', 'TP-R0P', Rev: 1, Len: 40
76:105  0:000    13. 9FFC9000: 'BATB', 'TP-R0P', Rev: 2, Len: 74
76:105  0:000    14. 9FFC8000: 'SLIC', 'TP-R0P', Rev: 1, Len: 374
76:105  0:000    15. 9FFC6000: 'SSDT', 'CpuSsdt', Rev: 2, Len: 6062
76:105  0:000    16. 9FFC5000: 'SSDT', 'CtdpB', Rev: 2, Len: 1389
76:105  0:000    17. 9FFC4000: 'SSDT', 'UsbCTabl', Rev: 2, Len: 1608
76:105  0:000    18. 9FFC3000: 'DBGP', 'TP-R0P', Rev: 1, Len: 52
76:105  0:000    19. 9FFC2000: 'DBG2', 'TP-R0P', Rev: 0, Len: 84
76:105  0:000    20. 9FFC1000: 'MSDM', 'TP-R0P', Rev: 3, Len: 85
76:105  0:000    21. 9FFFC000: 'SSDT', 'AmdTabl', Rev: 1, Len: 1476
76:105  0:000    22. 9FFBF000: 'SSDT', 'SgPch', Rev: 2, Len: 1453
76:105  0:000    23. 9FFBE000: 'SSDT', 'SgUlx', Rev: 2, Len: 849
76:105  0:000    24. 9FFBD000: 'ASF!', 'TP-R0P', Rev: 32, Len: 160
76:105  0:000    25. 9FFBC000: 'FPDT', 'TP-R0P', Rev: 1, Len: 68
76:105  0:000    26. 9FF28000: 'UEFI', 'TP-R0P', Rev: 1, Len: 318
76:105  0:000    27. 9FFBB000: 'BGRT', 'TP-R0P', Rev: 1, Len: 56
76:105  0:000  Found UEFI Acpi 1.0 RSDP at 9FFFD000
76:105  0:000  Printing ACPI tables from RSDP 9FFFD000 ...
76:105  0:000   9FFFD000: 'RSD PTR ', Rev: 0 (Acpi 1.0), Len: 20
76:105  0:000    (Rsdt: 9FFC0000)
76:105  0:000    9FFC0000: 'RSDT', 'TP-R0P', Rev: 1, Len: 144
76:105  0:000    Tables in Rsdt: 27
76:105  0:000    0. 9FFF3000: 'FACP', 'TP-R0P', Rev: 5, Len: 244
76:105  0:000        (Dsdt: 9FFCD000, Facs: 9FF3C000, XDsdt: 9FFCD000, XFacs: 0)
76:105  0:000        9FFCD000: 'DSDT', 'SKL', Rev: 2, Len: 137613
76:110  0:004        9FF3C000: 'FACS', Ver: 2, Len: 64
76:110  0:000    1. 9FFFB000: 'SSDT', 'Tpm2Tabl', Rev: 2, Len: 1219
76:110  0:000    2. 9FFFA000: 'SSDT', 'MeSsdt', Rev: 2, Len: 70
76:110  0:000    3. 9FFF9000: 'TPM2', 'TP-R0P', Rev: 4, Len: 52
76:110  0:000    4. 9FF52000: 'UEFI', 'TP-R0P', Rev: 1, Len: 66
76:110  0:000    5. 9FFF5000: 'SSDT', 'SaSsdt', Rev: 2, Len: 12868
76:110  0:000    6. 9FFF4000: 'SSDT', 'PerfTune', Rev: 2, Len: 1478
76:110  0:000    7. 9FFF2000: 'HPET', 'TP-R0P', Rev: 1, Len: 56
76:110  0:000    8. 9FFF1000: 'APIC', 'TP-R0P', Rev: 3, Len: 300
76:110  0:000    9. 9FFF0000: 'MCFG', 'TP-R0P', Rev: 1, Len: 60
76:110  0:000    10. 9FFEF000: 'ECDT', 'TP-R0P', Rev: 1, Len: 83
76:110  0:000    11. 9FFCB000: 'SSDT', 'ProjSsdt', Rev: 2, Len: 5804
76:110  0:000    12. 9FFCA000: 'BOOT', 'TP-R0P', Rev: 1, Len: 40
76:110  0:000    13. 9FFC9000: 'BATB', 'TP-R0P', Rev: 2, Len: 74
76:110  0:000    14. 9FFC6000: 'SSDT', 'CpuSsdt', Rev: 2, Len: 6062
76:110  0:000    15. 9FFC5000: 'SSDT', 'CtdpB', Rev: 2, Len: 1389
76:110  0:000    16. 9FFC4000: 'SSDT', 'UsbCTabl', Rev: 2, Len: 1608
76:110  0:000    17. 9FFC3000: 'DBGP', 'TP-R0P', Rev: 1, Len: 52
76:110  0:000    18. 9FFC2000: 'DBG2', 'TP-R0P', Rev: 0, Len: 84
76:110  0:000    19. 9FFC1000: 'MSDM', 'TP-R0P', Rev: 3, Len: 85
76:110  0:000    20. 9FFFC000: 'SSDT', 'AmdTabl', Rev: 1, Len: 1476
76:110  0:000    21. 9FFBF000: 'SSDT', 'SgPch', Rev: 2, Len: 1453
76:110  0:000    22. 9FFBE000: 'SSDT', 'SgUlx', Rev: 2, Len: 849
76:110  0:000    23. 9FFBD000: 'ASF!', 'TP-R0P', Rev: 32, Len: 160
76:110  0:000    24. 9FFBC000: 'FPDT', 'TP-R0P', Rev: 1, Len: 68
76:110  0:000    25. 9FF28000: 'UEFI', 'TP-R0P', Rev: 1, Len: 318
76:110  0:000    26. 9FFBB000: 'BGRT', 'TP-R0P', Rev: 1, Len: 56
