 [{
    "full_name": "Terry Evans",
    "address": "Potato street, 4",
    "cups": "123456",
    "role": "customer",
    "building_type": "house"
  },
  {
    "full_name": "Glenda Gilbert",
    "address": "Potato street, 9",
    "cups": "234567",
    "role": "customer-basic",
    "building_type": "house"
  },
  {
    "full_name": "Phillip Lee",
    "address": "Potato street, 7",
    "cups": "345678",
    "role": "customer-premium",
    "building_type": "apartment"
  },
  {
    "full_name": "Cecil Grant",
    "address": "Sweet potato street, 2",
    "cups": "321654",
    "role": "customer-basic",
    "building_type": "house"
  },
  {
    "full_name": "Clinton Horton",
    "address": "Swede street, 5",
    "cups": "456123",
    "role": "customer",
    "building_type": "apartment"
  },
  {
    "full_name": "Steven Walters",
    "address": "Swede street, 7",
    "cups": "111222",
    "role": "customer",
    "building_type": "house"
  }
]