module project

go 1.18

require (
	contrib.go.opencensus.io/integrations/ocsql v0.1.7
	github.com/aws/aws-sdk-go-v2/config v1.25.5
	github.com/aws/aws-sdk-go-v2/feature/dynamodb/attributevalue v1.12.10
	github.com/aws/aws-sdk-go-v2/service/dynamodb v1.26.4
	github.com/go-sql-driver/mysql v1.6.0
	github.com/jmoiron/sqlx v1.3.5
)

require (
	github.com/aws/aws-sdk-go-v2/service/dynamodbstreams v1.18.3 // indirect
	github.com/aws/aws-sdk-go-v2/service/internal/endpoint-discovery v1.8.9 // indirect
	github.com/aws/aws-sdk-go-v2/service/sso v1.17.3 // indirect
	github.com/golang/groupcache v0.0.0-20200121045136-8c9f03a8e57e // indirect
	github.com/jmespath/go-jmespath v0.4.0 // indirect
	go.opencensus.io v0.24.0 // indirect
)

require (
	github.com/aws/aws-sdk-go-v2 v1.23.5
	github.com/aws/aws-sdk-go-v2/credentials v1.16.4 // indirect
	github.com/aws/aws-sdk-go-v2/feature/ec2/imds v1.14.5 // indirect
	github.com/aws/aws-sdk-go-v2/internal/configsources v1.2.8 // indirect
	github.com/aws/aws-sdk-go-v2/internal/endpoints/v2 v2.5.8 // indirect
	github.com/aws/aws-sdk-go-v2/internal/ini v1.7.1 // indirect
	github.com/aws/aws-sdk-go-v2/service/internal/accept-encoding v1.10.3 // indirect
	github.com/aws/aws-sdk-go-v2/service/internal/presigned-url v1.10.4 // indirect
	//github.com/aws/aws-sdk-go-v2/service/sso v1.17.3 // indirect
	github.com/aws/aws-sdk-go-v2/service/ssooidc v1.20.1 // indirect
	github.com/aws/aws-sdk-go-v2/service/sts v1.25.4 // indirect
	github.com/aws/smithy-go v1.18.1 // indirect
)
