layers_number;neurons_per_layer;dropout_rates;weight_regularization;weight_penalit;train_loss;train_rmsle;validation_loss;validation_rmsle;train_eval_time
3;64 32 16;0.1;l1;0.01;0.5372169613838196;0.17926320433616638;0.5287014245986938;0.17798130214214325;354
3;64 32 16;0.1;l2;0.01;0.47115904092788696;0.1664886325597763;0.4634663164615631;0.16524140536785126;349
3;64 32 16;0.1;l3;0.01;0.5401514172554016;0.18105192482471466;0.5319850444793701;0.17981867492198944;377
3;64 32 16;0.1;l1;0.001;0.4945527911186218;0.17040203511714935;0.48636308312416077;0.16913899779319763;377
3;64 32 16;0.1;l2;0.001;0.4303635358810425;0.16000664234161377;0.42356076836586;0.15889249742031097;375
3;64 32 16;0.1;l3;0.001;0.5165204405784607;0.17742204666137695;0.5091176629066467;0.17630130052566528;365
3;64 32 16;0.2;l1;0.01;0.5497845411300659;0.1813553273677826;0.5409911870956421;0.18003186583518982;348
3;64 32 16;0.2;l2;0.01;0.48553645610809326;0.16893136501312256;0.4780886471271515;0.16775523126125336;347
3;64 32 16;0.2;l3;0.01;0.5656065940856934;0.18570400774478912;0.5566456317901611;0.18436291813850403;358
3;64 32 16;0.2;l1;0.001;0.5046429634094238;0.17345388233661652;0.4970380663871765;0.17229826748371124;349
3;64 32 16;0.2;l2;0.001;0.4429726004600525;0.1625743806362152;0.43629369139671326;0.161499485373497;349
3;64 32 16;0.2;l3;0.001;0.5156740546226501;0.17640282213687897;0.5083202719688416;0.1752827912569046;360
3;64 32 16;0.3;l1;0.01;0.5654013752937317;0.18579509854316711;0.5564597845077515;0.18445509672164917;415
3;64 32 16;0.3;l2;0.01;0.4947848320007324;0.17273469269275665;0.48816901445388794;0.17170007526874542;394
3;64 32 16;0.3;l3;0.01;0.5656397938728333;0.1855994313955307;0.5566603541374207;0.18425506353378296;387
3;64 32 16;0.3;l1;0.001;0.5135949850082397;0.17501135170459747;0.5058972835540771;0.17385128140449524;391
3;64 32 16;0.3;l2;0.001;0.4620530605316162;0.16577649116516113;0.4544490575790405;0.16454312205314636;386
3;64 32 16;0.3;l3;0.001;0.5188418626785278;0.17516879737377167;0.5105059146881104;0.1739046573638916;399
3;256 128 64;0.1;l1;0.01;0.5824490189552307;0.17937859892845154;0.5738433599472046;0.17807894945144653;404
3;256 128 64;0.1;l2;0.01;0.48919877409935;0.1668815165758133;0.48107069730758667;0.1656002551317215;375
3;256 128 64;0.1;l3;0.01;0.5861987471580505;0.1793617457151413;0.5775690078735352;0.17806367576122284;368
3;256 128 64;0.1;l1;0.001;0.4977684020996094;0.1705942004919052;0.4900522828102112;0.16938477754592896;355
3;256 128 64;0.1;l2;0.001;0.4253251254558563;0.15803976356983185;0.41821348667144775;0.156881645321846;385
3;256 128 64;0.1;l3;0.001;0.5121341347694397;0.17319060862064362;0.5043211579322815;0.1720062792301178;390
3;256 128 64;0.2;l1;0.01;0.6098214983940125;0.18563610315322876;0.6008472442626953;0.18429164588451385;353
3;256 128 64;0.2;l2;0.01;0.4876653552055359;0.1703980416059494;0.4807586371898651;0.16932906210422516;352
3;256 128 64;0.2;l3;0.01;0.6115555167198181;0.18570517003536224;0.6025953888893127;0.18436405062675476;374
3;256 128 64;0.2;l1;0.001;0.5134848356246948;0.17409920692443848;0.5052990317344666;0.17285893857479095;399
3;256 128 64;0.2;l2;0.001;0.43757176399230957;0.16080068051815033;0.4308272898197174;0.1597333550453186;451
3;256 128 64;0.2;l3;0.001;0.5233969688415527;0.1746533364057541;0.514916181564331;0.17336755990982056;403
3;256 128 64;0.3;l1;0.01;0.6097297072410583;0.18577367067337036;0.6007832884788513;0.18443238735198975;361
3;256 128 64;0.3;l2;0.01;0.49198228120803833;0.1692867875099182;0.4844045639038086;0.16810621321201324;385
3;256 128 64;0.3;l3;0.01;0.6111082434654236;0.1857401579618454;0.6021553874015808;0.18439874053001404;404
3;256 128 64;0.3;l1;0.001;0.5171590447425842;0.17425154149532318;0.5091990232467651;0.1730409413576126;383
3;256 128 64;0.3;l2;0.001;0.4541008472442627;0.16239266097545624;0.44676992297172546;0.16123002767562866;373
3;256 128 64;0.3;l3;0.001;0.5335737466812134;0.17921550571918488;0.5256413817405701;0.1780223250389099;382
