{
"port": 5000,
  "jwtSecret": "!KaraBaraBum!",
  "mongoUri": "mongodb+srv://dbUzver:123456789qwe123ASD@cluster0.dtsmw.mongodb.net/app?retryWrites=true&w=majority",
  "baseUrl": "http://localhost:5000"
}