\relax 
\providecommand\hyper@newdestlabel[2]{}
\providecommand\babel@aux[2]{}
\@nameuse{bbl@beforestart}
\catcode `"\active 
\catcode `<\active 
\catcode `>\active 
\@nameuse{es@quoting}
\providecommand\HyperFirstAtBeginDocument{\AtBeginDocument}
\HyperFirstAtBeginDocument{\ifx\hyper@anchor\@undefined
\global\let\oldcontentsline\contentsline
\gdef\contentsline#1#2#3#4{\oldcontentsline{#1}{#2}{#3}}
\global\let\oldnewlabel\newlabel
\gdef\newlabel#1#2{\newlabelxx{#1}#2}
\gdef\newlabelxx#1#2#3#4#5#6{\oldnewlabel{#1}{{#2}{#3}}}
\AtEndDocument{\ifx\hyper@anchor\@undefined
\let\contentsline\oldcontentsline
\let\newlabel\oldnewlabel
\fi}
\fi}
\global\let\hyper@last\relax 
\gdef\HyperFirstAtBeginDocument#1{#1}
\providecommand\HyField@AuxAddToFields[1]{}
\providecommand\HyField@AuxAddToCoFields[2]{}
\babel@aux{spanish}{}
\gdef \LT@i {\LT@entry 
    {1}{447.50499pt}}
\@writefile{toc}{\contentsline {chapter}{\numberline {1}Introducción}{1}{chapter.1}\protected@file@percent }
\@writefile{lof}{\addvspace {10\p@ }}
\@writefile{lot}{\addvspace {10\p@ }}
\newlabel{ch:introduccion}{{1}{1}{Introducción}{chapter.1}{}}
\@writefile{toc}{\contentsline {section}{\numberline {1.1}Intención del documento}{1}{section.1.1}\protected@file@percent }
\@writefile{toc}{\contentsline {section}{\numberline {1.2}Estructura del documento}{1}{section.1.2}\protected@file@percent }
\@writefile{toc}{\contentsline {chapter}{\numberline {2}Nomenclatura}{3}{chapter.2}\protected@file@percent }
\@writefile{lof}{\addvspace {10\p@ }}
\@writefile{lot}{\addvspace {10\p@ }}
\newlabel{ch:nomenclatura}{{2}{3}{Nomenclatura}{chapter.2}{}}
\@writefile{toc}{\contentsline {section}{\numberline {2.1}Modelado del negocio}{3}{section.2.1}\protected@file@percent }
\@writefile{toc}{\contentsline {subsection}{\numberline {2.1.1}Modelado de procesos}{3}{subsection.2.1.1}\protected@file@percent }
\@writefile{toc}{\contentsline {subsection}{\numberline {2.1.2}Modelado de ciclos de vida de entidades}{3}{subsection.2.1.2}\protected@file@percent }
\@writefile{toc}{\contentsline {subsection}{\numberline {2.1.3}Modelado de reglas de negocio}{3}{subsection.2.1.3}\protected@file@percent }
\@writefile{toc}{\contentsline {subsection}{\numberline {2.1.4}Modelado de actores}{4}{subsection.2.1.4}\protected@file@percent }
\@writefile{toc}{\contentsline {section}{\numberline {2.2}Modelado de casos de uso}{4}{section.2.2}\protected@file@percent }
\@writefile{toc}{\contentsline {subsection}{\numberline {2.2.1}Descripción de casos de uso}{5}{subsection.2.2.1}\protected@file@percent }
\@writefile{toc}{\contentsline {section}{\numberline {2.3}Modelado de mensajes}{5}{section.2.3}\protected@file@percent }
\@writefile{toc}{\contentsline {part}{I\hspace  {1em}Modelado del negocio}{7}{part.1}\protected@file@percent }
\newlabel{ch:modeloNegocio}{{2.3}{9}{Modelado de mensajes}{part.1}{}}
\@writefile{toc}{\contentsline {chapter}{\numberline {3}Modelo de estados}{9}{chapter.3}\protected@file@percent }
\@writefile{lof}{\addvspace {10\p@ }}
\@writefile{lot}{\addvspace {10\p@ }}
\newlabel{ch:estados}{{3}{9}{Modelo de estados}{chapter.3}{}}
\@writefile{toc}{\contentsline {section}{\numberline {3.1}Modelo del ciclo de vida de la pregunta}{9}{section.3.1}\protected@file@percent }
\@writefile{toc}{\contentsline {subsection}{\numberline {3.1.1}Resumen}{9}{subsection.3.1.1}\protected@file@percent }
\@writefile{toc}{\contentsline {subsection}{\numberline {3.1.2}Descripción}{9}{subsection.3.1.2}\protected@file@percent }
\@writefile{lof}{\contentsline {figure}{\numberline {3.1}{\ignorespaces Modelo del ciclo de vida de la pregunta}}{10}{figure.3.1}\protected@file@percent }
\newlabel{fig:mq:pregunta}{{3.1}{10}{Modelo del ciclo de vida de la pregunta}{figure.3.1}{}}
\@writefile{toc}{\contentsline {section}{\numberline {3.2}Modelo del ciclo de vida del cuestionario de contexto}{11}{section.3.2}\protected@file@percent }
\@writefile{toc}{\contentsline {subsection}{\numberline {3.2.1}Resumen}{11}{subsection.3.2.1}\protected@file@percent }
\@writefile{lof}{\contentsline {figure}{\numberline {3.2}{\ignorespaces Modelo del ciclo de vida del cuestionario de contexto}}{11}{figure.3.2}\protected@file@percent }
\newlabel{fig:mq:cuestionarioContexto}{{3.2}{11}{Modelo del ciclo de vida del cuestionario de contexto}{figure.3.2}{}}
\@writefile{toc}{\contentsline {subsection}{\numberline {3.2.2}Descripción}{11}{subsection.3.2.2}\protected@file@percent }
\@writefile{toc}{\contentsline {chapter}{\numberline {4}Reglas de negocio}{17}{chapter.4}\protected@file@percent }
\@writefile{lof}{\addvspace {10\p@ }}
\@writefile{lot}{\addvspace {10\p@ }}
\newlabel{ch:reglas}{{4}{17}{Reglas de negocio}{chapter.4}{}}
\@writefile{toc}{\contentsline {section}{\numberline {4.1}Reglas de Negocio}{17}{section.4.1}\protected@file@percent }
\@writefile{toc}{\contentsline {subsection}{\numberline {4.1.1}{RN-N001} {Credenciales válidas para ingresar al sistema}}{17}{subsection.4.1.1}\protected@file@percent }
\@writefile{toc}{\contentsline {subsection}{\numberline {4.1.2}{RN-N002} {Realizar acción en una entidad asociada con otros elementos}}{18}{subsection.4.1.2}\protected@file@percent }
\@writefile{toc}{\contentsline {subsection}{\numberline {4.1.3}{RN-N003} {Unicidad de elementos registrados}}{18}{subsection.4.1.3}\protected@file@percent }
\@writefile{toc}{\contentsline {subsection}{\numberline {4.1.4}{RN-N004} {Rangos válidos para realizar una acción}}{19}{subsection.4.1.4}\protected@file@percent }
\@writefile{toc}{\contentsline {subsection}{\numberline {4.1.5}{RN-N005} {Fecha de inicio mayor o igual que la fecha actual}}{20}{subsection.4.1.5}\protected@file@percent }
\@writefile{toc}{\contentsline {subsection}{\numberline {4.1.6}{RN-N006} {Fecha de fin mayor o igual que la fecha de inicio.}}{20}{subsection.4.1.6}\protected@file@percent }
\@writefile{toc}{\contentsline {subsection}{\numberline {4.1.7}{RN-N007} {Elementos mínimos necesarios}}{21}{subsection.4.1.7}\protected@file@percent }
\@writefile{toc}{\contentsline {subsection}{\numberline {4.1.8}{RN-N008} {Permisos necesarios para realizar una acción en el sistema}}{21}{subsection.4.1.8}\protected@file@percent }
\@writefile{toc}{\contentsline {subsection}{\numberline {4.1.9}{RN-N009} {Relación de valores correcta}}{22}{subsection.4.1.9}\protected@file@percent }
\@writefile{toc}{\contentsline {subsection}{\numberline {4.1.10}{RN-N010} {Formato válido para un campo de texto numérico}}{23}{subsection.4.1.10}\protected@file@percent }
\@writefile{toc}{\contentsline {subsection}{\numberline {4.1.11}{RN-N011} {Formato válido para una fecha}}{23}{subsection.4.1.11}\protected@file@percent }
\@writefile{toc}{\contentsline {subsection}{\numberline {4.1.12}{RN-N012} {Formato válido para un correo electrónico}}{24}{subsection.4.1.12}\protected@file@percent }
\@writefile{toc}{\contentsline {subsection}{\numberline {4.1.13}{RN-N013} {Formato válido para la CURP}}{24}{subsection.4.1.13}\protected@file@percent }
\@writefile{toc}{\contentsline {subsection}{\numberline {4.1.14}{RN-N014} {Formato válido para una expresión regular}}{25}{subsection.4.1.14}\protected@file@percent }
\@writefile{toc}{\contentsline {subsection}{\numberline {4.1.15}{RN-N015} {Generar nombre de una entidad clonada}}{26}{subsection.4.1.15}\protected@file@percent }
\@writefile{toc}{\contentsline {subsection}{\numberline {4.1.16}{RN-N016} {Registrar histórico de la pregunta}}{27}{subsection.4.1.16}\protected@file@percent }
\@writefile{toc}{\contentsline {subsection}{\numberline {4.1.17}{RN-N018} {Tipos de preguntas que pueden condicionarse}}{27}{subsection.4.1.17}\protected@file@percent }
\@writefile{toc}{\contentsline {subsection}{\numberline {4.1.18}{RN-N026} {Formato y resolución de imágenes}}{29}{subsection.4.1.18}\protected@file@percent }
\@writefile{toc}{\contentsline {chapter}{\numberline {5}Reglas del sistema}{31}{chapter.5}\protected@file@percent }
\@writefile{lof}{\addvspace {10\p@ }}
\@writefile{lot}{\addvspace {10\p@ }}
\newlabel{ch:reglas_sistema}{{5}{31}{Reglas del sistema}{chapter.5}{}}
\@writefile{toc}{\contentsline {section}{\numberline {5.1}Reglas del Sistema}{31}{section.5.1}\protected@file@percent }
\@writefile{toc}{\contentsline {subsection}{\numberline {5.1.1}{RN-S001} {Máquina de estados}}{31}{subsection.5.1.1}\protected@file@percent }
\@writefile{toc}{\contentsline {subsection}{\numberline {5.1.2}{RN-S002} {Campos obligatorios}}{32}{subsection.5.1.2}\protected@file@percent }
\@writefile{toc}{\contentsline {subsection}{\numberline {5.1.3}{RN-S003} {Formato de archivo}}{33}{subsection.5.1.3}\protected@file@percent }
\@writefile{toc}{\contentsline {subsection}{\numberline {5.1.4}{RN-S004} {Elementos registrados en el sistema}}{34}{subsection.5.1.4}\protected@file@percent }
\@writefile{toc}{\contentsline {chapter}{\numberline {6}Modelo de actores}{35}{chapter.6}\protected@file@percent }
\@writefile{lof}{\addvspace {10\p@ }}
\@writefile{lot}{\addvspace {10\p@ }}
\newlabel{ch:actores}{{6}{35}{Modelo de actores}{chapter.6}{}}
\newlabel{chapter:ActoresDelSistema}{{6}{35}{Modelo de actores}{chapter.6}{}}
\@writefile{toc}{\contentsline {section}{\numberline {6.1}Actor Elaborador senior}{35}{section.6.1}\protected@file@percent }
\@writefile{toc}{\contentsline {section}{\numberline {6.2}Actor Elaborador junior}{36}{section.6.2}\protected@file@percent }
\@writefile{toc}{\contentsline {section}{\numberline {6.3}Actor Revisor de contenido}{37}{section.6.3}\protected@file@percent }
\@writefile{toc}{\contentsline {section}{\numberline {6.4}Actor Revisor de estilo}{38}{section.6.4}\protected@file@percent }
\@writefile{toc}{\contentsline {section}{\numberline {6.5}Actor Elaborador auxiliar}{38}{section.6.5}\protected@file@percent }
\@writefile{toc}{\contentsline {section}{\numberline {6.6}Actor Administrador de actores}{39}{section.6.6}\protected@file@percent }
\@writefile{toc}{\contentsline {part}{II\hspace  {1em}Modelado de Comportamiento}{41}{part.2}\protected@file@percent }
\newlabel{ch:modeloComportamiento}{{6}{43}{Modelo de actores}{part.2}{}}
\@writefile{toc}{\contentsline {chapter}{\numberline {7}Módulo de Cuestionarios de Contexto}{43}{chapter.7}\protected@file@percent }
\@writefile{lof}{\addvspace {10\p@ }}
\@writefile{lot}{\addvspace {10\p@ }}
\newlabel{ch:CUmoduloCuestionarioContexto}{{7}{43}{Módulo de Cuestionarios de Contexto}{chapter.7}{}}
\gdef \LT@ii {\LT@entry 
    {1}{88.2075pt}\LT@entry 
    {1}{345.08385pt}}
\@writefile{toc}{\contentsline {section}{\numberline {7.1}CC-CT-CU1 Gestionar cuestionarios de contexto}{44}{section.7.1}\protected@file@percent }
\@writefile{toc}{\contentsline {subsection}{\numberline {7.1.1}Resumen}{44}{subsection.7.1.1}\protected@file@percent }
\@writefile{toc}{\contentsline {subsection}{\numberline {7.1.2}Descripción}{44}{subsection.7.1.2}\protected@file@percent }
\@writefile{toc}{\contentsline {subsection}{\numberline {7.1.3}Trayectorias del Caso de Uso}{44}{subsection.7.1.3}\protected@file@percent }
\newlabel{CC-CT-CU1:Obtener}{{2}{44}{Trayectorias del Caso de Uso}{Item.5}{}}
\newlabel{CC-CT-CU1:Selecciona}{{4}{44}{Trayectorias del Caso de Uso}{Item.7}{}}
\newlabel{CC-CT-CU1:Buscar}{{5}{44}{Trayectorias del Caso de Uso}{Item.8}{}}
\newlabel{CC-CT-CU1:MuestraIU}{{9}{45}{Trayectorias del Caso de Uso}{Item.12}{}}
\gdef \LT@iii {\LT@entry 
    {1}{88.2075pt}\LT@entry 
    {1}{345.08385pt}}
\@writefile{toc}{\contentsline {subsection}{\numberline {7.1.4}Diseño de la interfaz}{49}{subsection.7.1.4}\protected@file@percent }
\@writefile{lot}{\contentsline {table}{\numberline {7.2}{Comportamiento de acciones}}{55}{DTLrowi.264.6}\protected@file@percent }
\newlabel{CC-CT-CU1:TablaAcciones}{{7.2}{55}{\tCaption }{DTLrowi.264.6}{}}
\@writefile{lof}{\contentsline {figure}{\numberline {7.1}{\ignorespaces Gestionar cuestionarios de contexto}}{56}{figure.7.1}\protected@file@percent }
\newlabel{CC-CT-IU1}{{7.1}{56}{Gestionar cuestionarios de contexto}{figure.7.1}{}}
\@writefile{lof}{\contentsline {figure}{\numberline {7.2}{\ignorespaces Gestionar cuestionarios de contexto (a)}}{57}{figure.7.2}\protected@file@percent }
\newlabel{CC-CT-IU1a}{{7.2}{57}{Gestionar cuestionarios de contexto (a)}{figure.7.2}{}}
\@writefile{lof}{\contentsline {figure}{\numberline {7.3}{\ignorespaces Gestionar cuestionarios de contexto (b)}}{58}{figure.7.3}\protected@file@percent }
\newlabel{CC-CT-IU1b}{{7.3}{58}{Gestionar cuestionarios de contexto (b)}{figure.7.3}{}}
\@writefile{lof}{\contentsline {figure}{\numberline {7.4}{\ignorespaces Gestionar cuestionarios de contexto (c)}}{59}{figure.7.4}\protected@file@percent }
\newlabel{CC-CT-IU1c}{{7.4}{59}{Gestionar cuestionarios de contexto (c)}{figure.7.4}{}}
\@writefile{lof}{\contentsline {figure}{\numberline {7.5}{\ignorespaces Gestionar cuestionarios de contexto (d)}}{60}{figure.7.5}\protected@file@percent }
\newlabel{CC-CT-IU1d}{{7.5}{60}{Gestionar cuestionarios de contexto (d)}{figure.7.5}{}}
\gdef \LT@iv {\LT@entry 
    {1}{88.2075pt}\LT@entry 
    {1}{345.08385pt}}
\@writefile{toc}{\contentsline {section}{\numberline {7.2}CC-CT-CU1.1 Registrar información básica del cuestionario de contexto}{61}{section.7.2}\protected@file@percent }
\@writefile{toc}{\contentsline {subsection}{\numberline {7.2.1}Resumen}{61}{subsection.7.2.1}\protected@file@percent }
\@writefile{toc}{\contentsline {subsection}{\numberline {7.2.2}Descripción}{61}{subsection.7.2.2}\protected@file@percent }
\@writefile{toc}{\contentsline {subsection}{\numberline {7.2.3}Trayectorias del Caso de Uso}{61}{subsection.7.2.3}\protected@file@percent }
\newlabel{CC-CT-IU1.1:Ingresa}{{4}{61}{Trayectorias del Caso de Uso}{Item.64}{}}
\newlabel{CC-CT-IU1.1:Selecciona}{{5}{61}{Trayectorias del Caso de Uso}{Item.65}{}}
\newlabel{CC-CT-IU1.1:SeleccionaII}{{8}{61}{Trayectorias del Caso de Uso}{Item.68}{}}
\newlabel{CC-CT-IU1.1:Aceptar}{{11}{61}{Trayectorias del Caso de Uso}{Item.71}{}}
\gdef \LT@v {\LT@entry 
    {1}{88.2075pt}\LT@entry 
    {1}{345.08385pt}}
\@writefile{toc}{\contentsline {subsection}{\numberline {7.2.4}Diseño de la interfaz}{63}{subsection.7.2.4}\protected@file@percent }
\@writefile{lot}{\contentsline {table}{\numberline {7.4}{Comportamiento de acciones}}{64}{DTLrowi.292.1}\protected@file@percent }
\newlabel{CC-CT-IU1.1:TablaAcciones}{{7.4}{64}{\tCaption }{DTLrowi.292.1}{}}
\@writefile{lof}{\contentsline {figure}{\numberline {7.6}{\ignorespaces Registrar información básica del cuestionario de contexto}}{64}{figure.7.6}\protected@file@percent }
\newlabel{CC-CT-IU1.1}{{7.6}{64}{Registrar información básica del cuestionario de contexto}{figure.7.6}{}}
\gdef \LT@vi {\LT@entry 
    {1}{88.2075pt}\LT@entry 
    {1}{345.08385pt}}
\@writefile{toc}{\contentsline {section}{\numberline {7.3}CC-CT-CU1.2 Editar información básica del cuestionario de contexto}{65}{section.7.3}\protected@file@percent }
\@writefile{toc}{\contentsline {subsection}{\numberline {7.3.1}Resumen}{65}{subsection.7.3.1}\protected@file@percent }
\@writefile{toc}{\contentsline {subsection}{\numberline {7.3.2}Descripción}{65}{subsection.7.3.2}\protected@file@percent }
\@writefile{toc}{\contentsline {subsection}{\numberline {7.3.3}Trayectorias del Caso de Uso}{65}{subsection.7.3.3}\protected@file@percent }
\newlabel{CC-CT-CU1.2:ObtieneII}{{3}{65}{Trayectorias del Caso de Uso}{Item.96}{}}
\newlabel{CC-CT-IU1.2:Ingresa}{{7}{65}{Trayectorias del Caso de Uso}{Item.100}{}}
\newlabel{CC-CT-IU1.2:Selecciona}{{8}{65}{Trayectorias del Caso de Uso}{Item.101}{}}
\newlabel{CC-CT-IU1.2:Aceptar}{{14}{66}{Trayectorias del Caso de Uso}{Item.107}{}}
\gdef \LT@vii {\LT@entry 
    {1}{88.2075pt}\LT@entry 
    {1}{345.08385pt}}
\@writefile{toc}{\contentsline {subsection}{\numberline {7.3.4}Diseño de la interfaz}{68}{subsection.7.3.4}\protected@file@percent }
\@writefile{lot}{\contentsline {table}{\numberline {7.6}{Comportamiento de acciones}}{68}{DTLrowi.331.1}\protected@file@percent }
\newlabel{CC-CT-IU1.2:TablaAcciones}{{7.6}{68}{\tCaption }{DTLrowi.331.1}{}}
\@writefile{lof}{\contentsline {figure}{\numberline {7.7}{\ignorespaces Editar información básica del cuestionario de contexto}}{69}{figure.7.7}\protected@file@percent }
\newlabel{CC-CT-IU1.2}{{7.7}{69}{Editar información básica del cuestionario de contexto}{figure.7.7}{}}
\gdef \LT@viii {\LT@entry 
    {1}{88.2075pt}\LT@entry 
    {1}{345.08385pt}}
\@writefile{toc}{\contentsline {section}{\numberline {7.4}CC-CT-CU1.3 Clonar cuestionario de contexto}{70}{section.7.4}\protected@file@percent }
\@writefile{toc}{\contentsline {subsection}{\numberline {7.4.1}Resumen}{70}{subsection.7.4.1}\protected@file@percent }
\@writefile{toc}{\contentsline {subsection}{\numberline {7.4.2}Descripción}{70}{subsection.7.4.2}\protected@file@percent }
\@writefile{toc}{\contentsline {subsection}{\numberline {7.4.3}Trayectorias del Caso de Uso}{70}{subsection.7.4.3}\protected@file@percent }
\gdef \LT@ix {\LT@entry 
    {1}{88.2075pt}\LT@entry 
    {1}{345.08385pt}}
\@writefile{toc}{\contentsline {subsection}{\numberline {7.4.4}Diseño de la interfaz}{71}{subsection.7.4.4}\protected@file@percent }
\@writefile{lot}{\contentsline {table}{\numberline {7.8}{Comportamiento de acciones}}{71}{DTLrowi.345.1}\protected@file@percent }
\newlabel{CC-CT-IU1.3:TablaAcciones}{{7.8}{71}{\tCaption }{DTLrowi.345.1}{}}
\@writefile{lof}{\contentsline {figure}{\numberline {7.8}{\ignorespaces Clonar cuestionario de contexto}}{72}{figure.7.8}\protected@file@percent }
\newlabel{CC-CT-IU1.3}{{7.8}{72}{Clonar cuestionario de contexto}{figure.7.8}{}}
\gdef \LT@x {\LT@entry 
    {1}{88.2075pt}\LT@entry 
    {1}{345.08385pt}}
\@writefile{toc}{\contentsline {section}{\numberline {7.5}CC-CT-CU1.4 Eliminar cuestionario de contexto}{73}{section.7.5}\protected@file@percent }
\@writefile{toc}{\contentsline {subsection}{\numberline {7.5.1}Resumen}{73}{subsection.7.5.1}\protected@file@percent }
\@writefile{toc}{\contentsline {subsection}{\numberline {7.5.2}Descripción}{73}{subsection.7.5.2}\protected@file@percent }
\@writefile{toc}{\contentsline {subsection}{\numberline {7.5.3}Trayectorias del Caso de Uso}{73}{subsection.7.5.3}\protected@file@percent }
\newlabel{CC-CT-CU1.4:Obtiene}{{2}{73}{Trayectorias del Caso de Uso}{Item.146}{}}
\gdef \LT@xi {\LT@entry 
    {1}{88.2075pt}\LT@entry 
    {1}{345.08385pt}}
\@writefile{toc}{\contentsline {subsection}{\numberline {7.5.4}Diseño de la interfaz}{74}{subsection.7.5.4}\protected@file@percent }
\@writefile{lot}{\contentsline {table}{\numberline {7.10}{Comportamiento de acciones}}{75}{DTLrowi.370.1}\protected@file@percent }
\newlabel{CC-CT-IU1.4:TablaAcciones}{{7.10}{75}{\tCaption }{DTLrowi.370.1}{}}
\@writefile{lof}{\contentsline {figure}{\numberline {7.9}{\ignorespaces Eliminar cuestionario de contexto}}{75}{figure.7.9}\protected@file@percent }
\newlabel{CC-CT-IU1.4}{{7.9}{75}{Eliminar cuestionario de contexto}{figure.7.9}{}}
\gdef \LT@xii {\LT@entry 
    {1}{88.2075pt}\LT@entry 
    {1}{345.08385pt}}
\@writefile{toc}{\contentsline {section}{\numberline {7.6}CC-CT-CU2 Generar cuestionario de contexto}{76}{section.7.6}\protected@file@percent }
\@writefile{toc}{\contentsline {subsection}{\numberline {7.6.1}Resumen}{76}{subsection.7.6.1}\protected@file@percent }
\@writefile{toc}{\contentsline {subsection}{\numberline {7.6.2}Descripción}{76}{subsection.7.6.2}\protected@file@percent }
\@writefile{toc}{\contentsline {subsection}{\numberline {7.6.3}Trayectorias del Caso de Uso}{76}{subsection.7.6.3}\protected@file@percent }
\newlabel{CC-CT-CU2:Obtiene}{{2}{77}{Trayectorias del Caso de Uso}{Item.161}{}}
\newlabel{CC-CT-IU2:MuestraIU1}{{6}{77}{Trayectorias del Caso de Uso}{Item.165}{}}
\newlabel{CC-CT-IU2:Regresa}{{7}{77}{Trayectorias del Caso de Uso}{Item.166}{}}
\newlabel{CC-CT-CU2:MuestraPreguntas}{{18}{77}{Trayectorias del Caso de Uso}{Item.177}{}}
\newlabel{CC-CT-CU2:Configura}{{19}{77}{Trayectorias del Caso de Uso}{Item.178}{}}
\gdef \LT@xiii {\LT@entry 
    {1}{88.2075pt}\LT@entry 
    {1}{345.08385pt}}
\@writefile{toc}{\contentsline {subsection}{\numberline {7.6.4}Diseño de la interfaz}{80}{subsection.7.6.4}\protected@file@percent }
\@writefile{lot}{\contentsline {table}{\numberline {7.12}{Comportamiento de acciones}}{82}{DTLrowi.417.15}\protected@file@percent }
\newlabel{CC-CT-CU2:TablaAcciones}{{7.12}{82}{\tCaption }{DTLrowi.417.15}{}}
\@writefile{lof}{\contentsline {figure}{\numberline {7.10}{\ignorespaces Generar cuestionario de contexto(a)}}{82}{figure.7.10}\protected@file@percent }
\newlabel{CC-CT-IU2a}{{7.10}{82}{Generar cuestionario de contexto(a)}{figure.7.10}{}}
\@writefile{lof}{\contentsline {figure}{\numberline {7.11}{\ignorespaces Generar cuestionario de contexto(b)}}{83}{figure.7.11}\protected@file@percent }
\newlabel{CC-CT-IU2b}{{7.11}{83}{Generar cuestionario de contexto(b)}{figure.7.11}{}}
\@writefile{lof}{\contentsline {figure}{\numberline {7.12}{\ignorespaces Generar cuestionario de contexto(c)}}{84}{figure.7.12}\protected@file@percent }
\newlabel{CC-CT-IU2c}{{7.12}{84}{Generar cuestionario de contexto(c)}{figure.7.12}{}}
\@writefile{lof}{\contentsline {figure}{\numberline {7.13}{\ignorespaces Generar cuestionario de contexto(d)}}{85}{figure.7.13}\protected@file@percent }
\newlabel{CC-CT-IU2d}{{7.13}{85}{Generar cuestionario de contexto(d)}{figure.7.13}{}}
\gdef \LT@xiv {\LT@entry 
    {1}{88.2075pt}\LT@entry 
    {1}{345.08385pt}}
\@writefile{toc}{\contentsline {section}{\numberline {7.7}CC-CT-CU2.1 Agregar sección al cuestionario de contexto}{86}{section.7.7}\protected@file@percent }
\@writefile{toc}{\contentsline {subsection}{\numberline {7.7.1}Resumen}{86}{subsection.7.7.1}\protected@file@percent }
\@writefile{toc}{\contentsline {subsection}{\numberline {7.7.2}Descripción}{86}{subsection.7.7.2}\protected@file@percent }
\@writefile{toc}{\contentsline {subsection}{\numberline {7.7.3}Trayectorias del Caso de Uso}{86}{subsection.7.7.3}\protected@file@percent }
\newlabel{CC-CT-CU2.1:MuestraIU1}{{2}{86}{Trayectorias del Caso de Uso}{Item.222}{}}
\newlabel{CC-CT-IU2.1:Ingresa}{{3}{86}{Trayectorias del Caso de Uso}{Item.223}{}}
\newlabel{CC-CT-IU2.1:Selecciona}{{4}{86}{Trayectorias del Caso de Uso}{Item.224}{}}
\gdef \LT@xv {\LT@entry 
    {1}{88.2075pt}\LT@entry 
    {1}{345.08385pt}}
\@writefile{toc}{\contentsline {subsection}{\numberline {7.7.4}Diseño de la interfaz}{88}{subsection.7.7.4}\protected@file@percent }
\@writefile{lot}{\contentsline {table}{\numberline {7.14}{Comportamiento de acciones}}{88}{DTLrowi.436.6}\protected@file@percent }
\newlabel{CC-CT-CU2.1:TablaAcciones}{{7.14}{88}{\tCaption }{DTLrowi.436.6}{}}
\@writefile{lof}{\contentsline {figure}{\numberline {7.14}{\ignorespaces Agregar sección al cuestionario de contexto}}{88}{figure.7.14}\protected@file@percent }
\newlabel{CC-CT-IU2.1}{{7.14}{88}{Agregar sección al cuestionario de contexto}{figure.7.14}{}}
\gdef \LT@xvi {\LT@entry 
    {1}{88.2075pt}\LT@entry 
    {1}{345.08385pt}}
\@writefile{toc}{\contentsline {section}{\numberline {7.8}CC-CT-CU2.2 Agregar preguntas a la sección del cuestionario de contexto}{89}{section.7.8}\protected@file@percent }
\@writefile{toc}{\contentsline {subsection}{\numberline {7.8.1}Resumen}{89}{subsection.7.8.1}\protected@file@percent }
\@writefile{toc}{\contentsline {subsection}{\numberline {7.8.2}Descripción}{89}{subsection.7.8.2}\protected@file@percent }
\@writefile{toc}{\contentsline {subsection}{\numberline {7.8.3}Trayectorias del Caso de Uso}{89}{subsection.7.8.3}\protected@file@percent }
\newlabel{CC-CT-CU2.2:MuestraIU1}{{3}{89}{Trayectorias del Caso de Uso}{Item.245}{}}
\newlabel{CC-CT-CU2.2:Obtener}{{4}{89}{Trayectorias del Caso de Uso}{Item.246}{}}
\newlabel{CC-CT-CU2.2:Obtiene}{{6}{89}{Trayectorias del Caso de Uso}{Item.248}{}}
\newlabel{CC-CT-CU2.2:MuestraIU}{{7}{89}{Trayectorias del Caso de Uso}{Item.249}{}}
\newlabel{CC-CT-IU2.2:Ingresa}{{8}{90}{Trayectorias del Caso de Uso}{Item.250}{}}
\gdef \LT@xvii {\LT@entry 
    {1}{88.2075pt}\LT@entry 
    {1}{345.08385pt}}
\@writefile{toc}{\contentsline {subsection}{\numberline {7.8.4}Diseño de la interfaz}{92}{subsection.7.8.4}\protected@file@percent }
\@writefile{lot}{\contentsline {table}{\numberline {7.16}{Comportamiento de acciones}}{92}{DTLrowi.470.13}\protected@file@percent }
\newlabel{CC-CT-CU2.2:TablaAcciones}{{7.16}{92}{\tCaption }{DTLrowi.470.13}{}}
\@writefile{lof}{\contentsline {figure}{\numberline {7.15}{\ignorespaces Gestionar preguntas de la sección (a)}}{93}{figure.7.15}\protected@file@percent }
\newlabel{CC-CT-IU2.2a}{{7.15}{93}{Gestionar preguntas de la sección (a)}{figure.7.15}{}}
\@writefile{lof}{\contentsline {figure}{\numberline {7.16}{\ignorespaces Gestionar preguntas de la sección (b)}}{94}{figure.7.16}\protected@file@percent }
\newlabel{CC-CT-IU2.2b}{{7.16}{94}{Gestionar preguntas de la sección (b)}{figure.7.16}{}}
\@writefile{lof}{\contentsline {figure}{\numberline {7.17}{\ignorespaces Gestionar preguntas de la sección (c)}}{95}{figure.7.17}\protected@file@percent }
\newlabel{CC-CT-IU2.2c}{{7.17}{95}{Gestionar preguntas de la sección (c)}{figure.7.17}{}}
\@writefile{lof}{\contentsline {figure}{\numberline {7.18}{\ignorespaces Gestionar preguntas de la sección (d)}}{96}{figure.7.18}\protected@file@percent }
\newlabel{CC-CT-IU2.2d}{{7.18}{96}{Gestionar preguntas de la sección (d)}{figure.7.18}{}}
\gdef \LT@xviii {\LT@entry 
    {1}{88.2075pt}\LT@entry 
    {1}{345.08385pt}}
\@writefile{toc}{\contentsline {section}{\numberline {7.9}CC-CT-CU2.3 Seleccionar sinonimia de la pregunta}{97}{section.7.9}\protected@file@percent }
\@writefile{toc}{\contentsline {subsection}{\numberline {7.9.1}Resumen}{97}{subsection.7.9.1}\protected@file@percent }
\@writefile{toc}{\contentsline {subsection}{\numberline {7.9.2}Descripción}{97}{subsection.7.9.2}\protected@file@percent }
\@writefile{toc}{\contentsline {subsection}{\numberline {7.9.3}Trayectorias del Caso de Uso}{97}{subsection.7.9.3}\protected@file@percent }
\newlabel{CC-CT-CU2.3:MuestraIU1}{{5}{97}{Trayectorias del Caso de Uso}{Item.286}{}}
\gdef \LT@xix {\LT@entry 
    {1}{88.2075pt}\LT@entry 
    {1}{345.08385pt}}
\@writefile{toc}{\contentsline {subsection}{\numberline {7.9.4}Diseño de la interfaz}{98}{subsection.7.9.4}\protected@file@percent }
\@writefile{lot}{\contentsline {table}{\numberline {7.18}{Comportamiento de acciones}}{98}{DTLrowi.481.8}\protected@file@percent }
\newlabel{CC-CT-CU2.3:TablaAcciones}{{7.18}{98}{\tCaption }{DTLrowi.481.8}{}}
\@writefile{lof}{\contentsline {figure}{\numberline {7.19}{\ignorespaces Configurar pregunta}}{99}{figure.7.19}\protected@file@percent }
\newlabel{CC-CT-IU2.3}{{7.19}{99}{Configurar pregunta}{figure.7.19}{}}
\gdef \LT@xx {\LT@entry 
    {1}{88.2075pt}\LT@entry 
    {1}{345.08385pt}}
\@writefile{toc}{\contentsline {section}{\numberline {7.10}CC-CT-CU2.4 Editar sección del cuestionario de contexto}{100}{section.7.10}\protected@file@percent }
\@writefile{toc}{\contentsline {subsection}{\numberline {7.10.1}Resumen}{100}{subsection.7.10.1}\protected@file@percent }
\@writefile{toc}{\contentsline {subsection}{\numberline {7.10.2}Descripción}{100}{subsection.7.10.2}\protected@file@percent }
\@writefile{toc}{\contentsline {subsection}{\numberline {7.10.3}Trayectorias del Caso de Uso}{100}{subsection.7.10.3}\protected@file@percent }
\newlabel{CC-CT-CU2.4:MuestraIU1}{{3}{100}{Trayectorias del Caso de Uso}{Item.295}{}}
\newlabel{CC-CT-IU2.4:Ingresa}{{4}{100}{Trayectorias del Caso de Uso}{Item.296}{}}
\newlabel{CC-CT-IU2.4:Selecciona}{{5}{100}{Trayectorias del Caso de Uso}{Item.297}{}}
\gdef \LT@xxi {\LT@entry 
    {1}{88.2075pt}\LT@entry 
    {1}{345.08385pt}}
\@writefile{toc}{\contentsline {subsection}{\numberline {7.10.4}Diseño de la interfaz}{102}{subsection.7.10.4}\protected@file@percent }
\@writefile{lot}{\contentsline {table}{\numberline {7.20}{Comportamiento de acciones}}{102}{DTLrowi.500.6}\protected@file@percent }
\newlabel{CC-CT-CU2.4:TablaAcciones}{{7.20}{102}{\tCaption }{DTLrowi.500.6}{}}
\@writefile{lof}{\contentsline {figure}{\numberline {7.20}{\ignorespaces Editar sección al cuestionario de contexto}}{102}{figure.7.20}\protected@file@percent }
\newlabel{CC-CT-IU2.4}{{7.20}{102}{Editar sección al cuestionario de contexto}{figure.7.20}{}}
\gdef \LT@xxii {\LT@entry 
    {1}{88.2075pt}\LT@entry 
    {1}{345.08385pt}}
\@writefile{toc}{\contentsline {section}{\numberline {7.11}CC-CT-CU2.5 Eliminar sección del cuestionario de contexto}{103}{section.7.11}\protected@file@percent }
\@writefile{toc}{\contentsline {subsection}{\numberline {7.11.1}Resumen}{103}{subsection.7.11.1}\protected@file@percent }
\@writefile{toc}{\contentsline {subsection}{\numberline {7.11.2}Descripción}{103}{subsection.7.11.2}\protected@file@percent }
\@writefile{toc}{\contentsline {subsection}{\numberline {7.11.3}Trayectorias del Caso de Uso}{103}{subsection.7.11.3}\protected@file@percent }
\newlabel{CC-CT-CU2.5:Obtiene}{{2}{103}{Trayectorias del Caso de Uso}{Item.317}{}}
\gdef \LT@xxiii {\LT@entry 
    {1}{88.2075pt}\LT@entry 
    {1}{345.08385pt}}
\@writefile{toc}{\contentsline {subsection}{\numberline {7.11.4}Diseño de la interfaz}{104}{subsection.7.11.4}\protected@file@percent }
\@writefile{lot}{\contentsline {table}{\numberline {7.22}{Comportamiento de acciones}}{104}{DTLrowi.513.6}\protected@file@percent }
\newlabel{CC-CT-CU2.5:TablaAcciones}{{7.22}{104}{\tCaption }{DTLrowi.513.6}{}}
\@writefile{lof}{\contentsline {figure}{\numberline {7.21}{\ignorespaces Eliminar sección del cuestionario de contexto}}{105}{figure.7.21}\protected@file@percent }
\newlabel{CC-CT-IU2.5}{{7.21}{105}{Eliminar sección del cuestionario de contexto}{figure.7.21}{}}
\gdef \LT@xxiv {\LT@entry 
    {1}{88.2075pt}\LT@entry 
    {1}{345.08385pt}}
\@writefile{toc}{\contentsline {section}{\numberline {7.12}CC-CT-CU2.6 Condicionar pregunta del cuestionario de contexto}{106}{section.7.12}\protected@file@percent }
\@writefile{toc}{\contentsline {subsection}{\numberline {7.12.1}Resumen}{106}{subsection.7.12.1}\protected@file@percent }
\@writefile{toc}{\contentsline {subsection}{\numberline {7.12.2}Descripción}{106}{subsection.7.12.2}\protected@file@percent }
\@writefile{toc}{\contentsline {subsection}{\numberline {7.12.3}Trayectorias del Caso de Uso}{106}{subsection.7.12.3}\protected@file@percent }
\newlabel{CC-CT-CU2.6:MuestraIU1}{{9}{106}{Trayectorias del Caso de Uso}{Item.334}{}}
\newlabel{CC-CT-CU2.6:MuestraIU2}{{15}{107}{Trayectorias del Caso de Uso}{Item.340}{}}
\newlabel{CC-CT-CU2.6:Selecciona}{{16}{107}{Trayectorias del Caso de Uso}{Item.341}{}}
\newlabel{CC-CT-CU2.6:MuestraIU3}{{21}{107}{Trayectorias del Caso de Uso}{Item.346}{}}
\@writefile{toc}{\contentsline {subsection}{\numberline {7.12.4}Diseño de la interfaz}{109}{subsection.7.12.4}\protected@file@percent }
\gdef \LT@xxiv {}
\newlabel{}{{7.12.4}{110}{Diseño de la interfaz}{DTLrowi.539.8}{}}
\@writefile{lof}{\contentsline {figure}{\numberline {7.22}{\ignorespaces Condicionar pregunta del cuestionario de contexto}}{111}{figure.7.22}\protected@file@percent }
\newlabel{CC-CT-IU2.6a}{{7.22}{111}{Condicionar pregunta del cuestionario de contexto}{figure.7.22}{}}
\@writefile{lof}{\contentsline {figure}{\numberline {7.23}{\ignorespaces Condicionar pregunta del cuestionario de contexto}}{112}{figure.7.23}\protected@file@percent }
\newlabel{CC-CT-IU2.6b}{{7.23}{112}{Condicionar pregunta del cuestionario de contexto}{figure.7.23}{}}
\@writefile{lof}{\contentsline {figure}{\numberline {7.24}{\ignorespaces Condicionar pregunta del cuestionario de contexto}}{113}{figure.7.24}\protected@file@percent }
\newlabel{CC-CT-IU2.6c}{{7.24}{113}{Condicionar pregunta del cuestionario de contexto}{figure.7.24}{}}
\@writefile{lof}{\contentsline {figure}{\numberline {7.25}{\ignorespaces Condicionar pregunta del cuestionario de contexto}}{114}{figure.7.25}\protected@file@percent }
\newlabel{CC-CT-IU2.6d}{{7.25}{114}{Condicionar pregunta del cuestionario de contexto}{figure.7.25}{}}
\@writefile{lof}{\contentsline {figure}{\numberline {7.26}{\ignorespaces Eliminar pregunta de la respuesta condicionada}}{114}{figure.7.26}\protected@file@percent }
\newlabel{CC-CT-IU2.6e}{{7.26}{114}{Eliminar pregunta de la respuesta condicionada}{figure.7.26}{}}
\gdef \LT@xxv {\LT@entry 
    {1}{88.2075pt}\LT@entry 
    {1}{345.08385pt}}
\@writefile{toc}{\contentsline {section}{\numberline {7.13}CC-CT-CU2.8 Eliminar preguntas de la sección del cuestionario de contexto}{115}{section.7.13}\protected@file@percent }
\@writefile{toc}{\contentsline {subsection}{\numberline {7.13.1}Resumen}{115}{subsection.7.13.1}\protected@file@percent }
\@writefile{toc}{\contentsline {subsection}{\numberline {7.13.2}Descripción}{115}{subsection.7.13.2}\protected@file@percent }
\@writefile{toc}{\contentsline {subsection}{\numberline {7.13.3}Trayectorias del Caso de Uso}{115}{subsection.7.13.3}\protected@file@percent }
\gdef \LT@xxvi {\LT@entry 
    {1}{88.2075pt}\LT@entry 
    {1}{345.08385pt}}
\@writefile{toc}{\contentsline {subsection}{\numberline {7.13.4}Diseño de la interfaz}{116}{subsection.7.13.4}\protected@file@percent }
\@writefile{lot}{\contentsline {table}{\numberline {7.25}{Comportamiento de acciones}}{116}{DTLrowi.549.8}\protected@file@percent }
\newlabel{CC-CT-CU2.8:TablaAcciones}{{7.25}{116}{\tCaption }{DTLrowi.549.8}{}}
\@writefile{lof}{\contentsline {figure}{\numberline {7.27}{\ignorespaces Eliminar preguntas de la sección del cuestionario de contexto}}{117}{figure.7.27}\protected@file@percent }
\newlabel{CC-CT-IU2.8}{{7.27}{117}{Eliminar preguntas de la sección del cuestionario de contexto}{figure.7.27}{}}
\gdef \LT@xxvii {\LT@entry 
    {1}{88.2075pt}\LT@entry 
    {1}{345.08385pt}}
\@writefile{toc}{\contentsline {section}{\numberline {7.14}CC-CT-CU2.9 Eliminar regla a la respuesta de la pregunta}{118}{section.7.14}\protected@file@percent }
\@writefile{toc}{\contentsline {subsection}{\numberline {7.14.1}Resumen}{118}{subsection.7.14.1}\protected@file@percent }
\@writefile{toc}{\contentsline {subsection}{\numberline {7.14.2}Descripción}{118}{subsection.7.14.2}\protected@file@percent }
\@writefile{toc}{\contentsline {subsection}{\numberline {7.14.3}Trayectorias del Caso de Uso}{118}{subsection.7.14.3}\protected@file@percent }
\newlabel{CC-CT-CU2.9:Obtiene}{{2}{118}{Trayectorias del Caso de Uso}{Item.381}{}}
\gdef \LT@xxviii {\LT@entry 
    {1}{88.2075pt}\LT@entry 
    {1}{345.08385pt}}
\@writefile{toc}{\contentsline {subsection}{\numberline {7.14.4}Diseño de la interfaz}{119}{subsection.7.14.4}\protected@file@percent }
\@writefile{lot}{\contentsline {table}{\numberline {7.27}{Comportamiento de acciones}}{119}{DTLrowi.564.1}\protected@file@percent }
\newlabel{CC-CT-IU2.9:TablaAcciones}{{7.27}{119}{\tCaption }{DTLrowi.564.1}{}}
\@writefile{lof}{\contentsline {figure}{\numberline {7.28}{\ignorespaces Eliminar cuestionario de contexto}}{119}{figure.7.28}\protected@file@percent }
\newlabel{CC-CT-IU2.9}{{7.28}{119}{Eliminar cuestionario de contexto}{figure.7.28}{}}
\gdef \LT@xxix {\LT@entry 
    {1}{88.2075pt}\LT@entry 
    {1}{345.08385pt}}
\@writefile{toc}{\contentsline {section}{\numberline {7.15}CC-CT-CU3 Consultar cuestionario de contexto}{120}{section.7.15}\protected@file@percent }
\@writefile{toc}{\contentsline {subsection}{\numberline {7.15.1}Resumen}{120}{subsection.7.15.1}\protected@file@percent }
\@writefile{toc}{\contentsline {subsection}{\numberline {7.15.2}Descripción}{120}{subsection.7.15.2}\protected@file@percent }
\@writefile{toc}{\contentsline {subsection}{\numberline {7.15.3}Trayectorias del Caso de Uso}{120}{subsection.7.15.3}\protected@file@percent }
\newlabel{CC-CT-IU3:Ingresa}{{7}{120}{Trayectorias del Caso de Uso}{Item.395}{}}
\newlabel{CC-CT-IU3:Selecciona}{{8}{120}{Trayectorias del Caso de Uso}{Item.396}{}}
\newlabel{CC-CT-IU3:Respuesta}{{11}{120}{Trayectorias del Caso de Uso}{Item.399}{}}
\newlabel{CC-CT-IU3:Aceptar}{{12}{121}{Trayectorias del Caso de Uso}{Item.400}{}}
\newlabel{CC-CT-IU3:Verifica}{{13}{121}{Trayectorias del Caso de Uso}{Item.401}{}}
\newlabel{CC-CT-IU3:Regresar}{{19}{121}{Trayectorias del Caso de Uso}{Item.407}{}}
\newlabel{CC-CT-IU3:IngresaII}{{1}{121}{Trayectorias del Caso de Uso}{Item.411}{}}
\newlabel{CC-CT-IU3:RespuestaII}{{3}{122}{Trayectorias del Caso de Uso}{Item.425}{}}
\newlabel{CC-CT-IU3:RespuestaIII}{{3}{123}{Trayectorias del Caso de Uso}{Item.435}{}}
\newlabel{CC-CT-IU3:RespuestaIIII}{{3}{123}{Trayectorias del Caso de Uso}{Item.445}{}}
\newlabel{CC-CT-IU3:SeleccionaArchivo}{{3}{124}{Trayectorias del Caso de Uso}{Item.455}{}}
\newlabel{CC-CT-IU3:RespuestaV}{{8}{124}{Trayectorias del Caso de Uso}{Item.460}{}}
\newlabel{CC-CT-IU3:RespuestaH}{{4}{125}{Trayectorias del Caso de Uso}{Item.473}{}}
\newlabel{CC-CT-IU3:RespuestaVII}{{3}{125}{Trayectorias del Caso de Uso}{Item.483}{}}
\newlabel{CC-CT-IU3:IngresaI.1}{{4}{126}{Trayectorias del Caso de Uso}{Item.489}{}}
\newlabel{CC-CT-IU3:RespuestaJ2}{{7}{126}{Trayectorias del Caso de Uso}{Item.506}{}}
\newlabel{CC-CT-IU3:IngresaJ.1}{{13}{127}{Trayectorias del Caso de Uso}{Item.512}{}}
\newlabel{CC-CT-IU3:RegresaJ.1}{{16}{127}{Trayectorias del Caso de Uso}{Item.515}{}}
\newlabel{CC-CT-IU3:RegresaJ.1}{{5}{127}{Trayectorias del Caso de Uso}{Item.521}{}}
\newlabel{CC-CT-IU3:RespuestaJ2}{{2}{128}{Trayectorias del Caso de Uso}{Item.528}{}}
\newlabel{CC-CT-IU3:RespuestaK}{{3}{128}{Trayectorias del Caso de Uso}{Item.533}{}}
\newlabel{CC-CT-IU3:IngresaK.1}{{4}{128}{Trayectorias del Caso de Uso}{Item.538}{}}
\newlabel{CC-CT-IU3:RespuestaL}{{3}{129}{Trayectorias del Caso de Uso}{Item.546}{}}
\newlabel{CC-CT-IU3:IngresaL.1}{{4}{129}{Trayectorias del Caso de Uso}{Item.551}{}}
\newlabel{CC-CT-IU3:RespuestaM1}{{4}{129}{Trayectorias del Caso de Uso}{Item.560}{}}
\newlabel{CC-CT-IU3:RespuestaM}{{6}{130}{Trayectorias del Caso de Uso}{Item.562}{}}
\newlabel{CC-CT-IU3:IngresaM.1}{{4}{130}{Trayectorias del Caso de Uso}{Item.568}{}}
\@writefile{toc}{\contentsline {subsection}{\numberline {7.15.4}Diseño de la interfaz}{132}{subsection.7.15.4}\protected@file@percent }
\@writefile{lof}{\contentsline {figure}{\numberline {7.29}{\ignorespaces Registrar pregunta de opción múltiple/pregunta forzada (vista previa)}}{132}{figure.7.29}\protected@file@percent }
\newlabel{CC-CT-IU11.1b}{{7.29}{132}{Registrar pregunta de opción múltiple/pregunta forzada (vista previa)}{figure.7.29}{}}
\@writefile{lof}{\contentsline {figure}{\numberline {7.30}{\ignorespaces Registrar pregunta de selección múltiple}}{132}{figure.7.30}\protected@file@percent }
\newlabel{CC-CT-IU11.2}{{7.30}{132}{Registrar pregunta de selección múltiple}{figure.7.30}{}}
\@writefile{lof}{\contentsline {figure}{\numberline {7.31}{\ignorespaces Registrar pregunta de selección múltiple (vista previa)}}{132}{figure.7.31}\protected@file@percent }
\newlabel{CC-CT-IU11.2b}{{7.31}{132}{Registrar pregunta de selección múltiple (vista previa)}{figure.7.31}{}}
\gdef \LT@xxxi {\LT@entry 
    {1}{88.2075pt}\LT@entry 
    {1}{345.08385pt}}
\@writefile{toc}{\contentsline {section}{\numberline {7.16}CC-CT-CU4 Enviar cuestionario de contexto a revisión de contenido}{133}{section.7.16}\protected@file@percent }
\@writefile{toc}{\contentsline {subsection}{\numberline {7.16.1}Resumen}{133}{subsection.7.16.1}\protected@file@percent }
\@writefile{toc}{\contentsline {subsection}{\numberline {7.16.2}Descripción}{133}{subsection.7.16.2}\protected@file@percent }
\@writefile{toc}{\contentsline {subsection}{\numberline {7.16.3}Trayectorias del Caso de Uso}{133}{subsection.7.16.3}\protected@file@percent }
\gdef \LT@xxxii {\LT@entry 
    {1}{88.2075pt}\LT@entry 
    {1}{345.08385pt}}
\@writefile{toc}{\contentsline {subsection}{\numberline {7.16.4}Diseño de la interfaz}{134}{subsection.7.16.4}\protected@file@percent }
\@writefile{lot}{\contentsline {table}{\numberline {7.31}{Comportamiento de acciones}}{134}{DTLrowi.664.1}\protected@file@percent }
\newlabel{CC-CT-CU4:TablaAcciones}{{7.31}{134}{\tCaption }{DTLrowi.664.1}{}}
\@writefile{lof}{\contentsline {figure}{\numberline {7.32}{\ignorespaces Enviar cuestionario de contexto a revisión de contenido}}{135}{figure.7.32}\protected@file@percent }
\newlabel{CC-CT-IU4}{{7.32}{135}{Enviar cuestionario de contexto a revisión de contenido}{figure.7.32}{}}
\gdef \LT@xxxiii {\LT@entry 
    {1}{88.2075pt}\LT@entry 
    {1}{345.08385pt}}
\@writefile{toc}{\contentsline {section}{\numberline {7.17}CC-CT-CU5 Validar observaciones del contenido}{136}{section.7.17}\protected@file@percent }
\@writefile{toc}{\contentsline {subsection}{\numberline {7.17.1}Resumen}{136}{subsection.7.17.1}\protected@file@percent }
\@writefile{toc}{\contentsline {subsection}{\numberline {7.17.2}Descripción}{136}{subsection.7.17.2}\protected@file@percent }
\@writefile{toc}{\contentsline {subsection}{\numberline {7.17.3}Trayectorias del Caso de Uso}{136}{subsection.7.17.3}\protected@file@percent }
\newlabel{CC-CT-CU5:Presiona1}{{12}{137}{Trayectorias del Caso de Uso}{Item.611}{}}
\newlabel{CC-CT-CU5:Presiona2}{{12}{137}{Trayectorias del Caso de Uso}{Item.611}{}}
\newlabel{CC-CT-CU5:Presiona3}{{14}{137}{Trayectorias del Caso de Uso}{Item.613}{}}
\newlabel{CC-CT-CU5:Presiona4}{{15}{137}{Trayectorias del Caso de Uso}{Item.614}{}}
\newlabel{CC-CT-CU5:Presiona5}{{16}{137}{Trayectorias del Caso de Uso}{Item.615}{}}
\gdef \LT@xxxiv {\LT@entry 
    {1}{88.2075pt}\LT@entry 
    {1}{345.08385pt}}
\@writefile{toc}{\contentsline {subsection}{\numberline {7.17.4}Diseño de la interfaz}{138}{subsection.7.17.4}\protected@file@percent }
\@writefile{lot}{\contentsline {table}{\numberline {7.33}{Comportamiento de acciones}}{139}{DTLrowi.689.24}\protected@file@percent }
\newlabel{CC-CT-CU5:TablaAcciones}{{7.33}{139}{\tCaption }{DTLrowi.689.24}{}}
\@writefile{lof}{\contentsline {figure}{\numberline {7.33}{\ignorespaces Validar observaciones del contenido (a)}}{140}{figure.7.33}\protected@file@percent }
\newlabel{CC-CT-IU5a}{{7.33}{140}{Validar observaciones del contenido (a)}{figure.7.33}{}}
\@writefile{lof}{\contentsline {figure}{\numberline {7.34}{\ignorespaces Validar observaciones del contenido (b)}}{141}{figure.7.34}\protected@file@percent }
\newlabel{CC-CT-IU5b}{{7.34}{141}{Validar observaciones del contenido (b)}{figure.7.34}{}}
\@writefile{lof}{\contentsline {figure}{\numberline {7.35}{\ignorespaces Validar observaciones del contenido (c)}}{142}{figure.7.35}\protected@file@percent }
\newlabel{CC-CT-IU5c}{{7.35}{142}{Validar observaciones del contenido (c)}{figure.7.35}{}}
\gdef \LT@xxxv {\LT@entry 
    {1}{88.2075pt}\LT@entry 
    {1}{345.08385pt}}
\gdef \LT@xxxvi {\LT@entry 
    {1}{88.2075pt}\LT@entry 
    {1}{345.08385pt}}
\@writefile{toc}{\contentsline {section}{\numberline {7.18}CC-CT-CU5.1 Consultar observaciones de la pregunta}{143}{section.7.18}\protected@file@percent }
\@writefile{toc}{\contentsline {subsection}{\numberline {7.18.1}Resumen}{143}{subsection.7.18.1}\protected@file@percent }
\@writefile{toc}{\contentsline {subsection}{\numberline {7.18.2}Descripción}{143}{subsection.7.18.2}\protected@file@percent }
\@writefile{toc}{\contentsline {subsection}{\numberline {7.18.3}Trayectorias del Caso de Uso}{143}{subsection.7.18.3}\protected@file@percent }
\@writefile{toc}{\contentsline {subsection}{\numberline {7.18.4}Diseño de la interfaz}{143}{subsection.7.18.4}\protected@file@percent }
\@writefile{lot}{\contentsline {table}{\numberline {7.35}{Comportamiento de acciones}}{144}{DTLrowi.697.18}\protected@file@percent }
\newlabel{CC-CT-CU5.1:TablaAcciones}{{7.35}{144}{\tCaption }{DTLrowi.697.18}{}}
\@writefile{lof}{\contentsline {figure}{\numberline {7.36}{\ignorespaces Consultar observaciones de la pregunta}}{144}{figure.7.36}\protected@file@percent }
\newlabel{CC-CT-IU5.1}{{7.36}{144}{Consultar observaciones de la pregunta}{figure.7.36}{}}
\gdef \LT@xxxvii {\LT@entry 
    {1}{88.2075pt}\LT@entry 
    {1}{345.08385pt}}
\@writefile{toc}{\contentsline {section}{\numberline {7.19}CC-CT-CU5.2 Registrar respuesta a la observacion}{145}{section.7.19}\protected@file@percent }
\@writefile{toc}{\contentsline {subsection}{\numberline {7.19.1}Resumen}{145}{subsection.7.19.1}\protected@file@percent }
\@writefile{toc}{\contentsline {subsection}{\numberline {7.19.2}Descripción}{145}{subsection.7.19.2}\protected@file@percent }
\@writefile{toc}{\contentsline {subsection}{\numberline {7.19.3}Trayectorias del Caso de Uso}{145}{subsection.7.19.3}\protected@file@percent }
\newlabel{CC-CT-CU5.2:Ingresa}{{5}{145}{Trayectorias del Caso de Uso}{Item.644}{}}
\gdef \LT@xxxviii {\LT@entry 
    {1}{88.2075pt}\LT@entry 
    {1}{345.08385pt}}
\@writefile{toc}{\contentsline {subsection}{\numberline {7.19.4}Diseño de la interfaz}{146}{subsection.7.19.4}\protected@file@percent }
\@writefile{lot}{\contentsline {table}{\numberline {7.37}{Comportamiento de acciones}}{146}{DTLrowi.710.19}\protected@file@percent }
\newlabel{CC-CT-CU5.2:TablaAcciones}{{7.37}{146}{\tCaption }{DTLrowi.710.19}{}}
\@writefile{lof}{\contentsline {figure}{\numberline {7.37}{\ignorespaces Registrar respuesta a la observación}}{147}{figure.7.37}\protected@file@percent }
\newlabel{CC-CT-IU5.2}{{7.37}{147}{Registrar respuesta a la observación}{figure.7.37}{}}
\gdef \LT@xxxix {\LT@entry 
    {1}{88.2075pt}\LT@entry 
    {1}{345.08385pt}}
\@writefile{toc}{\contentsline {section}{\numberline {7.20}CC-CT-CU5.3 Editar respuesta registrada}{148}{section.7.20}\protected@file@percent }
\@writefile{toc}{\contentsline {subsection}{\numberline {7.20.1}Resumen}{148}{subsection.7.20.1}\protected@file@percent }
\@writefile{toc}{\contentsline {subsection}{\numberline {7.20.2}Descripción}{148}{subsection.7.20.2}\protected@file@percent }
\@writefile{toc}{\contentsline {subsection}{\numberline {7.20.3}Trayectorias del Caso de Uso}{148}{subsection.7.20.3}\protected@file@percent }
\newlabel{CC-RB-CU5.3:Obtiene}{{3}{148}{Trayectorias del Caso de Uso}{Item.658}{}}
\gdef \LT@xl {\LT@entry 
    {1}{88.2075pt}\LT@entry 
    {1}{345.08385pt}}
\@writefile{toc}{\contentsline {subsection}{\numberline {7.20.4}Diseño de la interfaz}{149}{subsection.7.20.4}\protected@file@percent }
\@writefile{lot}{\contentsline {table}{\numberline {7.39}{Comportamiento de acciones}}{150}{DTLrowi.726.18}\protected@file@percent }
\newlabel{CC-CT-CU5.3:TablaAcciones}{{7.39}{150}{\tCaption }{DTLrowi.726.18}{}}
\@writefile{lof}{\contentsline {figure}{\numberline {7.38}{\ignorespaces Editar respuesta registrada}}{150}{figure.7.38}\protected@file@percent }
\newlabel{CC-CT-IU5.3}{{7.38}{150}{Editar respuesta registrada}{figure.7.38}{}}
\gdef \LT@xli {\LT@entry 
    {1}{88.2075pt}\LT@entry 
    {1}{345.08385pt}}
\gdef \LT@xlii {\LT@entry 
    {1}{88.2075pt}\LT@entry 
    {1}{345.08385pt}}
\@writefile{toc}{\contentsline {section}{\numberline {7.21}CC-CT-CU5.4 Eliminar respuesta de las observaciones}{151}{section.7.21}\protected@file@percent }
\@writefile{toc}{\contentsline {subsection}{\numberline {7.21.1}Resumen}{151}{subsection.7.21.1}\protected@file@percent }
\@writefile{toc}{\contentsline {subsection}{\numberline {7.21.2}Descripción}{151}{subsection.7.21.2}\protected@file@percent }
\@writefile{toc}{\contentsline {subsection}{\numberline {7.21.3}Trayectorias del Caso de Uso}{151}{subsection.7.21.3}\protected@file@percent }
\@writefile{toc}{\contentsline {subsection}{\numberline {7.21.4}Diseño de la interfaz}{152}{subsection.7.21.4}\protected@file@percent }
\@writefile{lot}{\contentsline {table}{\numberline {7.41}{Comportamiento de acciones}}{152}{DTLrowi.737.18}\protected@file@percent }
\newlabel{CC-CT-CU5.4:TablaAcciones}{{7.41}{152}{\tCaption }{DTLrowi.737.18}{}}
\@writefile{lof}{\contentsline {figure}{\numberline {7.39}{\ignorespaces Eliminar respuesta de las observaciones}}{153}{figure.7.39}\protected@file@percent }
\newlabel{CC-CT-IU5.4}{{7.39}{153}{Eliminar respuesta de las observaciones}{figure.7.39}{}}
\gdef \LT@xliii {\LT@entry 
    {1}{88.2075pt}\LT@entry 
    {1}{345.08385pt}}
\gdef \LT@xliv {\LT@entry 
    {1}{88.2075pt}\LT@entry 
    {1}{345.08385pt}}
\@writefile{toc}{\contentsline {section}{\numberline {7.22}CC-CT-CU5.5 Habilitar edición del cuestionario de contexto}{154}{section.7.22}\protected@file@percent }
\@writefile{toc}{\contentsline {subsection}{\numberline {7.22.1}Resumen}{154}{subsection.7.22.1}\protected@file@percent }
\@writefile{toc}{\contentsline {subsection}{\numberline {7.22.2}Descripción}{154}{subsection.7.22.2}\protected@file@percent }
\@writefile{toc}{\contentsline {subsection}{\numberline {7.22.3}Trayectorias del Caso de Uso}{154}{subsection.7.22.3}\protected@file@percent }
\@writefile{toc}{\contentsline {subsection}{\numberline {7.22.4}Diseño de la interfaz}{155}{subsection.7.22.4}\protected@file@percent }
\@writefile{lot}{\contentsline {table}{\numberline {7.43}{Comportamiento de acciones}}{155}{DTLrowi.748.14}\protected@file@percent }
\newlabel{CC-CT-CU5.5:TablaAcciones}{{7.43}{155}{\tCaption }{DTLrowi.748.14}{}}
\@writefile{lof}{\contentsline {figure}{\numberline {7.40}{\ignorespaces Habilitar edición del cuestionario de contexto}}{156}{figure.7.40}\protected@file@percent }
\newlabel{CC-CT-IU5.5}{{7.40}{156}{Habilitar edición del cuestionario de contexto}{figure.7.40}{}}
\gdef \LT@xlv {\LT@entry 
    {1}{88.2075pt}\LT@entry 
    {1}{345.08385pt}}
\gdef \LT@xlvi {\LT@entry 
    {1}{88.2075pt}\LT@entry 
    {1}{345.08385pt}}
\@writefile{toc}{\contentsline {section}{\numberline {7.23}CC-CT-CU5.6 Aprobar contenido del cuestionario de contexto}{157}{section.7.23}\protected@file@percent }
\@writefile{toc}{\contentsline {subsection}{\numberline {7.23.1}Resumen}{157}{subsection.7.23.1}\protected@file@percent }
\@writefile{toc}{\contentsline {subsection}{\numberline {7.23.2}Descripción}{157}{subsection.7.23.2}\protected@file@percent }
\@writefile{toc}{\contentsline {subsection}{\numberline {7.23.3}Trayectorias del Caso de Uso}{157}{subsection.7.23.3}\protected@file@percent }
\@writefile{toc}{\contentsline {subsection}{\numberline {7.23.4}Diseño de la interfaz}{158}{subsection.7.23.4}\protected@file@percent }
\@writefile{lot}{\contentsline {table}{\numberline {7.45}{Comportamiento de acciones}}{158}{DTLrowi.759.11}\protected@file@percent }
\newlabel{CC-CT-CU5.6:TablaAcciones}{{7.45}{158}{\tCaption }{DTLrowi.759.11}{}}
\@writefile{lof}{\contentsline {figure}{\numberline {7.41}{\ignorespaces Aprobar contenido del cuestionario de contexto}}{159}{figure.7.41}\protected@file@percent }
\newlabel{CC-CT-IU5.6}{{7.41}{159}{Aprobar contenido del cuestionario de contexto}{figure.7.41}{}}
\gdef \LT@xlvii {\LT@entry 
    {1}{88.2075pt}\LT@entry 
    {1}{345.08385pt}}
\gdef \LT@xlviii {\LT@entry 
    {1}{88.2075pt}\LT@entry 
    {1}{345.08385pt}}
\@writefile{toc}{\contentsline {section}{\numberline {7.24}CC-CT-CU6 Aprobar cuestionario de contexto}{160}{section.7.24}\protected@file@percent }
\@writefile{toc}{\contentsline {subsection}{\numberline {7.24.1}Resumen}{160}{subsection.7.24.1}\protected@file@percent }
\@writefile{toc}{\contentsline {subsection}{\numberline {7.24.2}Descripción}{160}{subsection.7.24.2}\protected@file@percent }
\@writefile{toc}{\contentsline {subsection}{\numberline {7.24.3}Trayectorias del Caso de Uso}{160}{subsection.7.24.3}\protected@file@percent }
\newlabel{CC-CT-CU6:Pantalla}{{2}{160}{Trayectorias del Caso de Uso}{Item.697}{}}
\@writefile{toc}{\contentsline {subsection}{\numberline {7.24.4}Diseño de la interfaz}{161}{subsection.7.24.4}\protected@file@percent }
\@writefile{lot}{\contentsline {table}{\numberline {7.47}{Comportamiento de acciones}}{161}{DTLrowi.771.54}\protected@file@percent }
\newlabel{CC-CT-CU6:TablaAcciones}{{7.47}{161}{\tCaption }{DTLrowi.771.54}{}}
\@writefile{lof}{\contentsline {figure}{\numberline {7.42}{\ignorespaces Aprobar el cuestionario de contexto}}{162}{figure.7.42}\protected@file@percent }
\newlabel{CC-CT-IU6}{{7.42}{162}{Aprobar el cuestionario de contexto}{figure.7.42}{}}
\@writefile{toc}{\contentsline {part}{III\hspace  {1em}Modelado de Interacción}{165}{part.3}\protected@file@percent }
\newlabel{ch:modeloInteraccion}{{7.24.4}{167}{Diseño de la interfaz}{part.3}{}}
\@writefile{toc}{\contentsline {chapter}{\numberline {8}Menús del sistema}{169}{chapter.8}\protected@file@percent }
\@writefile{lof}{\addvspace {10\p@ }}
\@writefile{lot}{\addvspace {10\p@ }}
\newlabel{ch:IUmenu}{{8}{169}{Menús del sistema}{chapter.8}{}}
\@writefile{toc}{\contentsline {chapter}{\numberline {9}Mensajes del sistema}{171}{chapter.9}\protected@file@percent }
\@writefile{lof}{\addvspace {10\p@ }}
\@writefile{lot}{\addvspace {10\p@ }}
\newlabel{ch:IUmensajes}{{9}{171}{Mensajes del sistema}{chapter.9}{}}
\@writefile{toc}{\contentsline {section}{\numberline {9.1}Mensajes a través de la pantalla}{171}{section.9.1}\protected@file@percent }
\@writefile{toc}{\contentsline {subsection}{\numberline {9.1.1}{MSG1}~{}{Campos obligatorios}}{171}{subsection.9.1.1}\protected@file@percent }
\@writefile{toc}{\contentsline {subsection}{\numberline {9.1.2}{MSG2}~{}{Duplicidad de información}}{172}{subsection.9.1.2}\protected@file@percent }
\@writefile{toc}{\contentsline {subsection}{\numberline {9.1.3}{MSG3}~{}{Operación exitosa}}{172}{subsection.9.1.3}\protected@file@percent }
\@writefile{toc}{\contentsline {subsection}{\numberline {9.1.4}{MSG4}~{}{Ingresar datos válidos}}{173}{subsection.9.1.4}\protected@file@percent }
\@writefile{toc}{\contentsline {subsection}{\numberline {9.1.5}{MSG5}~{}{Valor fuera del rango}}{173}{subsection.9.1.5}\protected@file@percent }
\@writefile{toc}{\contentsline {subsection}{\numberline {9.1.6}{MSG6}~{}{Relación de valores incorrecta}}{173}{subsection.9.1.6}\protected@file@percent }
\@writefile{toc}{\contentsline {subsection}{\numberline {9.1.7}{MSG7}~{}{No se encontraron resultados en la búsqueda}}{174}{subsection.9.1.7}\protected@file@percent }
\@writefile{toc}{\contentsline {subsection}{\numberline {9.1.8}{MSG9}~{}{Elementos mínimos necesarios}}{174}{subsection.9.1.8}\protected@file@percent }
\@writefile{toc}{\contentsline {subsection}{\numberline {9.1.9}{MSG10}~{}{Impedimento de acción}}{174}{subsection.9.1.9}\protected@file@percent }
\@writefile{toc}{\contentsline {subsection}{\numberline {9.1.10}{MSG11}~{}{Estado no permitido}}{175}{subsection.9.1.10}\protected@file@percent }
\@writefile{toc}{\contentsline {subsection}{\numberline {9.1.11}{MSG12}~{}{No tiene permisos suficientes}}{175}{subsection.9.1.11}\protected@file@percent }
\@writefile{toc}{\contentsline {subsection}{\numberline {9.1.12}{MSG13}~{}{Formato de archivo no válido}}{175}{subsection.9.1.12}\protected@file@percent }
\@writefile{toc}{\contentsline {subsection}{\numberline {9.1.13}{MSG14}~{}{Cuestionario de contexto sin información registrada}}{175}{subsection.9.1.13}\protected@file@percent }
\gdef \@abspage@last{190}
