CCS PCM C Compiler, Version 5.076, 56587               10-jun.-22 14:35

               Filename:   C:\Users\Alejandro\Desktop\picFinal\picproyecto.lst

               ROM used:   913 words (11%)
                           Largest free fragment is 2048
               RAM used:   24 (7%) at main() level
                           50 (14%) worst case
               Stack used: 0 locations
               Stack size: 8

*
0000:  MOVLW  03
0001:  MOVWF  0A
0002:  GOTO   36C
0003:  NOP
0004:  MOVWF  7F
0005:  SWAPF  03,W
0006:  CLRF   03
0007:  MOVWF  21
0008:  MOVF   0A,W
0009:  MOVWF  20
000A:  CLRF   0A
000B:  MOVF   04,W
000C:  MOVWF  22
000D:  MOVF   77,W
000E:  MOVWF  23
000F:  MOVF   78,W
0010:  MOVWF  24
0011:  MOVF   79,W
0012:  MOVWF  25
0013:  MOVF   7A,W
0014:  MOVWF  26
0015:  BCF    03.7
0016:  BCF    03.5
0017:  BTFSS  0B.5
0018:  GOTO   01B
0019:  BTFSC  0B.2
001A:  GOTO   02C
001B:  MOVF   22,W
001C:  MOVWF  04
001D:  MOVF   23,W
001E:  MOVWF  77
001F:  MOVF   24,W
0020:  MOVWF  78
0021:  MOVF   25,W
0022:  MOVWF  79
0023:  MOVF   26,W
0024:  MOVWF  7A
0025:  MOVF   20,W
0026:  MOVWF  0A
0027:  SWAPF  21,W
0028:  MOVWF  03
0029:  SWAPF  7F,F
002A:  SWAPF  7F,W
002B:  RETFIE
002C:  BCF    0A.3
002D:  BCF    0A.4
002E:  GOTO   1F4
.................... #include <16f877a.h> 
.................... //////////// Standard Header file for the PIC16F877A device //////////////// 
.................... /////////////////////////////////////////////////////////////////////////// 
.................... ////        (C) Copyright 1996, 2014 Custom Computer Services          //// 
.................... //// This source code may only be used by licensed users of the CCS C  //// 
.................... //// compiler.  This source code may only be distributed to other      //// 
.................... //// licensed users of the CCS C compiler.  No other use, reproduction //// 
.................... //// or distribution is permitted without written permission.          //// 
.................... //// Derivative programs created using this software in object code    //// 
.................... //// form are not restricted in any way.                               //// 
.................... /////////////////////////////////////////////////////////////////////////// 
.................... #device PIC16F877A 
002F:  MOVLW  8E
0030:  MOVWF  77
0031:  MOVF   35,W
0032:  MOVWF  78
0033:  MOVF   34,W
0034:  MOVWF  79
0035:  CLRF   7A
0036:  MOVF   78,F
0037:  BTFSS  03.2
0038:  GOTO   043
0039:  MOVF   79,W
003A:  MOVWF  78
003B:  CLRF   79
003C:  MOVLW  08
003D:  SUBWF  77,F
003E:  MOVF   78,F
003F:  BTFSS  03.2
0040:  GOTO   043
0041:  CLRF   77
0042:  GOTO   04B
0043:  BCF    03.0
0044:  BTFSC  78.7
0045:  GOTO   04A
0046:  RLF    79,F
0047:  RLF    78,F
0048:  DECF   77,F
0049:  GOTO   043
004A:  BCF    78.7
004B:  RETURN
004C:  MOVF   40,W
004D:  BTFSC  03.2
004E:  GOTO   0BC
004F:  MOVWF  48
0050:  MOVF   44,W
0051:  BTFSC  03.2
0052:  GOTO   0BC
0053:  ADDWF  48,F
0054:  BTFSC  03.0
0055:  GOTO   05D
0056:  MOVLW  7F
0057:  SUBWF  48,F
0058:  BTFSS  03.0
0059:  GOTO   0BC
005A:  BTFSC  03.2
005B:  GOTO   0BC
005C:  GOTO   061
005D:  MOVLW  81
005E:  ADDWF  48,F
005F:  BTFSC  03.0
0060:  GOTO   0BC
0061:  MOVF   48,W
0062:  MOVWF  77
0063:  CLRF   78
0064:  CLRF   79
0065:  CLRF   7A
0066:  MOVF   41,W
0067:  MOVWF  4C
0068:  BSF    4C.7
0069:  MOVF   42,W
006A:  MOVWF  4B
006B:  MOVF   43,W
006C:  MOVWF  4A
006D:  MOVLW  18
006E:  MOVWF  48
006F:  CLRF   49
0070:  BTFSS  4A.0
0071:  GOTO   08A
0072:  MOVF   47,W
0073:  ADDWF  7A,F
0074:  BTFSS  03.0
0075:  GOTO   07C
0076:  INCF   79,F
0077:  BTFSS  03.2
0078:  GOTO   07C
0079:  INCF   78,F
007A:  BTFSC  03.2
007B:  BSF    49.7
007C:  MOVF   46,W
007D:  ADDWF  79,F
007E:  BTFSS  03.0
007F:  GOTO   083
0080:  INCF   78,F
0081:  BTFSC  03.2
0082:  BSF    49.7
0083:  MOVF   45,W
0084:  MOVWF  42
0085:  BSF    42.7
0086:  MOVF   42,W
0087:  ADDWF  78,F
0088:  BTFSC  03.0
0089:  BSF    49.7
008A:  RLF    49,F
008B:  RRF    78,F
008C:  RRF    79,F
008D:  RRF    7A,F
008E:  RRF    4C,F
008F:  RRF    4B,F
0090:  RRF    4A,F
0091:  BCF    03.0
0092:  DECFSZ 48,F
0093:  GOTO   06F
0094:  MOVLW  01
0095:  ADDWF  77,F
0096:  BTFSC  03.0
0097:  GOTO   0BC
0098:  BTFSC  78.7
0099:  GOTO   0A1
009A:  RLF    4C,F
009B:  RLF    7A,F
009C:  RLF    79,F
009D:  RLF    78,F
009E:  DECF   77,F
009F:  BTFSC  03.2
00A0:  GOTO   0BC
00A1:  BTFSS  4C.7
00A2:  GOTO   0B2
00A3:  INCF   7A,F
00A4:  BTFSS  03.2
00A5:  GOTO   0B2
00A6:  INCF   79,F
00A7:  BTFSS  03.2
00A8:  GOTO   0B2
00A9:  INCF   78,F
00AA:  BTFSS  03.2
00AB:  GOTO   0B2
00AC:  RRF    78,F
00AD:  RRF    79,F
00AE:  RRF    7A,F
00AF:  INCF   77,F
00B0:  BTFSC  03.2
00B1:  GOTO   0BC
00B2:  MOVF   41,W
00B3:  MOVWF  49
00B4:  MOVF   45,W
00B5:  XORWF  49,F
00B6:  BTFSS  49.7
00B7:  GOTO   0BA
00B8:  BSF    78.7
00B9:  GOTO   0C0
00BA:  BCF    78.7
00BB:  GOTO   0C0
00BC:  CLRF   77
00BD:  CLRF   78
00BE:  CLRF   79
00BF:  CLRF   7A
00C0:  RETURN
00C1:  BTFSC  03.1
00C2:  GOTO   0C6
00C3:  MOVLW  48
00C4:  MOVWF  04
00C5:  BCF    03.7
00C6:  CLRF   77
00C7:  CLRF   78
00C8:  CLRF   79
00C9:  CLRF   7A
00CA:  CLRF   48
00CB:  CLRF   49
00CC:  CLRF   4A
00CD:  CLRF   4B
00CE:  MOVF   47,W
00CF:  IORWF  46,W
00D0:  IORWF  45,W
00D1:  IORWF  44,W
00D2:  BTFSC  03.2
00D3:  GOTO   104
00D4:  MOVLW  20
00D5:  MOVWF  4C
00D6:  BCF    03.0
00D7:  RLF    40,F
00D8:  RLF    41,F
00D9:  RLF    42,F
00DA:  RLF    43,F
00DB:  RLF    48,F
00DC:  RLF    49,F
00DD:  RLF    4A,F
00DE:  RLF    4B,F
00DF:  MOVF   47,W
00E0:  SUBWF  4B,W
00E1:  BTFSS  03.2
00E2:  GOTO   0ED
00E3:  MOVF   46,W
00E4:  SUBWF  4A,W
00E5:  BTFSS  03.2
00E6:  GOTO   0ED
00E7:  MOVF   45,W
00E8:  SUBWF  49,W
00E9:  BTFSS  03.2
00EA:  GOTO   0ED
00EB:  MOVF   44,W
00EC:  SUBWF  48,W
00ED:  BTFSS  03.0
00EE:  GOTO   0FE
00EF:  MOVF   44,W
00F0:  SUBWF  48,F
00F1:  MOVF   45,W
00F2:  BTFSS  03.0
00F3:  INCFSZ 45,W
00F4:  SUBWF  49,F
00F5:  MOVF   46,W
00F6:  BTFSS  03.0
00F7:  INCFSZ 46,W
00F8:  SUBWF  4A,F
00F9:  MOVF   47,W
00FA:  BTFSS  03.0
00FB:  INCFSZ 47,W
00FC:  SUBWF  4B,F
00FD:  BSF    03.0
00FE:  RLF    77,F
00FF:  RLF    78,F
0100:  RLF    79,F
0101:  RLF    7A,F
0102:  DECFSZ 4C,F
0103:  GOTO   0D6
0104:  MOVF   48,W
0105:  MOVWF  00
0106:  INCF   04,F
0107:  MOVF   49,W
0108:  MOVWF  00
0109:  INCF   04,F
010A:  MOVF   4A,W
010B:  MOVWF  00
010C:  INCF   04,F
010D:  MOVF   4B,W
010E:  MOVWF  00
010F:  RETURN
0110:  MOVF   04,W
0111:  MOVWF  38
0112:  MOVF   37,W
0113:  MOVWF  3A
0114:  BTFSC  03.2
0115:  GOTO   12F
0116:  MOVF   36,W
0117:  MOVWF  43
0118:  MOVF   35,W
0119:  MOVWF  42
011A:  MOVF   34,W
011B:  MOVWF  41
011C:  MOVF   33,W
011D:  MOVWF  40
011E:  CLRF   47
011F:  CLRF   46
0120:  MOVLW  20
0121:  MOVWF  45
0122:  MOVLW  82
0123:  MOVWF  44
0124:  CALL   04C
0125:  MOVF   7A,W
0126:  MOVWF  36
0127:  MOVF   79,W
0128:  MOVWF  35
0129:  MOVF   78,W
012A:  MOVWF  34
012B:  MOVF   77,W
012C:  MOVWF  33
012D:  DECFSZ 3A,F
012E:  GOTO   116
012F:  MOVF   36,W
0130:  MOVWF  43
0131:  MOVF   35,W
0132:  MOVWF  42
0133:  MOVF   34,W
0134:  MOVWF  41
0135:  MOVF   33,W
0136:  MOVWF  40
0137:  MOVF   40,W
0138:  SUBLW  B6
0139:  MOVWF  40
013A:  CLRF   7A
013B:  MOVF   41,W
013C:  MOVWF  44
013D:  BSF    41.7
013E:  BCF    03.0
013F:  RRF    41,F
0140:  RRF    42,F
0141:  RRF    43,F
0142:  RRF    7A,F
0143:  RRF    79,F
0144:  RRF    78,F
0145:  RRF    77,F
0146:  DECFSZ 40,F
0147:  GOTO   13E
0148:  BTFSS  44.7
0149:  GOTO   155
014A:  COMF   77,F
014B:  COMF   78,F
014C:  COMF   79,F
014D:  COMF   7A,F
014E:  INCF   77,F
014F:  BTFSC  03.2
0150:  INCF   78,F
0151:  BTFSC  03.2
0152:  INCF   79,F
0153:  BTFSC  03.2
0154:  INCF   7A,F
0155:  MOVF   7A,W
0156:  MOVWF  36
0157:  MOVF   79,W
0158:  MOVWF  35
0159:  MOVF   78,W
015A:  MOVWF  34
015B:  MOVF   77,W
015C:  MOVWF  33
015D:  BTFSS  36.7
015E:  GOTO   16C
015F:  DECF   38,F
0160:  BSF    38.5
0161:  COMF   33,F
0162:  COMF   34,F
0163:  COMF   35,F
0164:  COMF   36,F
0165:  INCF   33,F
0166:  BTFSC  03.2
0167:  INCF   34,F
0168:  BTFSC  03.2
0169:  INCF   35,F
016A:  BTFSC  03.2
016B:  INCF   36,F
016C:  MOVLW  3B
016D:  MOVWF  3F
016E:  MOVLW  9A
016F:  MOVWF  3E
0170:  MOVLW  CA
0171:  MOVWF  3D
0172:  CLRF   3C
0173:  MOVLW  0A
0174:  MOVWF  3A
0175:  MOVF   37,W
0176:  BTFSC  03.2
0177:  INCF   38,F
0178:  BSF    03.1
0179:  MOVLW  33
017A:  MOVWF  04
017B:  BCF    03.7
017C:  MOVF   36,W
017D:  MOVWF  43
017E:  MOVF   35,W
017F:  MOVWF  42
0180:  MOVF   34,W
0181:  MOVWF  41
0182:  MOVF   33,W
0183:  MOVWF  40
0184:  MOVF   3F,W
0185:  MOVWF  47
0186:  MOVF   3E,W
0187:  MOVWF  46
0188:  MOVF   3D,W
0189:  MOVWF  45
018A:  MOVF   3C,W
018B:  MOVWF  44
018C:  CALL   0C1
018D:  MOVF   78,W
018E:  MOVF   77,F
018F:  BTFSS  03.2
0190:  GOTO   1A4
0191:  INCF   37,W
0192:  SUBWF  3A,W
0193:  BTFSC  03.2
0194:  GOTO   1A4
0195:  MOVF   38,W
0196:  BTFSC  03.2
0197:  GOTO   1A6
0198:  ANDLW  0F
0199:  SUBWF  3A,W
019A:  BTFSC  03.2
019B:  GOTO   19E
019C:  BTFSC  03.0
019D:  GOTO   1DA
019E:  BTFSC  38.7
019F:  GOTO   1DA
01A0:  BTFSC  38.6
01A1:  GOTO   1A6
01A2:  MOVLW  20
01A3:  GOTO   1D5
01A4:  MOVLW  20
01A5:  ANDWF  38,F
01A6:  BTFSS  38.5
01A7:  GOTO   1B5
01A8:  BCF    38.5
01A9:  MOVF   37,W
01AA:  BTFSS  03.2
01AB:  DECF   38,F
01AC:  MOVF   77,W
01AD:  MOVWF  38
01AE:  MOVLW  2D
01AF:  BTFSS  0C.4
01B0:  GOTO   1AF
01B1:  MOVWF  19
01B2:  MOVF   38,W
01B3:  MOVWF  77
01B4:  CLRF   38
01B5:  MOVF   37,W
01B6:  SUBWF  3A,W
01B7:  BTFSS  03.2
01B8:  GOTO   1C4
01B9:  MOVF   77,W
01BA:  MOVWF  38
01BB:  MOVLW  2E
01BC:  BTFSS  0C.4
01BD:  GOTO   1BC
01BE:  MOVWF  19
01BF:  MOVF   38,W
01C0:  MOVWF  77
01C1:  MOVLW  20
01C2:  ANDWF  38,F
01C3:  MOVLW  00
01C4:  MOVLW  30
01C5:  BTFSS  38.5
01C6:  GOTO   1D5
01C7:  BCF    38.5
01C8:  MOVF   37,W
01C9:  BTFSS  03.2
01CA:  DECF   38,F
01CB:  MOVF   77,W
01CC:  MOVWF  38
01CD:  MOVLW  2D
01CE:  BTFSS  0C.4
01CF:  GOTO   1CE
01D0:  MOVWF  19
01D1:  MOVF   38,W
01D2:  MOVWF  77
01D3:  CLRF   38
01D4:  MOVLW  30
01D5:  ADDWF  77,F
01D6:  MOVF   77,W
01D7:  BTFSS  0C.4
01D8:  GOTO   1D7
01D9:  MOVWF  19
01DA:  BCF    03.1
01DB:  MOVF   3F,W
01DC:  MOVWF  43
01DD:  MOVF   3E,W
01DE:  MOVWF  42
01DF:  MOVF   3D,W
01E0:  MOVWF  41
01E1:  MOVF   3C,W
01E2:  MOVWF  40
01E3:  CLRF   47
01E4:  CLRF   46
01E5:  CLRF   45
01E6:  MOVLW  0A
01E7:  MOVWF  44
01E8:  CALL   0C1
01E9:  MOVF   7A,W
01EA:  MOVWF  3F
01EB:  MOVF   79,W
01EC:  MOVWF  3E
01ED:  MOVF   78,W
01EE:  MOVWF  3D
01EF:  MOVF   77,W
01F0:  MOVWF  3C
01F1:  DECFSZ 3A,F
01F2:  GOTO   178
01F3:  RETURN
*
0244:  MOVF   37,W
0245:  BTFSC  03.2
0246:  GOTO   309
0247:  MOVWF  43
0248:  MOVF   3B,W
0249:  BTFSC  03.2
024A:  GOTO   309
024B:  SUBWF  43,F
024C:  BTFSS  03.0
024D:  GOTO   253
024E:  MOVLW  7F
024F:  ADDWF  43,F
0250:  BTFSC  03.0
0251:  GOTO   309
0252:  GOTO   259
0253:  MOVLW  81
0254:  SUBWF  43,F
0255:  BTFSS  03.0
0256:  GOTO   309
0257:  BTFSC  03.2
0258:  GOTO   309
0259:  MOVF   43,W
025A:  MOVWF  77
025B:  CLRF   78
025C:  CLRF   79
025D:  CLRF   7A
025E:  CLRF   42
025F:  MOVF   38,W
0260:  MOVWF  41
0261:  BSF    41.7
0262:  MOVF   39,W
0263:  MOVWF  40
0264:  MOVF   3A,W
0265:  MOVWF  3F
0266:  MOVLW  19
0267:  MOVWF  43
0268:  MOVF   3E,W
0269:  SUBWF  3F,F
026A:  BTFSC  03.0
026B:  GOTO   27C
026C:  MOVLW  01
026D:  SUBWF  40,F
026E:  BTFSC  03.0
026F:  GOTO   27C
0270:  SUBWF  41,F
0271:  BTFSC  03.0
0272:  GOTO   27C
0273:  SUBWF  42,F
0274:  BTFSC  03.0
0275:  GOTO   27C
0276:  INCF   42,F
0277:  INCF   41,F
0278:  INCF   40,F
0279:  MOVF   3E,W
027A:  ADDWF  3F,F
027B:  GOTO   2AE
027C:  MOVF   3D,W
027D:  SUBWF  40,F
027E:  BTFSC  03.0
027F:  GOTO   297
0280:  MOVLW  01
0281:  SUBWF  41,F
0282:  BTFSC  03.0
0283:  GOTO   297
0284:  SUBWF  42,F
0285:  BTFSC  03.0
0286:  GOTO   297
0287:  INCF   42,F
0288:  INCF   41,F
0289:  MOVF   3D,W
028A:  ADDWF  40,F
028B:  MOVF   3E,W
028C:  ADDWF  3F,F
028D:  BTFSS  03.0
028E:  GOTO   2AE
028F:  INCF   40,F
0290:  BTFSS  03.2
0291:  GOTO   2AE
0292:  INCF   41,F
0293:  BTFSS  03.2
0294:  GOTO   2AE
0295:  INCF   42,F
0296:  GOTO   2AE
0297:  MOVF   3C,W
0298:  IORLW  80
0299:  SUBWF  41,F
029A:  BTFSC  03.0
029B:  GOTO   2AD
029C:  MOVLW  01
029D:  SUBWF  42,F
029E:  BTFSC  03.0
029F:  GOTO   2AD
02A0:  INCF   42,F
02A1:  MOVF   3C,W
02A2:  IORLW  80
02A3:  ADDWF  41,F
02A4:  MOVF   3D,W
02A5:  ADDWF  40,F
02A6:  BTFSS  03.0
02A7:  GOTO   28B
02A8:  INCF   41,F
02A9:  BTFSS  03.2
02AA:  GOTO   28B
02AB:  INCF   42,F
02AC:  GOTO   28B
02AD:  BSF    7A.0
02AE:  DECFSZ 43,F
02AF:  GOTO   2B1
02B0:  GOTO   2BC
02B1:  BCF    03.0
02B2:  RLF    3F,F
02B3:  RLF    40,F
02B4:  RLF    41,F
02B5:  RLF    42,F
02B6:  BCF    03.0
02B7:  RLF    7A,F
02B8:  RLF    79,F
02B9:  RLF    78,F
02BA:  RLF    44,F
02BB:  GOTO   268
02BC:  BTFSS  44.0
02BD:  GOTO   2C4
02BE:  BCF    03.0
02BF:  RRF    78,F
02C0:  RRF    79,F
02C1:  RRF    7A,F
02C2:  RRF    44,F
02C3:  GOTO   2C7
02C4:  DECF   77,F
02C5:  BTFSC  03.2
02C6:  GOTO   309
02C7:  BTFSC  44.7
02C8:  GOTO   2F0
02C9:  BCF    03.0
02CA:  RLF    3F,F
02CB:  RLF    40,F
02CC:  RLF    41,F
02CD:  RLF    42,F
02CE:  MOVF   3E,W
02CF:  SUBWF  3F,F
02D0:  BTFSC  03.0
02D1:  GOTO   2DC
02D2:  MOVLW  01
02D3:  SUBWF  40,F
02D4:  BTFSC  03.0
02D5:  GOTO   2DC
02D6:  SUBWF  41,F
02D7:  BTFSC  03.0
02D8:  GOTO   2DC
02D9:  SUBWF  42,F
02DA:  BTFSS  03.0
02DB:  GOTO   2FF
02DC:  MOVF   3D,W
02DD:  SUBWF  40,F
02DE:  BTFSC  03.0
02DF:  GOTO   2E7
02E0:  MOVLW  01
02E1:  SUBWF  41,F
02E2:  BTFSC  03.0
02E3:  GOTO   2E7
02E4:  SUBWF  42,F
02E5:  BTFSS  03.0
02E6:  GOTO   2FF
02E7:  MOVF   3C,W
02E8:  IORLW  80
02E9:  SUBWF  41,F
02EA:  BTFSC  03.0
02EB:  GOTO   2F0
02EC:  MOVLW  01
02ED:  SUBWF  42,F
02EE:  BTFSS  03.0
02EF:  GOTO   2FF
02F0:  INCF   7A,F
02F1:  BTFSS  03.2
02F2:  GOTO   2FF
02F3:  INCF   79,F
02F4:  BTFSS  03.2
02F5:  GOTO   2FF
02F6:  INCF   78,F
02F7:  BTFSS  03.2
02F8:  GOTO   2FF
02F9:  INCF   77,F
02FA:  BTFSC  03.2
02FB:  GOTO   309
02FC:  RRF    78,F
02FD:  RRF    79,F
02FE:  RRF    7A,F
02FF:  MOVF   38,W
0300:  MOVWF  43
0301:  MOVF   3C,W
0302:  XORWF  43,F
0303:  BTFSS  43.7
0304:  GOTO   307
0305:  BSF    78.7
0306:  GOTO   30D
0307:  BCF    78.7
0308:  GOTO   30D
0309:  CLRF   77
030A:  CLRF   78
030B:  CLRF   79
030C:  CLRF   7A
....................  
.................... #list 
....................  
.................... #include <stdio.h> 
.................... /////////////////////////////////////////////////////////////////////////// 
.................... ////        (C) Copyright 1996,2003 Custom Computer Services           //// 
.................... //// This source code may only be used by licensed users of the CCS C  //// 
.................... //// compiler.  This source code may only be distributed to other      //// 
.................... //// licensed users of the CCS C compiler.  No other use, reproduction //// 
.................... //// or distribution is permitted without written permission.          //// 
.................... //// Derivative programs created using this software in object code    //// 
.................... //// form are not restricted in any way.                               //// 
.................... /////////////////////////////////////////////////////////////////////////// 
....................  
.................... #ifndef _STDIO 
.................... #define _STDIO 
.................... #include <string.h> 
.................... //////////////////////////////////////////////////////////////////////////// 
.................... ////        (C) Copyright 1996,2008 Custom Computer Services            //// 
.................... //// This source code may only be used by licensed users of the CCS C   //// 
.................... //// compiler.  This source code may only be distributed to other       //// 
.................... //// licensed users of the CCS C compiler.  No other use, reproduction  //// 
.................... //// or distribution is permitted without written permission.           //// 
.................... //// Derivative programs created using this software in object code     //// 
.................... //// form are not restricted in any way.                                //// 
.................... //////////////////////////////////////////////////////////////////////////// 
....................  
.................... #ifndef _STRING 
.................... #define _STRING 
.................... #include <stddef.h> 
.................... /////////////////////////////////////////////////////////////////////////// 
.................... ////        (C) Copyright 1996,2003 Custom Computer Services           //// 
.................... //// This source code may only be used by licensed users of the CCS C  //// 
.................... //// compiler.  This source code may only be distributed to other      //// 
.................... //// licensed users of the CCS C compiler.  No other use, reproduction //// 
.................... //// or distribution is permitted without written permission.          //// 
.................... //// Derivative programs created using this software in object code    //// 
.................... //// form are not restricted in any way.                               //// 
.................... /////////////////////////////////////////////////////////////////////////// 
....................  
.................... #ifndef _STDDEF 
....................  
.................... #define _STDDEF 
....................  
.................... #if sizeof(unsigned int8 *)==1 
.................... #define ptrdiff_t unsigned int8 
.................... #else 
.................... #define ptrdiff_t unsigned int16 
.................... #endif 
....................  
.................... #if defined(__PCB__) || defined(__PCM__) 
.................... #define size_t unsigned int8 
.................... #else 
.................... #define size_t unsigned int16 
.................... #endif 
.................... #define wchar_t char 
.................... #define NULL 0 
....................  
.................... #define offsetof(s,f) (offsetofbit(s,f)/8) 
....................  
.................... #endif 
....................  
.................... #include <ctype.h> 
.................... //////////////////////////////////////////////////////////////////////////// 
.................... ////        (C) Copyright 1996,2003 Custom Computer Services            //// 
.................... //// This source code may only be used by licensed users of the CCS C   //// 
.................... //// compiler.  This source code may only be distributed to other       //// 
.................... //// licensed users of the CCS C compiler.  No other use, reproduction  //// 
.................... //// or distribution is permitted without written permission.           //// 
.................... //// Derivative programs created using this software in object code     //// 
.................... //// form are not restricted in any way.                                //// 
.................... //////////////////////////////////////////////////////////////////////////// 
....................  
.................... #ifndef _CTYPE 
.................... #define _CTYPE 
....................  
.................... #define islower(x)  isamong(x,"abcdefghijklmnopqrstuvwxyz") 
.................... #define isupper(x)  isamong(x,"ABCDEFGHIJKLMNOPQRSTUVWXYZ") 
.................... #define isalnum(x)  isamong(x,"0123456789ABCDEFGHIJKLMNOPQRSTUVWXYZabcdefghijklmnopqrstuvwxyz") 
.................... #define isalpha(x)  isamong(x,"ABCDEFGHIJKLMNOPQRSTUVWXYZabcdefghijklmnopqrstuvwxyz") 
.................... #define isdigit(x)  isamong(x,"0123456789") 
.................... #define isspace(x)  ((x)==' ') 
.................... #define isxdigit(x) isamong(x,"0123456789ABCDEFabcdef") 
.................... #define iscntrl(x)  ((x)<' ') 
.................... #define isprint(x)  ((x)>=' ') 
.................... #define isgraph(x)  ((x)>' ') 
.................... #define ispunct(x)  (((x)>' ')&&!isalnum(x)) 
....................  
.................... #endif 
....................  
....................  
....................  
....................  
....................  
.................... ////////////////////////////////////////////// 
.................... //// Uncomment the following define to    //// 
.................... //// allow some functions to use a        //// 
.................... //// quicker algorithm, but use more ROM  //// 
.................... ////                                      //// 
.................... //// #define FASTER_BUT_MORE_ROM          //// 
.................... ////////////////////////////////////////////// 
....................  
....................  
....................  
.................... /*Copying functions*/ 
.................... /* standard template: 
....................    void *memmove(void *s1, void *s2, size_t n). 
....................    Copies max of n characters safely (not following ending '\0') 
....................    from s2 in s1; if s2 has less than n characters, appends 0 */ 
....................  
.................... unsigned char *memmove(void *s1,void *s2,size_t n) 
.................... { 
....................    unsigned char *sc1; 
....................    unsigned char *sc2; 
....................    sc1=s1; 
....................    sc2=s2; 
....................    if(sc2<sc1 && sc1 <sc2 +n) 
....................       for(sc1+=n,sc2+=n;0<n;--n) 
....................          *--sc1=*--sc2; 
....................    else 
....................       for(;0<n;--n) 
....................          *sc1++=*sc2++; 
....................   return s1; 
....................   } 
....................  
.................... /* Standard template: char *strcpy(char *s1, const char *s2) 
....................    copies the string s2 including the null character to s1. 
....................    This is a compiler built in to handle the different address 
....................    spaces */ 
....................  
.................... #define strcopy strcpy 
....................  
.................... /* standard template: 
....................    char *strncpy(char *s1, const char *s2, size_t n). 
....................    Copies max of n characters (not following ending '\0') 
....................    from s2 in s1; if s2 has less than n characters, appends 0 */ 
....................  
.................... unsigned char *strncpy(unsigned char *s1, unsigned char *s2, size_t n) 
.................... { 
....................   unsigned char *s; 
....................  
....................   for (s = s1; n > 0 && *s2 != '\0'; n--) 
....................      *s++ = *s2++; 
....................   for (; n > 0; n--) 
....................      *s++ = '\0'; 
....................  
....................   return(s1); 
.................... } 
.................... /***********************************************************/ 
....................  
.................... /*concatenation functions*/ 
.................... /* standard template: char *strcat(char *s1, const char *s2) 
.................... appends s2 to s1*/ 
....................  
.................... unsigned char *strcat(unsigned char *s1, unsigned char *s2) 
.................... { 
....................    unsigned char *s; 
....................  
....................    for (s = s1; *s != '\0'; ++s); 
....................    while(*s2 != '\0') 
....................    { 
....................       *s = *s2; 
....................       ++s; 
....................       ++s2; 
....................    } 
....................  
....................    *s = '\0'; 
....................    return(s1); 
.................... } 
.................... /* standard template: char *strncat(char *s1, char *s2,size_t n) 
.................... appends not more than n characters from s2 to s1*/ 
....................  
.................... unsigned char *strncat(unsigned char *s1, unsigned char *s2, size_t n) 
.................... { 
....................    unsigned char *s; 
....................  
....................    for (s = s1; *s != '\0'; ++s); 
....................    while(*s2 != '\0' && 0<n) 
....................    { 
....................       *s = *s2; 
....................       ++s; 
....................       ++s2; 
....................       --n; 
....................    } 
....................  
....................    *s = '\0'; 
....................    return(s1); 
.................... } 
....................  
.................... /***********************************************************/ 
....................  
....................  
.................... /*comparison functions*/ 
.................... /* standard template: signed int memcmp(void *s1, void *s2). 
....................    Compares s1 & s2; returns -1 if s1<s2, 0 if s1=s2, 1 if s1>s2 */ 
....................  
.................... signed int8 memcmp(void * s1,void *s2,size_t n) 
.................... { 
.................... unsigned char *su1, *su2; 
.................... for(su1=s1, su2=s2; 0<n; ++su1, ++su2, --n) 
.................... { 
....................    if(*su1!=*su2) 
....................       return ((*su1<*su2)?-1:1); 
.................... } 
.................... return 0; 
.................... } 
....................  
.................... /* standard template: int strcmp(const char *s1, const char *s2). 
....................    Compares s1 & s2; returns -1 if s1<s2, 0 if s1=s2, 1 if s1>s2 */ 
....................  
.................... signed int8 strcmp(unsigned char *s1, unsigned char *s2) 
.................... { 
....................    for (; *s1 == *s2; s1++, s2++) 
....................       if (*s1 == '\0') 
....................          return(0); 
....................    return((*s1 < *s2) ? -1: 1); 
.................... } 
.................... /* standard template: int strcoll(const char *s1, const char *s2). 
....................    Compares s1 & s2; returns -1 if s1<s2, 0 if s1=s2, 1 if s1>s2 */ 
....................  
.................... signed int8 strcoll(unsigned char *s1, unsigned char *s2) 
.................... { 
....................    for (; *s1 == *s2; s1++, s2++) 
....................       if (*s1 == '\0') 
....................          return(0); 
....................    return((*s1 < *s2) ? -1: 1); 
.................... } 
....................  
.................... /* standard template: 
....................    int strncmp(const char *s1, const char *s2, size_t n). 
....................    Compares max of n characters (not following 0) from s1 to s2; 
....................    returns same as strcmp */ 
....................  
.................... signed int8 strncmp(unsigned char *s1, unsigned char *s2, size_t n) 
.................... { 
....................    for (; n > 0; s1++, s2++, n--) 
....................       if (*s1 != *s2) 
....................          return((*s1 <*s2) ? -1: 1); 
....................       else if (*s1 == '\0') 
....................          return(0); 
....................    return(0); 
.................... } 
.................... /* standard template: 
....................    int strxfrm(const char *s1, const char *s2, size_t n). 
....................    transforms maximum of n characters from s2 and places them into s1, returns number of chars written ot s1. 
....................    if s1 is NULL and n is 0, then it returns the length of s2.*/ 
.................... size_t strxfrm(unsigned char *s1, unsigned char *s2, size_t n) 
.................... { 
....................    unsigned char c; 
....................    unsigned int8 n1; 
....................     
....................    if (!s1 && !n) 
....................       n = -1; //find length 
....................  
....................    n1 = 0; 
....................     
....................    for (; n1 < n; n1++) 
....................    { 
....................       c = *s2++; 
....................       if (!c) 
....................          break; 
....................       if (s1) 
....................          *s1++ = c; 
....................    } 
....................  
....................   return(n1); 
.................... } 
....................  
....................  
....................  
....................  
....................  
.................... /***********************************************************/ 
.................... /*Search functions*/ 
.................... /* standard template: void *memchr(const char *s, int c). 
....................    Finds first occurrence of c in n characters of s */ 
....................  
.................... unsigned char *memchr(void *s,unsigned int8 c,size_t n) 
.................... { 
....................    unsigned char uc; 
....................    unsigned char *su; 
....................    uc=c; 
....................    for(su=s;0<n;++su,--n) 
....................       if(*su==uc) 
....................       return su; 
....................    return NULL; 
.................... } 
....................  
.................... /* standard template: char *strchr(const char *s, int c). 
....................    Finds first occurrence of c in s */ 
....................  
.................... unsigned char *strchr(unsigned char *s, unsigned int8 c) 
.................... { 
....................    for (; *s != c; s++) 
....................       if (*s == '\0') 
....................          return(0); 
....................    return(s); 
.................... } 
.................... /* standard template: 
....................    size_t strcspn(const char *s1, const char *s2). 
....................    Computes length of max initial segment of s1 that 
....................    consists entirely of characters NOT from s2*/ 
....................  
.................... unsigned int8  strcspn(unsigned char *s1, unsigned char *s2) 
.................... { 
....................    unsigned char *sc1, *sc2; 
....................  
....................    for (sc1 = s1; *sc1 != 0; sc1++) 
....................       for (sc2 = s2; *sc2 != 0; sc2++) 
....................          if (*sc1 == *sc2) 
....................             return(sc1 - s1); 
....................    return(sc1 - s1); 
.................... } 
.................... /* standard template: 
....................    char *strpbrk(const char *s1, const char *s2). 
....................    Locates first occurence of any character from s2 in s1; 
....................    returns s1 if s2 is empty string */ 
....................  
.................... unsigned char *strpbrk(unsigned char *s1, unsigned char *s2) 
.................... { 
....................    unsigned char *sc1, *sc2; 
....................  
....................    for (sc1 = s1; *sc1 != 0; sc1++) 
....................       for (sc2 = s2; *sc2 != 0; sc2++) 
....................          if (*sc1 == *sc2) 
....................             return(sc1); 
....................    return(0); 
.................... } 
....................  
....................  
.................... /* standard template: char *strrchr(const char *s, int c). 
....................    Finds last occurrence of c in s */ 
....................  
.................... unsigned char *strrchr(unsigned char *s, unsigned int8 c) 
.................... { 
....................    unsigned char *p; 
....................  
....................    for (p = 0; ; s++) 
....................    { 
....................       if (*s == c) 
....................          p = s; 
....................       if (*s == '\0') 
....................          return(p); 
....................    } 
.................... } 
.................... /* computes length of max initial segment of s1 consisting 
....................    entirely of characters from s2 */ 
....................  
.................... unsigned int8  strspn(unsigned char *s1, unsigned char *s2) 
.................... { 
....................    unsigned char *sc1, *sc2; 
....................  
....................    for (sc1 = s1; *sc1 != 0; sc1++) 
....................       for (sc2 = s2; ; sc2++) 
....................     if (*sc2 == '\0') 
....................        return(sc1 - s1); 
....................          else if (*sc1 == *sc2) 
....................             break; 
....................    return(sc1 - s1); 
.................... } 
.................... /* standard template: 
....................    char *strstr(const char *s1, const char *s2); 
....................    Locates first occurence of character sequence s2 in s1; 
....................    returns 0 if s2 is empty string 
....................  
....................    Uncomment #define FASTER_BUT_MORE_ROM at the top of the 
....................    file to use the faster algorithm */ 
.................... unsigned char *strstr(unsigned char *s1, unsigned char *s2) 
.................... { 
....................    unsigned char *s, *t; 
....................  
....................    #ifdef FASTER_BUT_MORE_ROM 
....................    if (*s2 == '\0') 
....................          return(s1); 
....................    #endif 
....................  
....................    while (*s1) 
....................    { 
....................       for(s = s1, t = s2; *t && (*s == *t); ++s, ++t); 
....................  
....................       if (*t == '\0') 
....................          return s1; 
....................       ++s1; 
....................       #ifdef FASTER_BUT_MORE_ROM 
....................          while(*s1 != '\0' && *s1 != *s2) 
....................             ++s1; 
....................       #endif 
....................    } 
....................    return 0; 
.................... } 
....................  
.................... /* standard template: size_t strlen(const char *s). 
....................    Computes length of s1 (preceding terminating 0) */ 
....................  
.................... size_t strlen(unsigned char *s) 
.................... { 
....................    unsigned char *sc; 
....................  
....................    for (sc = s; *sc != 0; sc++); 
....................    return(sc - s); 
.................... } 
....................  
.................... /* standard template: char *strtok(char *s1, const char *s2). 
....................  
....................    Finds next token in s1 delimited by a character from separator 
....................    string s2 (which can be different from call to call).  First call 
....................    starts at beginning of s1 searching for first character NOT 
....................    contained in s2; returns 0 if none is found. 
....................    If one is found, it is the start of first token (return value). 
....................    Function then searches from there for a character contained in s2. 
....................    If none is found, current token extends to end of s1, and subsequent 
....................    searches for a token will return 0.  If one is found, it is 
....................    overwritten by '\0', which terminates current token.  Function saves 
....................    pointer to following character from which next search will start. 
....................    Each subsequent call, with 0 as first argument, starts searching 
....................    from saved pointer */ 
....................  
.................... unsigned char *strtok(unsigned char *s1, unsigned char *s2) 
.................... { 
....................    unsigned char *beg, *end; 
....................    static char *save; 
*
0381:  BCF    03.5
0382:  CLRF   27
0383:  CLRF   28
....................  
....................    beg = (s1)? s1: save; 
....................    beg += strspn(beg, s2); 
....................    if (*beg == '\0') 
....................       return(0); 
....................        
....................    end = strpbrk(beg, s2); 
....................    if (end != '\0') 
....................    { 
....................       *end = '\0'; 
....................       end++; 
....................       save = end; 
....................    } 
....................    else 
....................       save = beg + strlen(beg); 
....................     
....................    return(beg); 
.................... } 
....................  
.................... /*****************************************************************/ 
.................... /*Miscellaneous functions*/ 
.................... /* standard template 
.................... maps error number in errnum to an error message string 
.................... Returns: Pointer to string 
.................... */ 
.................... #ifdef _ERRNO 
.................... unsigned char * strerror(unsigned int8 errnum) 
.................... { 
.................... static unsigned char s[13]; 
.................... switch( errnum) 
.................... { 
.................... case 0: 
....................    strcpy(s,"no errors"); 
....................    return s; 
.................... case EDOM : 
....................    strcpy(s,"domain error"); 
....................    return s; 
.................... case ERANGE: 
....................    strcpy(s,"range error"); 
....................    return s; 
.................... } 
.................... } 
.................... #ENDIF 
....................  
.................... /* standard template: size_t stricmp(const char *s1, const char *s2). 
....................    Compares s1 to s2 ignoring case (upper vs. lower) */ 
....................  
.................... signed int8 stricmp(unsigned char *s1, unsigned char *s2) 
.................... { 
....................  for(; *s1==*s2||(isalpha(*s1)&&isalpha(*s2)&&(*s1==*s2+32||*s2==*s1+32)); 
....................     s1++, s2++) 
....................     if (*s1 == '\0') 
....................        return(0); 
....................  return((*s1 < *s2) ? -1: 1); 
.................... } 
....................  
....................  
.................... /* standard template: char *strlwr(char *s). 
....................    Replaces uppercase letters by lowercase; 
....................    returns pointer to new string s */ 
....................  
.................... unsigned char *strlwr(unsigned char *s) 
.................... { 
....................    unsigned char *p; 
....................  
....................    for (p = s; *p != '\0'; p++) 
....................       if (*p >= 'A' && *p <='Z') 
....................          *p += 'a' - 'A'; 
....................    return(s); 
.................... } 
....................  
.................... /* standard template: char *strupr(char *s). 
....................    Replaces lowercase letters by upercase; 
....................    returns pointer to new string s */ 
....................  
.................... unsigned char *strupr(unsigned char *s) 
.................... { 
....................    unsigned char *p; 
....................  
....................    for (p = s; *p != '\0'; p++) 
....................       if (*p >= 'a' && *p <='z') 
....................          *p -= 'a' - 'A'; 
....................    return(s); 
.................... } 
....................  
....................  
.................... /************************************************************/ 
....................  
....................  
.................... #endif 
....................  
.................... #ifndef getc 
.................... #define getc getch 
.................... #define getchar getch 
.................... #define puts(s) {printf(s); putchar(13); putchar(10);} 
.................... #define putc putchar 
.................... #endif 
.................... /* maps error number to an error message. Writes a sequence of characters to 
.................... stderr stream thus: if s is not null then string pointed to by s follwed by 
.................... a colon (:) and a space and the appropriate error message returned by strerror 
.................... function with argument errno 
....................  
.................... Returns: no value 
.................... */ 
....................  
.................... #ifdef _ERRNO 
.................... void perror(char *s) 
.................... { 
....................   if(s) 
....................   fprintf(STDERR,"%s: ",s); 
....................   fprintf(STDERR,"%s\r\n",strerror(errno)); 
.................... } 
.................... #endif 
.................... #endif 
....................  
.................... #fuses XT, NOWDT, NOPROTECT 
.................... #use delay (clock=4M) 
.................... #use rs232 (baud=9600, parity=N, xmit=pin_c6, rcv=pin_c7, bits=8) 
....................  
.................... void leersensortemperatura (); 
.................... void leersensorluz (); 
....................    long contador = 0; 
....................    float valortemp; 
....................    float valorluz; 
....................     
.................... #int_TIMER0 
.................... void timer0_interruocion(){ 
....................    contador++; 
*
01F4:  INCF   29,F
01F5:  BTFSC  03.2
01F6:  INCF   2A,F
....................       if (contador == 1000){ 
01F7:  MOVF   29,W
01F8:  SUBLW  E8
01F9:  BTFSS  03.2
01FA:  GOTO   366
01FB:  MOVF   2A,W
01FC:  SUBLW  03
01FD:  BTFSS  03.2
01FE:  GOTO   366
....................          leersensortemperatura(); 
....................          leersensorluz();       
....................       } 
....................       set_timer0(255); 
*
0366:  MOVLW  FF
0367:  MOVWF  01
....................  
0368:  BCF    0B.2
0369:  BCF    0A.3
036A:  BCF    0A.4
036B:  GOTO   01B
.................... } 
....................  
.................... void main(){ 
036C:  MOVF   03,W
036D:  ANDLW  1F
036E:  MOVWF  03
036F:  MOVLW  19
0370:  BSF    03.5
0371:  MOVWF  19
0372:  MOVLW  A6
0373:  MOVWF  18
0374:  MOVLW  90
0375:  BCF    03.5
0376:  MOVWF  18
0377:  CLRF   2A
0378:  CLRF   29
0379:  BSF    03.5
037A:  BSF    1F.0
037B:  BSF    1F.1
037C:  BSF    1F.2
037D:  BCF    1F.3
037E:  MOVLW  07
037F:  MOVWF  1C
0380:  BCF    03.7
....................     
....................       setup_timer_0(RTCC_INTERNAL | RTCC_DIV_256); 
*
0384:  BSF    03.5
0385:  MOVF   01,W
0386:  ANDLW  C0
0387:  IORLW  07
0388:  MOVWF  01
....................       enable_interrupts(INT_TIMER0); 
0389:  BCF    03.5
038A:  BSF    0B.5
....................       enable_interrupts(GLOBAL); 
038B:  MOVLW  C0
038C:  IORWF  0B,F
....................       set_timer0(255); 
038D:  MOVLW  FF
038E:  MOVWF  01
....................    
....................       while (true){ 
038F:  GOTO   38F
....................       
....................      } 
.................... } 
....................  
0390:  SLEEP
.................... void leersensortemperatura(){ 
....................    setup_adc_ports(all_analog); 
*
01FF:  BSF    03.5
0200:  BCF    1F.0
0201:  BCF    1F.1
0202:  BCF    1F.2
0203:  BCF    1F.3
....................    setup_adc(adc_clock_internal); 
0204:  BCF    1F.6
0205:  BCF    03.5
0206:  BSF    1F.6
0207:  BSF    1F.7
0208:  BSF    03.5
0209:  BCF    1F.7
020A:  BCF    03.5
020B:  BSF    1F.0
....................    set_adc_channel(0); 
020C:  MOVLW  00
020D:  MOVWF  78
020E:  MOVF   1F,W
020F:  ANDLW  C7
0210:  IORWF  78,W
0211:  MOVWF  1F
....................    delay_us(50); 
0212:  MOVLW  10
0213:  MOVWF  77
0214:  DECFSZ 77,F
0215:  GOTO   214
0216:  NOP
....................    valortemp=((read_adc()*5.0)/1023); 
0217:  BSF    1F.2
0218:  BTFSC  1F.2
0219:  GOTO   218
021A:  CLRF   35
021B:  MOVF   1E,W
021C:  MOVWF  34
021D:  CALL   02F
021E:  MOVF   7A,W
021F:  MOVWF  43
0220:  MOVF   79,W
0221:  MOVWF  42
0222:  MOVF   78,W
0223:  MOVWF  41
0224:  MOVF   77,W
0225:  MOVWF  40
0226:  CLRF   47
0227:  CLRF   46
0228:  MOVLW  20
0229:  MOVWF  45
022A:  MOVLW  81
022B:  MOVWF  44
022C:  CALL   04C
022D:  MOVF   7A,W
022E:  MOVWF  36
022F:  MOVF   79,W
0230:  MOVWF  35
0231:  MOVF   78,W
0232:  MOVWF  34
0233:  MOVF   77,W
0234:  MOVWF  33
0235:  MOVF   36,W
0236:  MOVWF  3A
0237:  MOVF   35,W
0238:  MOVWF  39
0239:  MOVF   34,W
023A:  MOVWF  38
023B:  MOVF   33,W
023C:  MOVWF  37
023D:  CLRF   3E
023E:  MOVLW  C0
023F:  MOVWF  3D
0240:  MOVLW  7F
0241:  MOVWF  3C
0242:  MOVLW  88
0243:  MOVWF  3B
*
030D:  MOVF   7A,W
030E:  MOVWF  2E
030F:  MOVF   79,W
0310:  MOVWF  2D
0311:  MOVF   78,W
0312:  MOVWF  2C
0313:  MOVF   77,W
0314:  MOVWF  2B
....................     
....................    printf("%0.2f\r\n",valortemp); 
0315:  MOVLW  C9
0316:  MOVWF  04
0317:  MOVF   2E,W
0318:  MOVWF  36
0319:  MOVF   2D,W
031A:  MOVWF  35
031B:  MOVF   2C,W
031C:  MOVWF  34
031D:  MOVF   2B,W
031E:  MOVWF  33
031F:  MOVLW  02
0320:  MOVWF  37
0321:  CALL   110
0322:  MOVLW  0D
0323:  BTFSS  0C.4
0324:  GOTO   323
0325:  MOVWF  19
0326:  MOVLW  0A
0327:  BTFSS  0C.4
0328:  GOTO   327
0329:  MOVWF  19
....................     
.................... } 
....................  
.................... void leersensorluz(){ 
....................    setup_adc_ports(all_analog); 
032A:  BSF    03.5
032B:  BCF    1F.0
032C:  BCF    1F.1
032D:  BCF    1F.2
032E:  BCF    1F.3
....................    setup_adc(adc_clock_internal); 
032F:  BCF    1F.6
0330:  BCF    03.5
0331:  BSF    1F.6
0332:  BSF    1F.7
0333:  BSF    03.5
0334:  BCF    1F.7
0335:  BCF    03.5
0336:  BSF    1F.0
....................    set_adc_channel(1); 
0337:  MOVLW  08
0338:  MOVWF  78
0339:  MOVF   1F,W
033A:  ANDLW  C7
033B:  IORWF  78,W
033C:  MOVWF  1F
....................    delay_us(50); 
033D:  MOVLW  10
033E:  MOVWF  77
033F:  DECFSZ 77,F
0340:  GOTO   33F
0341:  NOP
....................    valorluz=(read_adc()); 
0342:  BSF    1F.2
0343:  BTFSC  1F.2
0344:  GOTO   343
0345:  MOVF   1E,W
0346:  CLRF   35
0347:  MOVWF  34
0348:  CALL   02F
0349:  MOVF   7A,W
034A:  MOVWF  32
034B:  MOVF   79,W
034C:  MOVWF  31
034D:  MOVF   78,W
034E:  MOVWF  30
034F:  MOVF   77,W
0350:  MOVWF  2F
....................     
....................    printf("%0.2f\r\n",valorluz); 
0351:  MOVLW  C9
0352:  MOVWF  04
0353:  MOVF   32,W
0354:  MOVWF  36
0355:  MOVF   31,W
0356:  MOVWF  35
0357:  MOVF   30,W
0358:  MOVWF  34
0359:  MOVF   2F,W
035A:  MOVWF  33
035B:  MOVLW  02
035C:  MOVWF  37
035D:  CALL   110
035E:  MOVLW  0D
035F:  BTFSS  0C.4
0360:  GOTO   35F
0361:  MOVWF  19
0362:  MOVLW  0A
0363:  BTFSS  0C.4
0364:  GOTO   363
0365:  MOVWF  19
....................     
.................... } 
....................  
....................  

Configuration Fuses:
   Word  1: 3F71   XT NOWDT PUT BROWNOUT NOLVP NOCPD NOWRT NODEBUG NOPROTECT
