module gitlab.com/a.bitiev/auth

go 1.19

require (
	github.com/go-chi/chi v1.5.4
	github.com/go-chi/render v1.0.2
	github.com/ilyakaznacheev/cleanenv v1.4.0
	github.com/jackc/pgconn v1.13.0
	github.com/jackc/pgx/v4 v4.17.2
	github.com/pkg/errors v0.9.1
	github.com/sirupsen/logrus v1.9.0
)

require (
	github.com/BurntSushi/toml v1.2.1 // indirect
	github.com/ajg/form v1.5.1 // indirect
	github.com/jackc/chunkreader/v2 v2.0.1 // indirect
	github.com/jackc/pgio v1.0.0 // indirect
	github.com/jackc/pgpassfile v1.0.0 // indirect
	github.com/jackc/pgproto3/v2 v2.3.1 // indirect
	github.com/jackc/pgservicefile v0.0.0-20200714003250-2b9c44734f2b // indirect
	github.com/jackc/pgtype v1.12.0 // indirect
	github.com/jackc/puddle v1.3.0 // indirect
	github.com/joho/godotenv v1.4.0 // indirect
	golang.org/x/crypto v0.1.0 // indirect
	golang.org/x/sys v0.1.0 // indirect
	golang.org/x/text v0.4.0 // indirect
	gopkg.in/yaml.v3 v3.0.1 // indirect
	olympos.io/encoding/edn v0.0.0-20201019073823-d3554ca0b0a3 // indirect
)
