list_name;key;value;relation
STRATE_VALUES;0;;0
STRATE_VALUES;1;i;0
STRATE_VALUES;2;r;0
STRATE_VALUES;3;+;0
STRATE_VALUES;4;1;0
STRATE_VALUES;5;2;0
STRATE_VALUES;6;3;0
STRATE_VALUES;7;4;0
STRATE_VALUES;8;5;0
PENTE_VALUES;0;;0
PENTE_VALUES;1;< 1°;0
PENTE_VALUES               ;2  ;1 à 6°                                                               ;0
PENTE_VALUES;3;6 à 27°;0
PENTE_VALUES;4;27 à 45°;0
PENTE_VALUES;5;45 à 70°;0
PENTE_VALUES;6;> 70°;0
EXPOSITION_VALUES;0;;0
EXPOSITION_VALUES;1;Nord;0
EXPOSITION_VALUES;2;Nord-Est;0
EXPOSITION_VALUES;3;Est;0
EXPOSITION_VALUES;4;Sud-Est;0
EXPOSITION_VALUES;5;Sud;0
EXPOSITION_VALUES;6;Sud-Ouest;0
EXPOSITION_VALUES;7;Ouest;0
EXPOSITION_VALUES;8;Nord-Ouest;0
EXPOSITION_VALUES;9;Pas d'exposition dominante;0
SALINITE_VALUES;0;;0
SALINITE_VALUES;1;Halophile;0
SALINITE_VALUES;2;Subhalophile;0
SALINITE_VALUES;3;Oligohalophile;0
SALINITE_VALUES;4;Glycophile;0
SALINITE_VALUES;5;Dulçaquicole;0
HUMIDITE_VALUES;0;;0
HUMIDITE_VALUES;1;Aquatique;0
HUMIDITE_VALUES;2;Hydrophile;0
HUMIDITE_VALUES;3;Hygrophile;0
HUMIDITE_VALUES;4;Mésohygrophile;0
HUMIDITE_VALUES;5;Mésohygrocline;0
HUMIDITE_VALUES;6;Mésophile;0
HUMIDITE_VALUES;7;Mésoxérophile;0
HUMIDITE_VALUES;8;Xérophile;0
PH_SOL_VALUES;0;;0
PH_SOL_VALUES;1;Hyperacidiphile;0
PH_SOL_VALUES;2;Acidiphile;0
PH_SOL_VALUES;3;Acidiclinophile;0
PH_SOL_VALUES;4;Neutrophile;0
PH_SOL_VALUES;5;Basiphile;0
PH_SOL_VALUES;6;Hyperbasiphile;0
NIV_TROPHIE_VALUES;0;;0
NIV_TROPHIE_VALUES;1;Oligotrophe;0
NIV_TROPHIE_VALUES;2;Oligotrophe à mésotrophe;0
NIV_TROPHIE_VALUES;3;Mésotrophe;0
NIV_TROPHIE_VALUES;4;Mésotrophe à eutrophe;0
NIV_TROPHIE_VALUES;5;Eutrophe;0
NIV_TROPHIE_VALUES;6;Dystrophe;0
NIV_TROPHIE_VALUES;7;Hypertrophe;0
TOPOGRAPHIE_VALUES;0;;0
TOPOGRAPHIE_VALUES;1;Terrain plat;0
TOPOGRAPHIE_VALUES;2;Sommet vif;0
TOPOGRAPHIE_VALUES;3;Escarpement;0
TOPOGRAPHIE_VALUES;11;Replat de versant;0
TOPOGRAPHIE_VALUES;12;Haut de versant;0
TOPOGRAPHIE_VALUES;13;Milieu de versant;0
TOPOGRAPHIE_VALUES;14;Bas de versant;0
TOPOGRAPHIE_VALUES;9;Dépression ouverte (vallon, combe, gorge, etc.);0
TOPOGRAPHIE_VALUES         ;10 ;Dépression fermée (cuvette, mare, doline, etc.)                      ;0
TOPOGRAPHIE_VALUES;17;Pied de paroi;0
TOPOGRAPHIE_VALUES;18;Paroi naturelle;0
TOPOGRAPHIE_VALUES;19;Paroi artificielle;0
TOPOGRAPHIE_VALUES;13;Situation topographique hétérogène;0
PHYSIO_VALUES;0;;0
PHYSIO_VALUES;13;Forêt;0
PHYSIO_VALUES;14;Fourré;0
PHYSIO_VALUES;15;Lande;0
PHYSIO_VALUES;16;Ourlet;0
PHYSIO_VALUES;17;Cariçaie / Roselière;0
PHYSIO_VALUES;18;Riveraine basse;0
PHYSIO_VALUES;19;Prairie;0
PHYSIO_VALUES;21;Communauté annuelle;0
PHYSIO_VALUES;22;Herbier;0
PHYSIO_VALUES;23;Rupicole;0
PHYSIO_VALUES;24;Friche;0
PHYSIO_VALUES;26;Culture;0
PHYSIO_VALUES;27;Mégaphorbiaies;0
PHYSIO_VALUES;28;Tourbière;0
PHYSIO_VALUES;29;Rivière;0
PHYSIO_VALUES;20;Pelouse;0
PHYSIO_VALUES;30;Messicole;0
TYPE_BIO_VALUES;0;;0
TYPE_BIO_VALUES;9;Hydrophytaie;0
TYPE_BIO_VALUES;10;Thérophytaie;0
TYPE_BIO_VALUES;11;Géophytaie;0
TYPE_BIO_VALUES;12;Hémicryptophytaie;0
TYPE_BIO_VALUES;13;Hélophytaie;0
TYPE_BIO_VALUES;14;Chaméphytaie;0
TYPE_BIO_VALUES;15;Phanérophytaie;0
TYPE_BIO_VALUES;16;Epiphytaie;0
TYPE_BIO_VALUES;17;NanoPhanérophytaie;0
TYPICITE_VALUES;0;;0
TYPICITE_VALUES;5;Bonne;0
TYPICITE_VALUES;6;Moyenne;0
TYPICITE_VALUES;7;Mauvaise;0
TYPICITE_VALUES;8;Non évaluée;0
PROTOCOLE_VALUES;0;;0
PROTOCOLE_VALUES;1;inventaire flore;1
PROTOCOLE_VALUES;2;inventaire d'espèces à enjeux;1
PROTOCOLE_VALUES;3;relevé de suivi d'espèce;1
PROTOCOLE_VALUES;4;occurrence végétation;2
PROTOCOLE_VALUES;5;relevé floristique;2
PROTOCOLE_VALUES;6;relevé phyto sigmatiste;2
PROTOCOLE_VALUES;7;relevé phyto synusiale;2
PROTOCOLE_VALUES;8;inventaire d'espèces à enjeux;2
PROTOCOLE_VALUES;9;relevé de suivi d'espèce;2
PROTOCOLE_VALUES;10;relevé paysager;3
PROTOCOLE_VALUES;11;cartographie de site;3
PROTOCOLE_VALUES;12;inventaire de végétations;3
PROTOCOLE_VALUES;13;relevé de suivi de végétation;3
TYPE_REL_VALUES;0;;0
TYPE_REL_VALUES;1;relevé flore strict;0
TYPE_REL_VALUES;2;relevé flore végétation;0
TYPE_REL_VALUES;3;relevé végétations strict;0
TYPE_FORME_VALUES;0;;0
TYPE_FORME_VALUES;1;O - Grand spatial;0
TYPE_FORME_VALUES;2;o - petit spatial;0
TYPE_FORME_VALUES;3;/ - linéaire;0
TYPE_FORME_VALUES;4;% - Spatio-linéaire;0
TYPE_FORME_VALUES;5;-/- Linéaire disjointe;0
TYPE_FORME_VALUES;6;.:. - mosaïque ou pluriponctuel;0
TYPE_FORME_VALUES;7;. - ponctuel;0
COMM_NON_SATUREES_VALUES;0;;0
COMM_NON_SATUREES_VALUES;1;Communauté basale;0
COMM_NON_SATUREES_VALUES;2;Communauté dérivée;0
COMM_NON_SATUREES_VALUES;3;Communautée fragmentaire;0
TECHNIQUE_COLLECTE_VALUES;0;;0
TECHNIQUE_COLLECTE_VALUES;10;Observation directe terrestre diurne;0
TECHNIQUE_COLLECTE_VALUES;50;Observation à distance;0
TECHNIQUE_COLLECTE_VALUES;70;Extrapolation;0
TECHNIQUE_COLLECTE_VALUES;90;Vidéo et photographies;0
TECHNIQUE_COLLECTE_VALUES;92;Caméra tractée ou téléguidée;0
TECHNIQUE_COLLECTE_VALUES;94;Observation photographique aérienne, suivie d'une photointerprétation;0
TECHNIQUE_COLLECTE_VALUES;95;Observation photographique terrestre suivie d'une photointerprétation;0
TECHNIQUE_COLLECTE_VALUES;100;Autre, à préciser;0
THERMIE_VALUES;0;;0
THERMIE_VALUES;1;Cryophile;0
THERMIE_VALUES;2;Mésocryophile;0
THERMIE_VALUES;3;Psycrophile;0
THERMIE_VALUES;4;Mésothermophile;0
THERMIE_VALUES;5;Thermoclinophile;0
THERMIE_VALUES;6;Thermophile;0
ENNEIGEMENT_VALUES;0;;0
ENNEIGEMENT_VALUES;1;Hyperchionophile;0
ENNEIGEMENT_VALUES;2;Chionophile;0
ENNEIGEMENT_VALUES;3;Mésochionophile;0
ENNEIGEMENT_VALUES;4;Non concerné;0
TAILLE_COURS_EAU_VALUES;0;;0
TAILLE_COURS_EAU_VALUES;1;suintement (dont source);0
TAILLE_COURS_EAU_VALUES;2;ruisseau;0
TAILLE_COURS_EAU_VALUES;3;petite rivière;0
TAILLE_COURS_EAU_VALUES;4;grande rivière;0
VITESSE_EAU_VALUES;0;;0
VITESSE_EAU_VALUES;1;stagnante;0
VITESSE_EAU_VALUES;2;peu courante;0
VITESSE_EAU_VALUES;3;courante;0
VITESSE_EAU_VALUES;4;torrentielle;0
TEXTURE_SOL_VALUES;0;;0
TEXTURE_SOL_VALUES;1;Argileux;0
TEXTURE_SOL_VALUES;2;Limoneux;0
TEXTURE_SOL_VALUES;3;Sableux;0
COHERENCE_TEMPORELLE_VALUES;0;;0
COHERENCE_TEMPORELLE_VALUES;1  ;Trop tôt                                                             ;0
COHERENCE_TEMPORELLE_VALUES;2  ;Bonne période                                                        ;0
COHERENCE_TEMPORELLE_VALUES;3  ;Trop tard                                                            ;0
SUPPORT_VALUES             ;0  ;                                                                     ;0
SUPPORT_VALUES             ;1  ;Rochers non calcaires                                                ;0
SUPPORT_VALUES             ;2  ;Calcaire                                                             ;0
SUPPORT_VALUES             ;3  ;Eau                                                                  ;0
SUPPORT_VALUES             ;4  ;Sol                                                                  ;0
SUPPORT_VALUES             ;5  ;Tourbe                                                               ;0
SUPPORT_VALUES             ;6  ;Ecorce                                                               ;0
SUPPORT_VALUES             ;7  ;Bois mort                                                            ;0
SUPPORT_VALUES             ;8  ;Feuilles et tiges vivantes (de plantes vasculaires)                  ;0
SUPPORT_VALUES             ;9  ;Lichens                                                              ;0
SUPPORT_VALUES             ;10 ;Mousses                                                              ;0
SUPPORT_VALUES             ;12 ;Divers (autres cas)                                                  ;0
SUPPORT_VALUES             ;11 ;Substrat Artificiel                                                  ;0
INDICE_AGGREGATION_VALUES  ;0  ;                                                                     ;0
INDICE_AGGREGATION_VALUES  ;1  ;Isolée                                                               ;0
INDICE_AGGREGATION_VALUES  ;2  ;Eclatée en fragments réduits                                         ;0
INDICE_AGGREGATION_VALUES  ;3  ;Peu fragmentée et peu étendue                                        ;0
INDICE_AGGREGATION_VALUES  ;4  ;Peu fragmentée et étendue                                            ;0
INDICE_AGGREGATION_VALUES  ;5  ;Non fragmentée et étendue                                            ;0
INDICE_SOCIABILITE_VALUES  ;0  ;                                                                     ;0
INDICE_SOCIABILITE_VALUES  ;2  ;En petits groupes ou touffes                                         ;0
INDICE_SOCIABILITE_VALUES  ;3  ;En groupes                                                           ;0
INDICE_SOCIABILITE_VALUES  ;5  ;En peuplements                                                       ;0
INDICE_SOCIABILITE_VALUES  ;4  ;En petites colonies                                                  ;0
METHODE_DENOMBREMENT_VALUES;0  ;                                                                     ;0
METHODE_DENOMBREMENT_VALUES;1  ;Quantification exhaustive                                            ;0
METHODE_DENOMBREMENT_VALUES;2  ;Extrapolation après comptage sur des surfaces élémentaires           ;0
STATUT_PHENOLOGIQUE_VALUES ;0  ;                                                                     ;0
STATUT_PHENOLOGIQUE_VALUES ;1  ;non renseigné                                                        ;0
STATUT_PHENOLOGIQUE_VALUES ;2  ;germination                                                          ;0
STATUT_PHENOLOGIQUE_VALUES ;3  ;plantule                                                             ;0
STATUT_PHENOLOGIQUE_VALUES ;4  ;juvénile (non fleuri)                                                ;0
STATUT_PHENOLOGIQUE_VALUES ;5  ;adulte (non fleuri)                                                  ;0
STATUT_PHENOLOGIQUE_VALUES ;6  ;en bouton                                                            ;0
STATUT_PHENOLOGIQUE_VALUES ;7  ;début de floraison                                                   ;0
STATUT_PHENOLOGIQUE_VALUES ;8  ;pleine floraison                                                     ;0
STATUT_PHENOLOGIQUE_VALUES ;9  ;fin de floraison                                                     ;0
STATUT_PHENOLOGIQUE_VALUES ;10 ;début de fructification                                              ;0
STATUT_PHENOLOGIQUE_VALUES ;11 ;pleine fructification                                                ;0
STATUT_PHENOLOGIQUE_VALUES ;12 ;fin de fructification                                                ;0
STATUT_PHENOLOGIQUE_VALUES ;12 ;dissémination des graines                                            ;0
STATUT_PHENOLOGIQUE_VALUES ;13 ;tiges desséchées                                                     ;0
STATUT_PHENOLOGIQUE_VALUES ;16 ;mort                                                                 ;0
STATUT_DETERMINATION_VALUES;0  ;                                                                     ;0
STATUT_DETERMINATION_VALUES;1  ;cf.                                                                  ;0
STATUT_DETERMINATION_VALUES;5  ;aff.                                                                 ;0
STATUT_DETERMINATION_VALUES;4  ;!                                                                    ;0
STATUT_DETERMINATION_VALUES;2  ;sensu lato                                                           ;0
STATUT_DETERMINATION_VALUES;3  ;sensu stricto                                                        ;0
STATUT_SPONTANEITE_VALUES  ;0  ;                                                                     ;0
STATUT_SPONTANEITE_VALUES  ;1  ;Non renseigné                                                        ;0
STATUT_SPONTANEITE_VALUES  ;2  ;Spontané [W]                                                         ;0
STATUT_SPONTANEITE_VALUES  ;3  ;Subspontané [WQ]                                                     ;0
STATUT_SPONTANEITE_VALUES  ;4  ;Cultivé (planté ou semé) [Q]                                         ;0
STATUT_SPONTANEITE_VALUES  ;5  ;Indéterminé                                                          ;0
CLASSE_EFFECTIFS_VALUES    ;0  ;Non renseigné                                                        ;0
CLASSE_EFFECTIFS_VALUES    ;10 ;-                                                                    ;0
CLASSE_EFFECTIFS_VALUES    ;1  ;1 à 10                                                               ;0
CLASSE_EFFECTIFS_VALUES    ;2  ;10 à 50                                                              ;0
CLASSE_EFFECTIFS_VALUES    ;3  ;50 à 100                                                             ;0
CLASSE_EFFECTIFS_VALUES    ;4  ;100 à 500                                                            ;0
CLASSE_EFFECTIFS_VALUES    ;5  ;500 à 1 000                                                          ;0
CLASSE_EFFECTIFS_VALUES    ;6  ;1 000 à 5 000                                                        ;0
CLASSE_EFFECTIFS_VALUES    ;7  ;5 000 à 10 000                                                       ;0
CLASSE_EFFECTIFS_VALUES    ;8  ;Supérieur à 10 000                                                   ;0
CLASSE_SURFACES_VALUES     ;0  ;Non renseigné                                                        ;0
CLASSE_SURFACES_VALUES     ;1  ;Inférieur à 10 m²                                                    ;0
CLASSE_SURFACES_VALUES     ;2  ;10 à 50 m²                                                           ;0
CLASSE_SURFACES_VALUES     ;3  ;50 à 100 m²                                                          ;0
CLASSE_SURFACES_VALUES;4;100 à 500 m²;0
CLASSE_SURFACES_VALUES;5;500 à 1 000 m²;0
CLASSE_SURFACES_VALUES;6;1 000 à 5 000 m²;0
CLASSE_SURFACES_VALUES;7;5 000 à 10 000 m²;0
CLASSE_SURFACES_VALUES;8;1 ha à 10 ha;0
CLASSE_SURFACES_VALUES;9;Supérieur à 10 ha;0
UNITE_VEGE_VALUES;0;;0
UNITE_VEGE_VALUES;1;Unité non complexe;0
UNITE_VEGE_VALUES;2;Mosaïque non définie;0
UNITE_VEGE_VALUES;3;Mosaïque temporelle;0
UNITE_VEGE_VALUES;4;Mosaïque topographique;0
UNITE_VEGE_VALUES;5;Unité mixte;0
QUALITE_RELEVE_VALUES;0;;0
QUALITE_RELEVE_VALUES;1;Bonne;0
QUALITE_RELEVE_VALUES;2;Moyenne;0
QUALITE_RELEVE_VALUES;3;Faible;0
STRATES_VALUES;0;;0
STRATES_VALUES;10;(A) Strate arborée;0
STRATES_VALUES;20;(a) Strate arbustive;0
STRATES_VALUES;30;(h) Strate herbacée;0
STRATES_VALUES;40;Recouvrement bryophytique;0
STRATES_VALUES;50;Recouvrement lichénique;0
STRATES_VALUES;60;Recouvrement algal;0
STRATES_VALUES;70;Recouvrement sol nu;0
STRATES_VALUES;80;(NR) Strate non renseignée/déterminée;0
FREQUENCE_IMMERSION_VALUES ;0  ;                                                                     ;0
FREQUENCE_IMMERSION_VALUES ;7  ;Absente                                                              ;0
FREQUENCE_IMMERSION_VALUES ;8  ;Indéterminée                                                         ;0
FREQUENCE_IMMERSION_VALUES ;9  ;Courte (durée en semaines)                                           ;0
FREQUENCE_IMMERSION_VALUES ;10 ;Longue (durée en mois)                                               ;0
FREQUENCE_IMMERSION_VALUES ;11 ;Permanente                                                           ;0
FREQUENCE_IMMERSION_VALUES ;12 ;Inconnue                                                             ;0
BOIS_MORT_VALUES           ;0  ;                                                                     ;0
BOIS_MORT_VALUES           ;1  ;Oui                                                                  ;0
BOIS_MORT_VALUES           ;2  ;Non                                                                  ;0
EXHAUSTIVITE_VALUES        ;0  ;                                                                     ;0
EXHAUSTIVITE_VALUES        ;1  ;Exhaustif                                                            ;0
EXHAUSTIVITE_VALUES        ;2  ;Partiel                                                              ;0
FORME_HUMUS_VALUES         ;0  ;                                                                     ;0
FORME_HUMUS_VALUES         ;10 ;Mull                                                                 ;0
FORME_HUMUS_VALUES         ;20 ;Moder                                                                ;0
FORME_HUMUS_VALUES         ;30 ;Mor                                                                  ;0
FORME_HUMUS_VALUES         ;40 ;Amphimus                                                             ;0
FORME_HUMUS_VALUES         ;50 ;Anmoor                                                               ;0
FORME_HUMUS_VALUES         ;60 ;Tourbe                                                               ;0
FORME_HUMUS_VALUES         ;11 ;Eumull                                                               ;0
FORME_HUMUS_VALUES         ;12 ;Mésomull                                                             ;0
FORME_HUMUS_VALUES         ;13 ;Oligomull                                                            ;0
FORME_HUMUS_VALUES         ;14 ;Dysmull                                                              ;0
FORME_HUMUS_VALUES         ;15 ;Hydromull                                                            ;0
FORME_HUMUS_VALUES         ;16 ;Peyromull                                                            ;0
FORME_HUMUS_VALUES         ;21 ;Hémimoder                                                            ;0
FORME_HUMUS_VALUES         ;22 ;Eumoder                                                              ;0
FORME_HUMUS_VALUES         ;23 ;Dysmoder                                                             ;0
FORME_HUMUS_VALUES         ;24 ;Hydromoder                                                           ;0
FORME_HUMUS_VALUES         ;25 ;Lithomoder                                                           ;0
FORME_HUMUS_VALUES         ;26 ;Peyromoder                                                           ;0
FORME_HUMUS_VALUES         ;31 ;Hémimor                                                              ;0
FORME_HUMUS_VALUES         ;32 ;Mor                                                                  ;0
FORME_HUMUS_VALUES         ;33 ;Hydromor                                                             ;0
FORME_HUMUS_VALUES         ;34 ;Lithomor                                                             ;0
FORME_HUMUS_VALUES         ;35 ;Peyromor                                                             ;0
FORME_HUMUS_VALUES         ;41 ;Amphimus (Amphimull)                                                 ;0
FORME_HUMUS_VALUES         ;42 ;Litho-amphimus (Tangel)                                              ;0
FORME_HUMUS_VALUES         ;43 ;Peyro-amphimus                                                       ;0
FORME_HUMUS_VALUES         ;17 ;Agri-Mull                                                            ;0
FORME_HUMUS_VALUES         ;27 ;Agri-Moder                                                           ;0
FORME_HUMUS_VALUES         ;36 ;Agri-Mor                                                             ;0
TYPE_PHYSIO_VALUES         ;0  ;                                                                     ;0
TYPE_PHYSIO_VALUES         ;130;Forêt                                                                ;0
TYPE_PHYSIO_VALUES         ;131;Forêt pionnière                                                      ;0
TYPE_PHYSIO_VALUES         ;14 ;Fourré/pré-manteau                                                   ;0
TYPE_PHYSIO_VALUES         ;15 ;Lande                                                                ;0
TYPE_PHYSIO_VALUES         ;16 ;Ourlet/Mégaphorbiaie                                                 ;0
TYPE_PHYSIO_VALUES         ;17 ;Cariçaie / Roselière                                                 ;0
TYPE_PHYSIO_VALUES         ;18 ;Végétation riveraine basse                                           ;0
TYPE_PHYSIO_VALUES         ;190;Prairie                                                              ;0
TYPE_PHYSIO_VALUES         ;191;Prairie pâturée                                                      ;0
TYPE_PHYSIO_VALUES         ;192;Prairie fauchée                                                      ;0
TYPE_PHYSIO_VALUES         ;22 ;Herbier                                                              ;0
TYPE_PHYSIO_VALUES         ;24 ;Friche herbacée                                                      ;0
TYPE_PHYSIO_VALUES         ;20 ;Pelouse                                                              ;0
TYPE_PHYSIO_VALUES         ;30 ;Végétation adventice                                                 ;0
REACTION_HCL_VALUES        ;0  ;                                                                     ;0
REACTION_HCL_VALUES        ;1  ;Absente                                                              ;0
REACTION_HCL_VALUES        ;2  ;Faible                                                               ;0
REACTION_HCL_VALUES        ;3  ;Forte                                                                ;0
OMBRAGE_VALUES             ;0  ;                                                                     ;0
OMBRAGE_VALUES             ;1  ;Lumière                                                              ;0
OMBRAGE_VALUES             ;2  ;Ombre                                                                ;0
OMBRAGE_VALUES             ;3  ;Demi-Ombre                                                           ;0
TYPE_SOL_VALUES            ;0  ;                                                                     ;0
TYPE_SOL_VALUES            ;39 ;Alocrisols                                                           ;0
TYPE_SOL_VALUES            ;40 ;Andosols                                                             ;0
TYPE_SOL_VALUES            ;41 ;Anthroposols                                                         ;0
TYPE_SOL_VALUES            ;42 ;Arénosols                                                            ;0
TYPE_SOL_VALUES            ;43 ;Brunisols                                                            ;0
TYPE_SOL_VALUES            ;44 ;Solums dominés par le calcium et/ou Magnésium                        ;0
TYPE_SOL_VALUES            ;45 ;Chernosols                                                           ;0
TYPE_SOL_VALUES            ;46 ;Colluviosols                                                         ;0
TYPE_SOL_VALUES            ;47 ;Cryosols                                                             ;0
TYPE_SOL_VALUES            ;48 ;Ferrallitosols                                                       ;0
TYPE_SOL_VALUES            ;49 ;Oxydisols                                                            ;0
TYPE_SOL_VALUES;50;Ferruginosols;0
TYPE_SOL_VALUES;51;Fersialsols;0
TYPE_SOL_VALUES;52;Fluviosols;0
TYPE_SOL_VALUES;53;Grisols;0
TYPE_SOL_VALUES;54;Gypsosols;0
TYPE_SOL_VALUES;55;Histosols;0
TYPE_SOL_VALUES;56;Leptismectisols;0
TYPE_SOL_VALUES;57;Lithosols;0
TYPE_SOL_VALUES;58;Luvisols;0
TYPE_SOL_VALUES;59;Nitosols;0
TYPE_SOL_VALUES;60;Organosols;0
TYPE_SOL_VALUES;61;Pélosols;0
TYPE_SOL_VALUES;62;Peyrosols;0
TYPE_SOL_VALUES;63;Phaesols;0
TYPE_SOL_VALUES;64;Planosols;0
TYPE_SOL_VALUES;65;Podzosols;0
TYPE_SOL_VALUES;66;Rankosols;0
TYPE_SOL_VALUES;67;Réductisols;0
TYPE_SOL_VALUES;68;Rédoxisols;0
TYPE_SOL_VALUES;69;Régosols;0
TYPE_SOL_VALUES;70;Salisols;0
TYPE_SOL_VALUES;71;Sodisols;0
TYPE_SOL_VALUES;72;Thalassosols;0
TYPE_SOL_VALUES;73;Thiosols;0
TYPE_SOL_VALUES;74;Sulfatosols;0
TYPE_SOL_VALUES;75;Veracrisols;0
TYPE_SOL_VALUES;76;Vertisols;0
ROCHE_MERE_VALUES;0;;0
ELEMENTS_GROSSIERS_VALUES;0;;0
ELEMENTS_GROSSIERS_VALUES;1;Graviers (0.2-2cm);0
ELEMENTS_GROSSIERS_VALUES;2;Cailloux (2-5cm);0
ELEMENTS_GROSSIERS_VALUES;3;Pierres (5-20cm);0
ELEMENTS_GROSSIERS_VALUES;4;Blocs (>20cm);0
FIABILITE_VALUES;0;;0
FIABILITE_VALUES;1;Bonne;0
FIABILITE_VALUES;2;à confirmer;0
FIABILITE_VALUES;3;Mauvaise;0
NOTE_VALIDE_VALUES;0;;0
NOTE_VALIDE_VALUES;1;En attente de validation;0
NOTE_VALIDE_VALUES;2;Invalidé;0
NOTE_VALIDE_VALUES;3;Invalidé provisoirement;0
NOTE_VALIDE_VALUES;4;Validé provisoirement;0
NOTE_VALIDE_VALUES;5;Validé;0
CARHAB_PHYSIO_VALUES;0;;0
CARHAB_PHYSIO_VALUES;1;test;0
CARHAB_BIOTOPES_VALUES;0;;0
CARHAB_BIOTOPES_VALUES;1;test;0
