<svg width="24" height="25" viewBox="0 0 24 25" fill="none" xmlns="http://www.w3.org/2000/svg">
<mask id="mask0_6_219" style="mask-type:alpha" maskUnits="userSpaceOnUse" x="0" y="0" width="24" height="25">
<path d="M9 22.8H15C20 22.8 22 20.8 22 15.8V9.79999C22 4.79999 20 2.79999 15 2.79999H9C4 2.79999 2 4.79999 2 9.79999V15.8C2 20.8 4 22.8 9 22.8Z" stroke="#292D32" stroke-width="1.5" stroke-linecap="round" stroke-linejoin="round"/>
<path d="M7.33 15.29L9.71 12.2C10.05 11.76 10.68 11.68 11.12 12.02L12.95 13.46C13.39 13.8 14.02 13.72 14.36 13.29L16.67 10.31" stroke="#292D32" stroke-width="1.5" stroke-linecap="round" stroke-linejoin="round"/>
</mask>
<g mask="url(#mask0_6_219)">
<rect y="0.799988" width="25" height="25" fill="#AC8258"/>
</g>
</svg>
