<svg width="24" height="25" viewBox="0 0 24 25" fill="none" xmlns="http://www.w3.org/2000/svg">
<mask id="mask0_770_8184" style="mask-type:alpha" maskUnits="userSpaceOnUse" x="0" y="0" width="24" height="24">
<path d="M4.08004 15.0498L10.6 8.5298C11.37 7.7598 12.63 7.7598 13.4 8.5298L19.92 15.0498" stroke="#292D32" stroke-width="1.5" stroke-miterlimit="10" stroke-linecap="round" stroke-linejoin="round"/>
</mask>
<g mask="url(#mask0_770_8184)">
<rect x="24" y="25" width="25" height="25" transform="rotate(-180 24 25)" fill="#AC8258"/>
</g>
</svg>
