{
    "config": {
        "sheetDataRange": "1:35",
        "sheetList": 2018
    },
    "keyboard": {
        "regName": {
            "text": "Зарегестрировать моё имя",
            "callbackData": "regMyName"
        },
        "whenIWhitnessing": {
            "text": "Посмотреть когда я служу",
            "callbackData": "whenIWhitnessing"
        },
        "goToTable": {
            "text": "Перейти к таблице",
            "callbackData": "goToTable"
        }
    },
    "phrases": {
        "time": {
            "oneDay": "1 день",
            "twoDays": "2 дня",
            "twoHours": "2 часа"
        },
        "common": {
            "whenWhitnessing": "Посмотреть когда я служу",
            "goToTable": "Перейти к таблице",
            "clickToTable": "Нажмите для перехода к таблице",
            "pickOption": "Ты можешь выбрать опцию кликнув на одну из кнопок",
            "helloMessage": "Здравствуй, дорогой брат 😊. \nЭто приложени-бот созданно для автоматического оповещения братьев о пунктах, в которых они должны учавствовать",
            "askQuestions": "Если у тебя возникнут какие-либо вопросы/неполадки/предложения, обращайся к Антону Костюченко или Антону Бабенко",
            "registerYourName": "Чтобы начать пользоваться ботом, нужно нажать кнопку \"Зарегестрировать моё имя\"",
            "writeYourName": "Напиши своё имя так как оно записано в таблице",
            "foundNameInTable": "🎉 Твоё имя найдено в таблице, теперь ты можешь использовать новые опции из меню",
            "notFoundNameInTable": "Твоё имя не найдено в таблице 😕. Попробуй еще раз",
            "notFoundAppointments": "*Назначения на ближайшие встречи не найдены*",
            "notFoundCloserAppointments": "*У тебя нет назначений на ближайшую встречу*"
        }
    },
    "events": {
        "school": {
            "name": "Школа Теократического Служения",
            "day": 1,
            "hour": 19
        },
        "public": {
            "name": "Публичная встреча",
            "day": 6,
            "hour": 11
        },
        "unknown": "Неизвестная встреча"
    }
}
