-- Merging decision tree log ---
manifest
ADDED from E:\aws\android\app\src\main\AndroidManifest.xml:1:1-34:12
INJECTED from E:\aws\android\app\src\main\AndroidManifest.xml:1:1-34:12
INJECTED from E:\aws\android\app\src\main\AndroidManifest.xml:1:1-34:12
INJECTED from E:\aws\android\app\src\main\AndroidManifest.xml:1:1-34:12
MERGED from E:\aws\android\app\src\main\AndroidManifest.xml:1:1-34:12
MERGED from [:path_provider] E:\aws\build\path_provider\intermediates\library_manifest\debug\AndroidManifest.xml:2:1-7:12
MERGED from [:path_provider_macos] E:\aws\build\path_provider_macos\intermediates\library_manifest\debug\AndroidManifest.xml:2:1-7:12
MERGED from [:video_player] E:\aws\build\video_player\intermediates\library_manifest\debug\AndroidManifest.xml:2:1-7:12
MERGED from [:image_picker] E:\aws\build\image_picker\intermediates\library_manifest\debug\AndroidManifest.xml:2:1-22:12
MERGED from [:flutter_plugin_android_lifecycle] E:\aws\build\flutter_plugin_android_lifecycle\intermediates\library_manifest\debug\AndroidManifest.xml:2:1-7:12
MERGED from [:video_player_web] E:\aws\build\video_player_web\intermediates\library_manifest\debug\AndroidManifest.xml:2:1-7:12
MERGED from [:camera] E:\aws\build\camera\intermediates\library_manifest\debug\AndroidManifest.xml:2:1-10:12
MERGED from [androidx.fragment:fragment:1.0.0] C:\Users\nour\.gradle\caches\transforms-2\files-2.1\b8b68c04ee72209a3beca37e17f7088d\fragment-1.0.0\AndroidManifest.xml:17:1-22:12
MERGED from [androidx.legacy:legacy-support-core-ui:1.0.0] C:\Users\nour\.gradle\caches\transforms-2\files-2.1\f046f38cf99e9cbe4891b184ce64db19\legacy-support-core-ui-1.0.0\AndroidManifest.xml:17:1-22:12
MERGED from [androidx.legacy:legacy-support-core-utils:1.0.0] C:\Users\nour\.gradle\caches\transforms-2\files-2.1\0f0610cdcf96e6cfa9529b6a3246e3f6\legacy-support-core-utils-1.0.0\AndroidManifest.xml:17:1-22:12
MERGED from [androidx.loader:loader:1.0.0] C:\Users\nour\.gradle\caches\transforms-2\files-2.1\e1bbce6b0d79e8479b70e7bd729bb743\loader-1.0.0\AndroidManifest.xml:17:1-22:12
MERGED from [androidx.viewpager:viewpager:1.0.0] C:\Users\nour\.gradle\caches\transforms-2\files-2.1\28d99d5113324aa067757f8ca41a426f\viewpager-1.0.0\AndroidManifest.xml:17:1-22:12
MERGED from [androidx.coordinatorlayout:coordinatorlayout:1.0.0] C:\Users\nour\.gradle\caches\transforms-2\files-2.1\ae13efc3dbae5c9ee58d4933337fcd21\coordinatorlayout-1.0.0\AndroidManifest.xml:17:1-22:12
MERGED from [androidx.drawerlayout:drawerlayout:1.0.0] C:\Users\nour\.gradle\caches\transforms-2\files-2.1\5bfbe01745d2a29d4e7cd137b17143f4\drawerlayout-1.0.0\AndroidManifest.xml:17:1-22:12
MERGED from [androidx.slidingpanelayout:slidingpanelayout:1.0.0] C:\Users\nour\.gradle\caches\transforms-2\files-2.1\b046e47c43be2b85609c7f97cccc722e\slidingpanelayout-1.0.0\AndroidManifest.xml:17:1-22:12
MERGED from [androidx.customview:customview:1.0.0] C:\Users\nour\.gradle\caches\transforms-2\files-2.1\ef0bef029ab70f5fb29de019060cf5fd\customview-1.0.0\AndroidManifest.xml:17:1-22:12
MERGED from [androidx.swiperefreshlayout:swiperefreshlayout:1.0.0] C:\Users\nour\.gradle\caches\transforms-2\files-2.1\5fdf5da548a469ca3cc39dc72a350a99\swiperefreshlayout-1.0.0\AndroidManifest.xml:17:1-22:12
MERGED from [androidx.asynclayoutinflater:asynclayoutinflater:1.0.0] C:\Users\nour\.gradle\caches\transforms-2\files-2.1\1403af03ba6e6e95b13bf5808de0f892\asynclayoutinflater-1.0.0\AndroidManifest.xml:17:1-22:12
MERGED from [androidx.core:core:1.0.2] C:\Users\nour\.gradle\caches\transforms-2\files-2.1\fecc98e05c7ccd4a0eedf7cff343a233\core-1.0.2\AndroidManifest.xml:17:1-24:12
MERGED from [androidx.lifecycle:lifecycle-runtime:2.0.0] C:\Users\nour\.gradle\caches\transforms-2\files-2.1\6e38f4e9d5bd10f4c7f28aa7b63ad3a1\lifecycle-runtime-2.0.0\AndroidManifest.xml:17:1-22:12
MERGED from [androidx.lifecycle:lifecycle-livedata:2.0.0] C:\Users\nour\.gradle\caches\transforms-2\files-2.1\23edc849475fdda61367cb003f9b9f93\lifecycle-livedata-2.0.0\AndroidManifest.xml:17:1-22:12
MERGED from [androidx.lifecycle:lifecycle-livedata-core:2.0.0] C:\Users\nour\.gradle\caches\transforms-2\files-2.1\79f9d65ef8b1c716310f666473a689a7\lifecycle-livedata-core-2.0.0\AndroidManifest.xml:17:1-22:12
MERGED from [com.google.android.exoplayer:exoplayer-hls:2.9.6] C:\Users\nour\.gradle\caches\transforms-2\files-2.1\3378fd168f1b05d8e00b2e538e504b49\jetified-exoplayer-hls-2.9.6\AndroidManifest.xml:17:1-24:12
MERGED from [com.google.android.exoplayer:exoplayer-dash:2.9.6] C:\Users\nour\.gradle\caches\transforms-2\files-2.1\baf6aae5e6a927bea49414682b32422c\jetified-exoplayer-dash-2.9.6\AndroidManifest.xml:17:1-24:12
MERGED from [com.google.android.exoplayer:exoplayer-smoothstreaming:2.9.6] C:\Users\nour\.gradle\caches\transforms-2\files-2.1\ea0c82126f635c82085a44aceb422eb8\jetified-exoplayer-smoothstreaming-2.9.6\AndroidManifest.xml:17:1-24:12
MERGED from [com.google.android.exoplayer:exoplayer-core:2.9.6] C:\Users\nour\.gradle\caches\transforms-2\files-2.1\9fe85e7e9556a049deb11f55c99390bc\jetified-exoplayer-core-2.9.6\AndroidManifest.xml:17:1-26:12
MERGED from [androidx.arch.core:core-runtime:2.0.0] C:\Users\nour\.gradle\caches\transforms-2\files-2.1\077300052aa327ee6fc9bbb0ce309b24\core-runtime-2.0.0\AndroidManifest.xml:17:1-22:12
MERGED from [androidx.lifecycle:lifecycle-viewmodel:2.0.0] C:\Users\nour\.gradle\caches\transforms-2\files-2.1\cf738d4606a2d10adda01983ea645814\lifecycle-viewmodel-2.0.0\AndroidManifest.xml:17:1-22:12
MERGED from [androidx.versionedparcelable:versionedparcelable:1.0.0] C:\Users\nour\.gradle\caches\transforms-2\files-2.1\52d4fecae8c1eb4103beef9198e64f51\versionedparcelable-1.0.0\AndroidManifest.xml:17:1-25:12
MERGED from [androidx.interpolator:interpolator:1.0.0] C:\Users\nour\.gradle\caches\transforms-2\files-2.1\2ca8bc49d3a28fb6fa3bddf429b143ba\interpolator-1.0.0\AndroidManifest.xml:17:1-22:12
MERGED from [androidx.cursoradapter:cursoradapter:1.0.0] C:\Users\nour\.gradle\caches\transforms-2\files-2.1\fefdd83516e8eeb5097956f9d9af4b04\cursoradapter-1.0.0\AndroidManifest.xml:17:1-22:12
MERGED from [androidx.documentfile:documentfile:1.0.0] C:\Users\nour\.gradle\caches\transforms-2\files-2.1\35bca835e72502cae5588ee7a59cf4b0\documentfile-1.0.0\AndroidManifest.xml:17:1-22:12
MERGED from [androidx.localbroadcastmanager:localbroadcastmanager:1.0.0] C:\Users\nour\.gradle\caches\transforms-2\files-2.1\bce9999f881bb3993a5b24e08740cbbf\localbroadcastmanager-1.0.0\AndroidManifest.xml:17:1-22:12
MERGED from [androidx.print:print:1.0.0] C:\Users\nour\.gradle\caches\transforms-2\files-2.1\6b1132090a8a1ffc60b82d3452ca52ad\print-1.0.0\AndroidManifest.xml:17:1-22:12
INJECTED from E:\aws\android\app\src\debug\AndroidManifest.xml:1:1-7:12
INJECTED from E:\aws\android\app\src\debug\AndroidManifest.xml:1:1-7:12
INJECTED from E:\aws\android\app\src\debug\AndroidManifest.xml:1:1-7:12
	package
		ADDED from E:\aws\android\app\src\main\AndroidManifest.xml:2:5-35
		INJECTED from E:\aws\android\app\src\main\AndroidManifest.xml
		INJECTED from E:\aws\android\app\src\debug\AndroidManifest.xml
	android:versionName
		INJECTED from E:\aws\android\app\src\main\AndroidManifest.xml
		ADDED from E:\aws\android\app\src\main\AndroidManifest.xml:1:1-34:12
		INJECTED from E:\aws\android\app\src\debug\AndroidManifest.xml
	android:versionCode
		INJECTED from E:\aws\android\app\src\main\AndroidManifest.xml
		ADDED from E:\aws\android\app\src\main\AndroidManifest.xml:1:1-34:12
		INJECTED from E:\aws\android\app\src\debug\AndroidManifest.xml
	xmlns:android
		ADDED from E:\aws\android\app\src\main\AndroidManifest.xml:1:11-69
uses-permission#android.permission.INTERNET
ADDED from E:\aws\android\app\src\main\AndroidManifest.xml:8:5-67
MERGED from E:\aws\android\app\src\main\AndroidManifest.xml:8:5-67
MERGED from E:\aws\android\app\src\main\AndroidManifest.xml:8:5-67
	android:name
		ADDED from E:\aws\android\app\src\main\AndroidManifest.xml:8:22-64
uses-permission#android.permission.CAMERA
ADDED from E:\aws\android\app\src\main\AndroidManifest.xml:9:5-65
MERGED from [:camera] E:\aws\build\camera\intermediates\library_manifest\debug\AndroidManifest.xml:7:5-65
MERGED from [:camera] E:\aws\build\camera\intermediates\library_manifest\debug\AndroidManifest.xml:7:5-65
	android:name
		ADDED from E:\aws\android\app\src\main\AndroidManifest.xml:9:22-62
application
ADDED from E:\aws\android\app\src\main\AndroidManifest.xml:10:5-33:19
MERGED from [:image_picker] E:\aws\build\image_picker\intermediates\library_manifest\debug\AndroidManifest.xml:10:5-20:19
MERGED from [:image_picker] E:\aws\build\image_picker\intermediates\library_manifest\debug\AndroidManifest.xml:10:5-20:19
MERGED from [androidx.core:core:1.0.2] C:\Users\nour\.gradle\caches\transforms-2\files-2.1\fecc98e05c7ccd4a0eedf7cff343a233\core-1.0.2\AndroidManifest.xml:22:5-89
MERGED from [androidx.core:core:1.0.2] C:\Users\nour\.gradle\caches\transforms-2\files-2.1\fecc98e05c7ccd4a0eedf7cff343a233\core-1.0.2\AndroidManifest.xml:22:5-89
MERGED from [androidx.versionedparcelable:versionedparcelable:1.0.0] C:\Users\nour\.gradle\caches\transforms-2\files-2.1\52d4fecae8c1eb4103beef9198e64f51\versionedparcelable-1.0.0\AndroidManifest.xml:22:5-23:19
MERGED from [androidx.versionedparcelable:versionedparcelable:1.0.0] C:\Users\nour\.gradle\caches\transforms-2\files-2.1\52d4fecae8c1eb4103beef9198e64f51\versionedparcelable-1.0.0\AndroidManifest.xml:22:5-23:19
	android:appComponentFactory
		ADDED from [androidx.core:core:1.0.2] C:\Users\nour\.gradle\caches\transforms-2\files-2.1\fecc98e05c7ccd4a0eedf7cff343a233\core-1.0.2\AndroidManifest.xml:22:18-86
	android:label
		ADDED from E:\aws\android\app\src\main\AndroidManifest.xml:12:9-36
	android:icon
		ADDED from E:\aws\android\app\src\main\AndroidManifest.xml:13:9-43
	android:name
		ADDED from E:\aws\android\app\src\main\AndroidManifest.xml:11:9-57
activity#com.test.flutter_app.MainActivity
ADDED from E:\aws\android\app\src\main\AndroidManifest.xml:14:9-32:20
	android:launchMode
		ADDED from E:\aws\android\app\src\main\AndroidManifest.xml:16:13-43
	android:hardwareAccelerated
		ADDED from E:\aws\android\app\src\main\AndroidManifest.xml:19:13-47
	android:windowSoftInputMode
		ADDED from E:\aws\android\app\src\main\AndroidManifest.xml:20:13-55
	android:configChanges
		ADDED from E:\aws\android\app\src\main\AndroidManifest.xml:18:13-163
	android:theme
		ADDED from E:\aws\android\app\src\main\AndroidManifest.xml:17:13-47
	android:name
		ADDED from E:\aws\android\app\src\main\AndroidManifest.xml:15:13-41
meta-data#io.flutter.app.android.SplashScreenUntilFirstFrame
ADDED from E:\aws\android\app\src\main\AndroidManifest.xml:25:13-27:40
	android:value
		ADDED from E:\aws\android\app\src\main\AndroidManifest.xml:27:17-37
	android:name
		ADDED from E:\aws\android\app\src\main\AndroidManifest.xml:26:17-82
intent-filter#action:name:android.intent.action.MAIN+category:name:android.intent.category.LAUNCHER
ADDED from E:\aws\android\app\src\main\AndroidManifest.xml:28:13-31:29
action#android.intent.action.MAIN
ADDED from E:\aws\android\app\src\main\AndroidManifest.xml:29:17-68
	android:name
		ADDED from E:\aws\android\app\src\main\AndroidManifest.xml:29:25-66
category#android.intent.category.LAUNCHER
ADDED from E:\aws\android\app\src\main\AndroidManifest.xml:30:17-76
	android:name
		ADDED from E:\aws\android\app\src\main\AndroidManifest.xml:30:27-74
uses-sdk
INJECTED from E:\aws\android\app\src\main\AndroidManifest.xml reason: use-sdk injection requested
INJECTED from E:\aws\android\app\src\main\AndroidManifest.xml
INJECTED from E:\aws\android\app\src\main\AndroidManifest.xml
MERGED from [:path_provider] E:\aws\build\path_provider\intermediates\library_manifest\debug\AndroidManifest.xml:5:5-44
MERGED from [:path_provider] E:\aws\build\path_provider\intermediates\library_manifest\debug\AndroidManifest.xml:5:5-44
MERGED from [:path_provider_macos] E:\aws\build\path_provider_macos\intermediates\library_manifest\debug\AndroidManifest.xml:5:5-44
MERGED from [:path_provider_macos] E:\aws\build\path_provider_macos\intermediates\library_manifest\debug\AndroidManifest.xml:5:5-44
MERGED from [:video_player] E:\aws\build\video_player\intermediates\library_manifest\debug\AndroidManifest.xml:5:5-44
MERGED from [:video_player] E:\aws\build\video_player\intermediates\library_manifest\debug\AndroidManifest.xml:5:5-44
MERGED from [:image_picker] E:\aws\build\image_picker\intermediates\library_manifest\debug\AndroidManifest.xml:5:5-44
MERGED from [:image_picker] E:\aws\build\image_picker\intermediates\library_manifest\debug\AndroidManifest.xml:5:5-44
MERGED from [:flutter_plugin_android_lifecycle] E:\aws\build\flutter_plugin_android_lifecycle\intermediates\library_manifest\debug\AndroidManifest.xml:5:5-44
MERGED from [:flutter_plugin_android_lifecycle] E:\aws\build\flutter_plugin_android_lifecycle\intermediates\library_manifest\debug\AndroidManifest.xml:5:5-44
MERGED from [:video_player_web] E:\aws\build\video_player_web\intermediates\library_manifest\debug\AndroidManifest.xml:5:5-44
MERGED from [:video_player_web] E:\aws\build\video_player_web\intermediates\library_manifest\debug\AndroidManifest.xml:5:5-44
MERGED from [:camera] E:\aws\build\camera\intermediates\library_manifest\debug\AndroidManifest.xml:5:5-44
MERGED from [:camera] E:\aws\build\camera\intermediates\library_manifest\debug\AndroidManifest.xml:5:5-44
MERGED from [androidx.fragment:fragment:1.0.0] C:\Users\nour\.gradle\caches\transforms-2\files-2.1\b8b68c04ee72209a3beca37e17f7088d\fragment-1.0.0\AndroidManifest.xml:20:5-44
MERGED from [androidx.fragment:fragment:1.0.0] C:\Users\nour\.gradle\caches\transforms-2\files-2.1\b8b68c04ee72209a3beca37e17f7088d\fragment-1.0.0\AndroidManifest.xml:20:5-44
MERGED from [androidx.legacy:legacy-support-core-ui:1.0.0] C:\Users\nour\.gradle\caches\transforms-2\files-2.1\f046f38cf99e9cbe4891b184ce64db19\legacy-support-core-ui-1.0.0\AndroidManifest.xml:20:5-44
MERGED from [androidx.legacy:legacy-support-core-ui:1.0.0] C:\Users\nour\.gradle\caches\transforms-2\files-2.1\f046f38cf99e9cbe4891b184ce64db19\legacy-support-core-ui-1.0.0\AndroidManifest.xml:20:5-44
MERGED from [androidx.legacy:legacy-support-core-utils:1.0.0] C:\Users\nour\.gradle\caches\transforms-2\files-2.1\0f0610cdcf96e6cfa9529b6a3246e3f6\legacy-support-core-utils-1.0.0\AndroidManifest.xml:20:5-44
MERGED from [androidx.legacy:legacy-support-core-utils:1.0.0] C:\Users\nour\.gradle\caches\transforms-2\files-2.1\0f0610cdcf96e6cfa9529b6a3246e3f6\legacy-support-core-utils-1.0.0\AndroidManifest.xml:20:5-44
MERGED from [androidx.loader:loader:1.0.0] C:\Users\nour\.gradle\caches\transforms-2\files-2.1\e1bbce6b0d79e8479b70e7bd729bb743\loader-1.0.0\AndroidManifest.xml:20:5-44
MERGED from [androidx.loader:loader:1.0.0] C:\Users\nour\.gradle\caches\transforms-2\files-2.1\e1bbce6b0d79e8479b70e7bd729bb743\loader-1.0.0\AndroidManifest.xml:20:5-44
MERGED from [androidx.viewpager:viewpager:1.0.0] C:\Users\nour\.gradle\caches\transforms-2\files-2.1\28d99d5113324aa067757f8ca41a426f\viewpager-1.0.0\AndroidManifest.xml:20:5-44
MERGED from [androidx.viewpager:viewpager:1.0.0] C:\Users\nour\.gradle\caches\transforms-2\files-2.1\28d99d5113324aa067757f8ca41a426f\viewpager-1.0.0\AndroidManifest.xml:20:5-44
MERGED from [androidx.coordinatorlayout:coordinatorlayout:1.0.0] C:\Users\nour\.gradle\caches\transforms-2\files-2.1\ae13efc3dbae5c9ee58d4933337fcd21\coordinatorlayout-1.0.0\AndroidManifest.xml:20:5-44
MERGED from [androidx.coordinatorlayout:coordinatorlayout:1.0.0] C:\Users\nour\.gradle\caches\transforms-2\files-2.1\ae13efc3dbae5c9ee58d4933337fcd21\coordinatorlayout-1.0.0\AndroidManifest.xml:20:5-44
MERGED from [androidx.drawerlayout:drawerlayout:1.0.0] C:\Users\nour\.gradle\caches\transforms-2\files-2.1\5bfbe01745d2a29d4e7cd137b17143f4\drawerlayout-1.0.0\AndroidManifest.xml:20:5-44
MERGED from [androidx.drawerlayout:drawerlayout:1.0.0] C:\Users\nour\.gradle\caches\transforms-2\files-2.1\5bfbe01745d2a29d4e7cd137b17143f4\drawerlayout-1.0.0\AndroidManifest.xml:20:5-44
MERGED from [androidx.slidingpanelayout:slidingpanelayout:1.0.0] C:\Users\nour\.gradle\caches\transforms-2\files-2.1\b046e47c43be2b85609c7f97cccc722e\slidingpanelayout-1.0.0\AndroidManifest.xml:20:5-44
MERGED from [androidx.slidingpanelayout:slidingpanelayout:1.0.0] C:\Users\nour\.gradle\caches\transforms-2\files-2.1\b046e47c43be2b85609c7f97cccc722e\slidingpanelayout-1.0.0\AndroidManifest.xml:20:5-44
MERGED from [androidx.customview:customview:1.0.0] C:\Users\nour\.gradle\caches\transforms-2\files-2.1\ef0bef029ab70f5fb29de019060cf5fd\customview-1.0.0\AndroidManifest.xml:20:5-44
MERGED from [androidx.customview:customview:1.0.0] C:\Users\nour\.gradle\caches\transforms-2\files-2.1\ef0bef029ab70f5fb29de019060cf5fd\customview-1.0.0\AndroidManifest.xml:20:5-44
MERGED from [androidx.swiperefreshlayout:swiperefreshlayout:1.0.0] C:\Users\nour\.gradle\caches\transforms-2\files-2.1\5fdf5da548a469ca3cc39dc72a350a99\swiperefreshlayout-1.0.0\AndroidManifest.xml:20:5-44
MERGED from [androidx.swiperefreshlayout:swiperefreshlayout:1.0.0] C:\Users\nour\.gradle\caches\transforms-2\files-2.1\5fdf5da548a469ca3cc39dc72a350a99\swiperefreshlayout-1.0.0\AndroidManifest.xml:20:5-44
MERGED from [androidx.asynclayoutinflater:asynclayoutinflater:1.0.0] C:\Users\nour\.gradle\caches\transforms-2\files-2.1\1403af03ba6e6e95b13bf5808de0f892\asynclayoutinflater-1.0.0\AndroidManifest.xml:20:5-44
MERGED from [androidx.asynclayoutinflater:asynclayoutinflater:1.0.0] C:\Users\nour\.gradle\caches\transforms-2\files-2.1\1403af03ba6e6e95b13bf5808de0f892\asynclayoutinflater-1.0.0\AndroidManifest.xml:20:5-44
MERGED from [androidx.core:core:1.0.2] C:\Users\nour\.gradle\caches\transforms-2\files-2.1\fecc98e05c7ccd4a0eedf7cff343a233\core-1.0.2\AndroidManifest.xml:20:5-44
MERGED from [androidx.core:core:1.0.2] C:\Users\nour\.gradle\caches\transforms-2\files-2.1\fecc98e05c7ccd4a0eedf7cff343a233\core-1.0.2\AndroidManifest.xml:20:5-44
MERGED from [androidx.lifecycle:lifecycle-runtime:2.0.0] C:\Users\nour\.gradle\caches\transforms-2\files-2.1\6e38f4e9d5bd10f4c7f28aa7b63ad3a1\lifecycle-runtime-2.0.0\AndroidManifest.xml:20:5-44
MERGED from [androidx.lifecycle:lifecycle-runtime:2.0.0] C:\Users\nour\.gradle\caches\transforms-2\files-2.1\6e38f4e9d5bd10f4c7f28aa7b63ad3a1\lifecycle-runtime-2.0.0\AndroidManifest.xml:20:5-44
MERGED from [androidx.lifecycle:lifecycle-livedata:2.0.0] C:\Users\nour\.gradle\caches\transforms-2\files-2.1\23edc849475fdda61367cb003f9b9f93\lifecycle-livedata-2.0.0\AndroidManifest.xml:20:5-44
MERGED from [androidx.lifecycle:lifecycle-livedata:2.0.0] C:\Users\nour\.gradle\caches\transforms-2\files-2.1\23edc849475fdda61367cb003f9b9f93\lifecycle-livedata-2.0.0\AndroidManifest.xml:20:5-44
MERGED from [androidx.lifecycle:lifecycle-livedata-core:2.0.0] C:\Users\nour\.gradle\caches\transforms-2\files-2.1\79f9d65ef8b1c716310f666473a689a7\lifecycle-livedata-core-2.0.0\AndroidManifest.xml:20:5-44
MERGED from [androidx.lifecycle:lifecycle-livedata-core:2.0.0] C:\Users\nour\.gradle\caches\transforms-2\files-2.1\79f9d65ef8b1c716310f666473a689a7\lifecycle-livedata-core-2.0.0\AndroidManifest.xml:20:5-44
MERGED from [com.google.android.exoplayer:exoplayer-hls:2.9.6] C:\Users\nour\.gradle\caches\transforms-2\files-2.1\3378fd168f1b05d8e00b2e538e504b49\jetified-exoplayer-hls-2.9.6\AndroidManifest.xml:20:5-22:41
MERGED from [com.google.android.exoplayer:exoplayer-hls:2.9.6] C:\Users\nour\.gradle\caches\transforms-2\files-2.1\3378fd168f1b05d8e00b2e538e504b49\jetified-exoplayer-hls-2.9.6\AndroidManifest.xml:20:5-22:41
MERGED from [com.google.android.exoplayer:exoplayer-dash:2.9.6] C:\Users\nour\.gradle\caches\transforms-2\files-2.1\baf6aae5e6a927bea49414682b32422c\jetified-exoplayer-dash-2.9.6\AndroidManifest.xml:20:5-22:41
MERGED from [com.google.android.exoplayer:exoplayer-dash:2.9.6] C:\Users\nour\.gradle\caches\transforms-2\files-2.1\baf6aae5e6a927bea49414682b32422c\jetified-exoplayer-dash-2.9.6\AndroidManifest.xml:20:5-22:41
MERGED from [com.google.android.exoplayer:exoplayer-smoothstreaming:2.9.6] C:\Users\nour\.gradle\caches\transforms-2\files-2.1\ea0c82126f635c82085a44aceb422eb8\jetified-exoplayer-smoothstreaming-2.9.6\AndroidManifest.xml:20:5-22:41
MERGED from [com.google.android.exoplayer:exoplayer-smoothstreaming:2.9.6] C:\Users\nour\.gradle\caches\transforms-2\files-2.1\ea0c82126f635c82085a44aceb422eb8\jetified-exoplayer-smoothstreaming-2.9.6\AndroidManifest.xml:20:5-22:41
MERGED from [com.google.android.exoplayer:exoplayer-core:2.9.6] C:\Users\nour\.gradle\caches\transforms-2\files-2.1\9fe85e7e9556a049deb11f55c99390bc\jetified-exoplayer-core-2.9.6\AndroidManifest.xml:20:5-22:41
MERGED from [com.google.android.exoplayer:exoplayer-core:2.9.6] C:\Users\nour\.gradle\caches\transforms-2\files-2.1\9fe85e7e9556a049deb11f55c99390bc\jetified-exoplayer-core-2.9.6\AndroidManifest.xml:20:5-22:41
MERGED from [androidx.arch.core:core-runtime:2.0.0] C:\Users\nour\.gradle\caches\transforms-2\files-2.1\077300052aa327ee6fc9bbb0ce309b24\core-runtime-2.0.0\AndroidManifest.xml:20:5-44
MERGED from [androidx.arch.core:core-runtime:2.0.0] C:\Users\nour\.gradle\caches\transforms-2\files-2.1\077300052aa327ee6fc9bbb0ce309b24\core-runtime-2.0.0\AndroidManifest.xml:20:5-44
MERGED from [androidx.lifecycle:lifecycle-viewmodel:2.0.0] C:\Users\nour\.gradle\caches\transforms-2\files-2.1\cf738d4606a2d10adda01983ea645814\lifecycle-viewmodel-2.0.0\AndroidManifest.xml:20:5-44
MERGED from [androidx.lifecycle:lifecycle-viewmodel:2.0.0] C:\Users\nour\.gradle\caches\transforms-2\files-2.1\cf738d4606a2d10adda01983ea645814\lifecycle-viewmodel-2.0.0\AndroidManifest.xml:20:5-44
MERGED from [androidx.versionedparcelable:versionedparcelable:1.0.0] C:\Users\nour\.gradle\caches\transforms-2\files-2.1\52d4fecae8c1eb4103beef9198e64f51\versionedparcelable-1.0.0\AndroidManifest.xml:20:5-44
MERGED from [androidx.versionedparcelable:versionedparcelable:1.0.0] C:\Users\nour\.gradle\caches\transforms-2\files-2.1\52d4fecae8c1eb4103beef9198e64f51\versionedparcelable-1.0.0\AndroidManifest.xml:20:5-44
MERGED from [androidx.interpolator:interpolator:1.0.0] C:\Users\nour\.gradle\caches\transforms-2\files-2.1\2ca8bc49d3a28fb6fa3bddf429b143ba\interpolator-1.0.0\AndroidManifest.xml:20:5-44
MERGED from [androidx.interpolator:interpolator:1.0.0] C:\Users\nour\.gradle\caches\transforms-2\files-2.1\2ca8bc49d3a28fb6fa3bddf429b143ba\interpolator-1.0.0\AndroidManifest.xml:20:5-44
MERGED from [androidx.cursoradapter:cursoradapter:1.0.0] C:\Users\nour\.gradle\caches\transforms-2\files-2.1\fefdd83516e8eeb5097956f9d9af4b04\cursoradapter-1.0.0\AndroidManifest.xml:20:5-44
MERGED from [androidx.cursoradapter:cursoradapter:1.0.0] C:\Users\nour\.gradle\caches\transforms-2\files-2.1\fefdd83516e8eeb5097956f9d9af4b04\cursoradapter-1.0.0\AndroidManifest.xml:20:5-44
MERGED from [androidx.documentfile:documentfile:1.0.0] C:\Users\nour\.gradle\caches\transforms-2\files-2.1\35bca835e72502cae5588ee7a59cf4b0\documentfile-1.0.0\AndroidManifest.xml:20:5-44
MERGED from [androidx.documentfile:documentfile:1.0.0] C:\Users\nour\.gradle\caches\transforms-2\files-2.1\35bca835e72502cae5588ee7a59cf4b0\documentfile-1.0.0\AndroidManifest.xml:20:5-44
MERGED from [androidx.localbroadcastmanager:localbroadcastmanager:1.0.0] C:\Users\nour\.gradle\caches\transforms-2\files-2.1\bce9999f881bb3993a5b24e08740cbbf\localbroadcastmanager-1.0.0\AndroidManifest.xml:20:5-44
MERGED from [androidx.localbroadcastmanager:localbroadcastmanager:1.0.0] C:\Users\nour\.gradle\caches\transforms-2\files-2.1\bce9999f881bb3993a5b24e08740cbbf\localbroadcastmanager-1.0.0\AndroidManifest.xml:20:5-44
MERGED from [androidx.print:print:1.0.0] C:\Users\nour\.gradle\caches\transforms-2\files-2.1\6b1132090a8a1ffc60b82d3452ca52ad\print-1.0.0\AndroidManifest.xml:20:5-44
MERGED from [androidx.print:print:1.0.0] C:\Users\nour\.gradle\caches\transforms-2\files-2.1\6b1132090a8a1ffc60b82d3452ca52ad\print-1.0.0\AndroidManifest.xml:20:5-44
INJECTED from E:\aws\android\app\src\debug\AndroidManifest.xml
INJECTED from E:\aws\android\app\src\debug\AndroidManifest.xml
	android:targetSdkVersion
		INJECTED from E:\aws\android\app\src\main\AndroidManifest.xml
		INJECTED from E:\aws\android\app\src\debug\AndroidManifest.xml
	android:minSdkVersion
		INJECTED from E:\aws\android\app\src\main\AndroidManifest.xml
		INJECTED from E:\aws\android\app\src\debug\AndroidManifest.xml
uses-permission#android.permission.READ_EXTERNAL_STORAGE
ADDED from [:image_picker] E:\aws\build\image_picker\intermediates\library_manifest\debug\AndroidManifest.xml:7:5-80
	android:name
		ADDED from [:image_picker] E:\aws\build\image_picker\intermediates\library_manifest\debug\AndroidManifest.xml:7:22-77
uses-permission#android.permission.WRITE_EXTERNAL_STORAGE
ADDED from [:image_picker] E:\aws\build\image_picker\intermediates\library_manifest\debug\AndroidManifest.xml:8:5-81
	android:name
		ADDED from [:image_picker] E:\aws\build\image_picker\intermediates\library_manifest\debug\AndroidManifest.xml:8:22-78
provider#io.flutter.plugins.imagepicker.ImagePickerFileProvider
ADDED from [:image_picker] E:\aws\build\image_picker\intermediates\library_manifest\debug\AndroidManifest.xml:11:9-19:20
	android:grantUriPermissions
		ADDED from [:image_picker] E:\aws\build\image_picker\intermediates\library_manifest\debug\AndroidManifest.xml:15:13-47
	android:authorities
		ADDED from [:image_picker] E:\aws\build\image_picker\intermediates\library_manifest\debug\AndroidManifest.xml:13:13-74
	android:exported
		ADDED from [:image_picker] E:\aws\build\image_picker\intermediates\library_manifest\debug\AndroidManifest.xml:14:13-37
	android:name
		ADDED from [:image_picker] E:\aws\build\image_picker\intermediates\library_manifest\debug\AndroidManifest.xml:12:13-82
meta-data#android.support.FILE_PROVIDER_PATHS
ADDED from [:image_picker] E:\aws\build\image_picker\intermediates\library_manifest\debug\AndroidManifest.xml:16:13-18:75
	android:resource
		ADDED from [:image_picker] E:\aws\build\image_picker\intermediates\library_manifest\debug\AndroidManifest.xml:18:17-72
	android:name
		ADDED from [:image_picker] E:\aws\build\image_picker\intermediates\library_manifest\debug\AndroidManifest.xml:17:17-67
uses-permission#android.permission.RECORD_AUDIO
ADDED from [:camera] E:\aws\build\camera\intermediates\library_manifest\debug\AndroidManifest.xml:8:5-71
	android:name
		ADDED from [:camera] E:\aws\build\camera\intermediates\library_manifest\debug\AndroidManifest.xml:8:22-68
uses-permission#android.permission.ACCESS_NETWORK_STATE
ADDED from [com.google.android.exoplayer:exoplayer-core:2.9.6] C:\Users\nour\.gradle\caches\transforms-2\files-2.1\9fe85e7e9556a049deb11f55c99390bc\jetified-exoplayer-core-2.9.6\AndroidManifest.xml:24:5-79
	android:name
		ADDED from [com.google.android.exoplayer:exoplayer-core:2.9.6] C:\Users\nour\.gradle\caches\transforms-2\files-2.1\9fe85e7e9556a049deb11f55c99390bc\jetified-exoplayer-core-2.9.6\AndroidManifest.xml:24:22-76
